+++ --- Applying local submodule patches --- +++
/var/lib/jenkins/workspace/DevOps-test2/platform-broadcom/patches/sonic-utilities.patch:703: trailing whitespace.
import click
/var/lib/jenkins/workspace/DevOps-test2/platform-broadcom/patches/sonic-utilities.patch:704: trailing whitespace.
import utilities_common.cli as clicommon
/var/lib/jenkins/workspace/DevOps-test2/platform-broadcom/patches/sonic-utilities.patch:705: trailing whitespace.
import utilities_common.multi_asic as multi_asic_util
/var/lib/jenkins/workspace/DevOps-test2/platform-broadcom/patches/sonic-utilities.patch:706: trailing whitespace.
from sonic_py_common import multi_asic
/var/lib/jenkins/workspace/DevOps-test2/platform-broadcom/patches/sonic-utilities.patch:707: trailing whitespace.
from swsscommon.swsscommon import SonicV2Connector, ConfigDBConnector
warning: squelched 3487 whitespace errors
warning: 3492 lines add whitespace errors.
applied: sonic-utilities
/var/lib/jenkins/workspace/DevOps-test2/platform-broadcom/patches/sonic-swss.patch:88: trailing whitespace.
/var/lib/jenkins/workspace/DevOps-test2/platform-broadcom/patches/sonic-swss.patch:105: trailing whitespace.
SWSS_LOG_NOTICE("Thi DEBUG [AclOrch]: Force supporting Enum value %d for dTel Action ID: 0x%x",
/var/lib/jenkins/workspace/DevOps-test2/platform-broadcom/patches/sonic-swss.patch:112: trailing whitespace.
/var/lib/jenkins/workspace/DevOps-test2/platform-broadcom/patches/sonic-swss.patch:140: trailing whitespace.
/var/lib/jenkins/workspace/DevOps-test2/platform-broadcom/patches/sonic-swss.patch:284: trailing whitespace.
warning: squelched 2 whitespace errors
warning: 7 lines add whitespace errors.
applied: sonic-swss
/var/lib/jenkins/workspace/DevOps-test2/platform-broadcom/patches/sonic-swss-new.patch:7: trailing whitespace.
#include "ptporch.h"
/var/lib/jenkins/workspace/DevOps-test2/platform-broadcom/patches/sonic-swss-new.patch:8: trailing whitespace.
#include "saiptp.h" // Include header containing Vendor Extension IDs
/var/lib/jenkins/workspace/DevOps-test2/platform-broadcom/patches/sonic-swss-new.patch:9: trailing whitespace.
#include "logger.h"
/var/lib/jenkins/workspace/DevOps-test2/platform-broadcom/patches/sonic-swss-new.patch:10: trailing whitespace.
#include "sai_serialize.h"
/var/lib/jenkins/workspace/DevOps-test2/platform-broadcom/patches/sonic-swss-new.patch:11: trailing whitespace.
#include "tokenize.h"
warning: squelched 771 whitespace errors
warning: 776 lines add whitespace errors.
applied: sonic-swss-new
applied: sonic-sairedis-vslib
applied: sonic-sairedis-meta
applied: sonic-sairedis-SAI
applied: sonic-sairedis-SAI-apidef
applied: sonic-mgmt-framework
+++ --- Making all --- +++
./scripts/run_with_retry make BLDENV=bookworm -f Makefile.work all
make[1]: Entering directory '/var/lib/jenkins/workspace/DevOps-test2/platform-broadcom'
"SECURE_UPGRADE_PROD_SIGNING_TOOL": ""
~/workspace/DevOps-test2/platform-broadcom/src/sonic-build-hooks ~/workspace/DevOps-test2/platform-broadcom
make[2]: Entering directory '/var/lib/jenkins/workspace/DevOps-test2/platform-broadcom/src/sonic-build-hooks'
dpkg-deb: building package 'sonic-build-hooks' in 'buildinfo/sonic-build-hooks_1.0_all.deb'.
make[2]: Leaving directory '/var/lib/jenkins/workspace/DevOps-test2/platform-broadcom/src/sonic-build-hooks'
~/workspace/DevOps-test2/platform-broadcom
Checking sonic-slave-base image: sonic-slave-bookworm:2f250bfbb4a
Checking sonic-slave-user image: sonic-slave-bookworm-jenkins:65c8aaa3f92
SONiC Build System
Build Configuration
"CONFIGURED_PLATFORM" : "broadcom"
"CONFIGURED_ARCH" : "amd64"
"SONIC_CONFIG_PRINT_DEPENDENCIES" : ""
"SONIC_BUILD_JOBS" : "4"
"SONIC_CONFIG_MAKE_JOBS" : "112"
"USE_NATIVE_DOCKERD_FOR_BUILD" : ""
"SONIC_USE_DOCKER_BUILDKIT" : ""
"USERNAME" : "admin"
"PASSWORD" : "YourPaSsWoRd"
"CHANGE_DEFAULT_PASSWORD" : "n"
"SECURE_UPGRADE_MODE" : "no_sign"
"SECURE_UPGRADE_DEV_SIGNING_KEY" : ""
"SECURE_UPGRADE_SIGNING_CERT" : ""
"SECURE_UPGRADE_PROD_SIGNING_TOOL": ""
"SECURE_UPGRADE_PROD_TOOL_ARGS" : ""
"ONIE_IMAGE_PART_SIZE" : ""
"SHUTDOWN_BGP_ON_START" : ""
"ENABLE_PFCWD_ON_START" : ""
"SONIC_BUFFER_MODEL" : ""
"INSTALL_DEBUG_TOOLS" : ""
"ROUTING_STACK" : "frr"
"FRR_USER_UID" : "300"
"FRR_USER_GID" : "300"
"ENABLE_SYNCD_RPC" : ""
"SAITHRIFT_V2" : ""
"ENABLE_ORGANIZATION_EXTENSIONS" : "y"
"HTTP_PROXY" : ""
"HTTPS_PROXY" : ""
"NO_PROXY" : ""
"ENABLE_ZTP" : ""
"INCLUDE_PDE" : ""
"SONIC_DEBUGGING_ON" : ""
"SONIC_PROFILING_ON" : ""
"KERNEL_PROCURE_METHOD" : "build"
"BUILD_TIMESTAMP" : "20260923.134706"
"BUILD_LOG_TIMESTAMP" : "none"
"SONIC_IMAGE_VERSION" : "etri-202505.12-8610ff460"
"BLDENV" : "bookworm"
"VS_PREPARE_MEM" : "yes"
"INCLUDE_MGMT_FRAMEWORK" : "y"
"INCLUDE_ICCPD" : "n"
"INCLUDE_STP" : "y"
"INCLUDE_SYSTEM_TELEMETRY" : "y"
"INCLUDE_SYSTEM_GNMI" : "y"
"INCLUDE_SYSTEM_BMP" : "y"
"INCLUDE_SYSTEM_EVENTD" : "y"
"ENABLE_HOST_SERVICE_ON_START" : "y"
"INCLUDE_RESTAPI" : "n"
"INCLUDE_SFLOW" : "y"
"INCLUDE_NAT" : "y"
"INCLUDE_DHCP_RELAY" : "y"
"INCLUDE_DHCP_SERVER" : "n"
"INCLUDE_P4RT" : "n"
"INCLUDE_VS_DASH_SAI" : "y"
"INCLUDE_KUBERNETES" : "n"
"INCLUDE_KUBERNETES_MASTER" : "n"
"INCLUDE_MACSEC" : "y"
"INCLUDE_MUX" : "y"
"INCLUDE_TEAMD" : "y"
"INCLUDE_DASH_HA" : "y"
"INCLUDE_ROUTER_ADVERTISER" : "y"
"INCLUDE_BOOTCHART : "y"
"ENABLE_BOOTCHART : "n"
"INCLUDE_FIPS" : "y"
"ENABLE_TRANSLIB_WRITE" : ""
"ENABLE_NATIVE_WRITE" : "y"
"ENABLE_DIALOUT" : ""
"ENABLE_AUTO_TECH_SUPPORT" : "y"
"PDDF_SUPPORT" : "y"
"MULTIARCH_QEMU_ENVIRON" : "n"
"SONIC_VERSION_CONTROL_COMPONENTS": "py2,py3,web,git,docker"
"ENABLE_ASAN" : "n"
"DEFAULT_CONTAINER_REGISTRY" : "publicmirror.azurecr.io/"
"CROSS_BUILD_ENVIRON" : "n"
"LEGACY_SONIC_MGMT_DOCKER" : "y"
"INCLUDE_EXTERNAL_PATCHES" : "n"
"PTF_ENV_PY_VER" : "py3"
"ENABLE_MULTIDB" : ""
mv: cannot move '/etc/apt/sources.list.d/debian.sources' to '/etc/apt/sources.list.d/debian.sources.back': Permission denied
fatal: not a git repository (or any of the parent directories): .git
"SONIC_DPKG_CACHE_METHOD" : "none"
[ building ] [ target/debs/bookworm/linux-headers-6.1.0-29-2-common_6.1.123-1_all.deb ]
[ building ] [ target/debs/bookworm/systemd-sonic-generator_1.0.0_amd64.deb ]
[ building ] [ target/debs/bookworm/flashrom_0.9.7_amd64.deb ]
[ building ] [ target/debs/bookworm/initramfs-tools_0.142_all.deb ]
[ finished ] [ target/debs/bookworm/initramfs-tools_0.142_all.deb ]
[ FAIL LOG START ] [ target/debs/bookworm/initramfs-tools_0.142_all.deb ]
Build start time: Wed Sep 23 04:47:28 UTC 2026
[ REASON ] : target/debs/bookworm/initramfs-tools_0.142_all.deb does not exist
[ FLAGS FILE ] : []
[ FLAGS DEPENDS ] : []
[ FLAGS DIFF ] : []
make[1]: warning: -j112 forced in submake: resetting jobserver mode.
make[1]: Entering directory '/sonic/src/initramfs-tools'
# Obtaining the initramfs-tools
rm -rf ./initramfs-tools
git clone https://salsa.debian.org/kernel-team/initramfs-tools.git ./initramfs-tools
# Patch
pushd ./initramfs-tools
git checkout v0.142
QUILT_PATCHES=.. quilt push -a
# Build the package
rm -f debian/*.debhelper.log
dpkg-buildpackage -rfakeroot -b -us -uc -j112 --admindir /sonic/dpkg/tmp.7oj1b2deCE
popd
mv initramfs-tools-core_0.142_all.deb initramfs-tools_0.142_all.deb /sonic/target/debs/bookworm/
Cloning into './initramfs-tools'...
fatal: unable to access 'https://salsa.debian.org/kernel-team/initramfs-tools.git/': Failed to connect to salsa.debian.org port 443 after 3558 ms: Couldn't connect to server
make[1]: *** [Makefile:11: /sonic/target/debs/bookworm/initramfs-tools_0.142_all.deb] Error 128
make[1]: Leaving directory '/sonic/src/initramfs-tools'
[ FAIL LOG END ] [ target/debs/bookworm/initramfs-tools_0.142_all.deb ]
make: *** [slave.mk:757: target/debs/bookworm/initramfs-tools_0.142_all.deb] Error 1
make: *** Waiting for unfinished jobs....
[ finished ] [ target/debs/bookworm/flashrom_0.9.7_amd64.deb ]
[ finished ] [ target/debs/bookworm/systemd-sonic-generator_1.0.0_amd64.deb ]
[ finished ] [ target/debs/bookworm/linux-headers-6.1.0-29-2-common_6.1.123-1_all.deb ]
make[1]: *** [Makefile.work:611: all] Error 2
make[1]: Leaving directory '/var/lib/jenkins/workspace/DevOps-test2/platform-broadcom'
make: *** [Makefile:53: all] Error 2
|