+++ --- Applying local submodule patches --- +++
already applied: sonic-utilities
already applied: sonic-swss
already applied: sonic-swss-new
already applied: sonic-sairedis-vslib
already applied: sonic-sairedis-meta
already applied: sonic-sairedis-SAI
already applied: sonic-sairedis-SAI-apidef
already applied: sonic-mgmt-framework
+++ --- Making all --- +++
./scripts/run_with_retry make BLDENV=bookworm -f Makefile.work all
make[1]: Entering directory '/var/lib/jenkins/workspace/DevOps-test2/platform-vs'
"SECURE_UPGRADE_PROD_SIGNING_TOOL": ""
~/workspace/DevOps-test2/platform-vs/src/sonic-build-hooks ~/workspace/DevOps-test2/platform-vs
make[2]: Entering directory '/var/lib/jenkins/workspace/DevOps-test2/platform-vs/src/sonic-build-hooks'
dpkg-deb: building package 'sonic-build-hooks' in 'buildinfo/sonic-build-hooks_1.0_all.deb'.
make[2]: Leaving directory '/var/lib/jenkins/workspace/DevOps-test2/platform-vs/src/sonic-build-hooks'
~/workspace/DevOps-test2/platform-vs
Checking sonic-slave-base image: sonic-slave-bookworm:2f250bfbb4a
Checking sonic-slave-user image: sonic-slave-bookworm-jenkins:d05b1641d68
SONiC Build System
Build Configuration
"CONFIGURED_PLATFORM" : "vs"
"CONFIGURED_ARCH" : "amd64"
"SONIC_CONFIG_PRINT_DEPENDENCIES" : ""
"SONIC_BUILD_JOBS" : "1"
"SONIC_CONFIG_MAKE_JOBS" : "112"
"USE_NATIVE_DOCKERD_FOR_BUILD" : ""
"SONIC_USE_DOCKER_BUILDKIT" : ""
"USERNAME" : "admin"
"PASSWORD" : "YourPaSsWoRd"
"CHANGE_DEFAULT_PASSWORD" : "n"
"SECURE_UPGRADE_MODE" : "no_sign"
"SECURE_UPGRADE_DEV_SIGNING_KEY" : ""
"SECURE_UPGRADE_SIGNING_CERT" : ""
"SECURE_UPGRADE_PROD_SIGNING_TOOL": ""
"SECURE_UPGRADE_PROD_TOOL_ARGS" : ""
"ONIE_IMAGE_PART_SIZE" : ""
"SHUTDOWN_BGP_ON_START" : ""
"ENABLE_PFCWD_ON_START" : ""
"SONIC_BUFFER_MODEL" : ""
"INSTALL_DEBUG_TOOLS" : ""
"ROUTING_STACK" : "frr"
"FRR_USER_UID" : "300"
"FRR_USER_GID" : "300"
"ENABLE_SYNCD_RPC" : ""
"SAITHRIFT_V2" : ""
"ENABLE_ORGANIZATION_EXTENSIONS" : "y"
"HTTP_PROXY" : ""
"HTTPS_PROXY" : ""
"NO_PROXY" : ""
"ENABLE_ZTP" : ""
"INCLUDE_PDE" : ""
"SONIC_DEBUGGING_ON" : ""
"SONIC_PROFILING_ON" : ""
"KERNEL_PROCURE_METHOD" : "build"
"BUILD_TIMESTAMP" : "20260923.150045"
"BUILD_LOG_TIMESTAMP" : "none"
"SONIC_IMAGE_VERSION" : "etri-202505.12-8610ff460"
"BLDENV" : "bookworm"
"VS_PREPARE_MEM" : "yes"
"INCLUDE_MGMT_FRAMEWORK" : "y"
"INCLUDE_ICCPD" : "n"
"INCLUDE_STP" : "y"
"INCLUDE_SYSTEM_TELEMETRY" : "y"
"INCLUDE_SYSTEM_GNMI" : "y"
"INCLUDE_SYSTEM_BMP" : "y"
"INCLUDE_SYSTEM_EVENTD" : "y"
"ENABLE_HOST_SERVICE_ON_START" : "y"
"INCLUDE_RESTAPI" : "n"
"INCLUDE_SFLOW" : "y"
"INCLUDE_NAT" : "y"
"INCLUDE_DHCP_RELAY" : "y"
"INCLUDE_DHCP_SERVER" : "n"
"INCLUDE_P4RT" : "n"
"INCLUDE_VS_DASH_SAI" : "y"
"INCLUDE_KUBERNETES" : "n"
"INCLUDE_KUBERNETES_MASTER" : "n"
"INCLUDE_MACSEC" : "y"
"INCLUDE_MUX" : "y"
"INCLUDE_TEAMD" : "y"
"INCLUDE_DASH_HA" : "y"
"INCLUDE_ROUTER_ADVERTISER" : "y"
"INCLUDE_BOOTCHART : "y"
"ENABLE_BOOTCHART : "n"
"INCLUDE_FIPS" : "y"
"ENABLE_TRANSLIB_WRITE" : ""
"ENABLE_NATIVE_WRITE" : "y"
"ENABLE_DIALOUT" : ""
"ENABLE_AUTO_TECH_SUPPORT" : "y"
"PDDF_SUPPORT" : "y"
"MULTIARCH_QEMU_ENVIRON" : "n"
"SONIC_VERSION_CONTROL_COMPONENTS": "py2,py3,web,git,docker"
"ENABLE_ASAN" : "n"
"DEFAULT_CONTAINER_REGISTRY" : "publicmirror.azurecr.io/"
"BUILD_MULTIASIC_KVM" : "n"
"CROSS_BUILD_ENVIRON" : "n"
"LEGACY_SONIC_MGMT_DOCKER" : "y"
"INCLUDE_EXTERNAL_PATCHES" : "n"
"PTF_ENV_PY_VER" : "py3"
"ENABLE_MULTIDB" : ""
mv: cannot move '/etc/apt/sources.list.d/debian.sources' to '/etc/apt/sources.list.d/debian.sources.back': Permission denied
fatal: not a git repository (or any of the parent directories): .git
"SONIC_DPKG_CACHE_METHOD" : "none"
[ building ] [ target/debs/bookworm/sonic-db-cli_1.0.0_amd64.deb ]
[ finished ] [ target/debs/bookworm/sonic-db-cli_1.0.0_amd64.deb ]
[ building ] [ target/debs/bookworm/libswsscommon-dev_1.0.0_amd64.deb ]
[ finished ] [ target/debs/bookworm/libswsscommon-dev_1.0.0_amd64.deb ]
[ building ] [ target/debs/bookworm/libnl-3-200_3.7.0-0.2+b1sonic1_amd64.deb-install ]
[ finished ] [ target/debs/bookworm/libnl-3-200_3.7.0-0.2+b1sonic1_amd64.deb-install ]
[ building ] [ target/debs/bookworm/libnl-3-dev_3.7.0-0.2+b1sonic1_amd64.deb-install ]
[ finished ] [ target/debs/bookworm/libnl-3-dev_3.7.0-0.2+b1sonic1_amd64.deb-install ]
[ building ] [ target/debs/bookworm/libnl-genl-3-200_3.7.0-0.2+b1sonic1_amd64.deb-install ]
[ finished ] [ target/debs/bookworm/libnl-genl-3-200_3.7.0-0.2+b1sonic1_amd64.deb-install ]
[ building ] [ target/debs/bookworm/libnl-genl-3-dev_3.7.0-0.2+b1sonic1_amd64.deb-install ]
[ finished ] [ target/debs/bookworm/libnl-genl-3-dev_3.7.0-0.2+b1sonic1_amd64.deb-install ]
[ building ] [ target/debs/bookworm/libnl-route-3-200_3.7.0-0.2+b1sonic1_amd64.deb-install ]
[ finished ] [ target/debs/bookworm/libnl-route-3-200_3.7.0-0.2+b1sonic1_amd64.deb-install ]
[ building ] [ target/debs/bookworm/libnl-route-3-dev_3.7.0-0.2+b1sonic1_amd64.deb-install ]
[ finished ] [ target/debs/bookworm/libnl-route-3-dev_3.7.0-0.2+b1sonic1_amd64.deb-install ]
[ building ] [ target/debs/bookworm/libnl-nf-3-200_3.7.0-0.2+b1sonic1_amd64.deb-install ]
[ finished ] [ target/debs/bookworm/libnl-nf-3-200_3.7.0-0.2+b1sonic1_amd64.deb-install ]
[ building ] [ target/debs/bookworm/libnl-nf-3-dev_3.7.0-0.2+b1sonic1_amd64.deb-install ]
[ finished ] [ target/debs/bookworm/libnl-nf-3-dev_3.7.0-0.2+b1sonic1_amd64.deb-install ]
[ building ] [ target/debs/bookworm/libnl-cli-3-200_3.7.0-0.2+b1sonic1_amd64.deb-install ]
[ finished ] [ target/debs/bookworm/libnl-cli-3-200_3.7.0-0.2+b1sonic1_amd64.deb-install ]
[ building ] [ target/debs/bookworm/libnl-cli-3-dev_3.7.0-0.2+b1sonic1_amd64.deb-install ]
[ finished ] [ target/debs/bookworm/libnl-cli-3-dev_3.7.0-0.2+b1sonic1_amd64.deb-install ]
[ building ] [ target/debs/bookworm/libyang_1.0.73_amd64.deb-install ]
[ finished ] [ target/debs/bookworm/libyang_1.0.73_amd64.deb-install ]
[ building ] [ target/debs/bookworm/libyang-dev_1.0.73_amd64.deb-install ]
[ finished ] [ target/debs/bookworm/libyang-dev_1.0.73_amd64.deb-install ]
[ building ] [ target/debs/bookworm/libyang-cpp_1.0.73_amd64.deb-install ]
[ finished ] [ target/debs/bookworm/libyang-cpp_1.0.73_amd64.deb-install ]
[ building ] [ target/debs/bookworm/python3-yang_1.0.73_amd64.deb-install ]
[ finished ] [ target/debs/bookworm/python3-yang_1.0.73_amd64.deb-install ]
[ building ] [ target/debs/bookworm/libswsscommon_1.0.0_amd64.deb-install ]
[ finished ] [ target/debs/bookworm/libswsscommon_1.0.0_amd64.deb-install ]
[ building ] [ target/debs/bookworm/libswsscommon-dev_1.0.0_amd64.deb-install ]
[ finished ] [ target/debs/bookworm/libswsscommon-dev_1.0.0_amd64.deb-install ]
[ building ] [ target/debs/bookworm/sonic-eventd_1.0.0-0_amd64.deb ]
[ finished ] [ target/debs/bookworm/sonic-eventd_1.0.0-0_amd64.deb ]
[ building ] [ target/debs/bookworm/sonic-rsyslog-plugin_1.0.0-0_amd64.deb ]
[ finished ] [ target/debs/bookworm/sonic-rsyslog-plugin_1.0.0-0_amd64.deb ]
[ building ] [ target/python-wheels/bookworm/redis_dump_load-1.1-py3-none-any.whl-install ]
[ finished ] [ target/python-wheels/bookworm/redis_dump_load-1.1-py3-none-any.whl-install ]
[ building ] [ target/python-wheels/bookworm/swsssdk-2.0.1-py3-none-any.whl-install ]
[ finished ] [ target/python-wheels/bookworm/swsssdk-2.0.1-py3-none-any.whl-install ]
[ building ] [ target/debs/bookworm/python3-swsscommon_1.0.0_amd64.deb-install ]
[ finished ] [ target/debs/bookworm/python3-swsscommon_1.0.0_amd64.deb-install ]
[ building ] [ target/python-wheels/bookworm/sonic_py_common-1.0-py3-none-any.whl ]
[ finished ] [ target/python-wheels/bookworm/sonic_py_common-1.0-py3-none-any.whl ]
[ building ] [ target/python-wheels/bookworm/sonic_py_common-1.0-py3-none-any.whl-install ]
[ finished ] [ target/python-wheels/bookworm/sonic_py_common-1.0-py3-none-any.whl-install ]
[ building ] [ target/python-wheels/bookworm/sonic_containercfgd-1.0-py3-none-any.whl ]
[ finished ] [ target/python-wheels/bookworm/sonic_containercfgd-1.0-py3-none-any.whl ]
[ building ] [ target/python-wheels/bookworm/sonic_yang_models-1.0-py3-none-any.whl-install ]
[ finished ] [ target/python-wheels/bookworm/sonic_yang_models-1.0-py3-none-any.whl-install ]
[ building ] [ target/python-wheels/bookworm/sonic_yang_mgmt-1.0-py3-none-any.whl-install ]
[ finished ] [ target/python-wheels/bookworm/sonic_yang_mgmt-1.0-py3-none-any.whl-install ]
[ building ] [ target/python-wheels/bookworm/sonic_config_engine-1.0-py3-none-any.whl ]
[ finished ] [ target/python-wheels/bookworm/sonic_config_engine-1.0-py3-none-any.whl ]
[ building ] [ target/docker-base-bookworm.gz-load ]
[ finished ] [ target/docker-base-bookworm.gz-load ]
[ building ] [ target/docker-config-engine-bookworm.gz ]
[ finished ] [ target/docker-config-engine-bookworm.gz ]
[ building ] [ target/docker-config-engine-bookworm.gz-load ]
[ finished ] [ target/docker-config-engine-bookworm.gz-load ]
[ building ] [ target/docker-auditd-watchdog.gz ]
[ finished ] [ target/docker-auditd-watchdog.gz ]
[ building ] [ target/docker-auditd.gz ]
[ finished ] [ target/docker-auditd.gz ]
[ building ] [ target/docker-bmp-watchdog.gz ]
[ finished ] [ target/docker-bmp-watchdog.gz ]
[ building ] [ target/debs/bookworm/sonic-bmp_0.1_amd64.deb ]
[ finished ] [ target/debs/bookworm/sonic-bmp_0.1_amd64.deb ]
[ building ] [ target/python-wheels/bookworm/sonic_config_engine-1.0-py3-none-any.whl-install ]
[ finished ] [ target/python-wheels/bookworm/sonic_config_engine-1.0-py3-none-any.whl-install ]
[ building ] [ target/python-wheels/bookworm/sonic_platform_common-1.0-py3-none-any.whl ]
[ finished ] [ target/python-wheels/bookworm/sonic_platform_common-1.0-py3-none-any.whl ]
[ building ] [ target/python-wheels/bookworm/sonic_platform_common-1.0-py3-none-any.whl-install ]
[ finished ] [ target/python-wheels/bookworm/sonic_platform_common-1.0-py3-none-any.whl-install ]
[ building ] [ target/python-wheels/bookworm/sonic_utilities-1.2-py3-none-any.whl ]
[ finished ] [ target/python-wheels/bookworm/sonic_utilities-1.2-py3-none-any.whl ]
[ building ] [ target/python-wheels/bookworm/sonic_utilities-1.2-py3-none-any.whl-install ]
[ finished ] [ target/python-wheels/bookworm/sonic_utilities-1.2-py3-none-any.whl-install ]
[ building ] [ target/python-wheels/bookworm/sonic_bmpcfgd_services-1.0-py3-none-any.whl ]
[ finished ] [ target/python-wheels/bookworm/sonic_bmpcfgd_services-1.0-py3-none-any.whl ]
[ building ] [ target/debs/bookworm/sonic-bmp_0.1_amd64.deb-install ]
[ finished ] [ target/debs/bookworm/sonic-bmp_0.1_amd64.deb-install ]
[ building ] [ target/docker-sonic-bmp.gz ]
[ finished ] [ target/docker-sonic-bmp.gz ]
[ building ] [ target/debs/bookworm/dash-ha_1.0.0_amd64.deb ]
[ finished ] [ target/debs/bookworm/dash-ha_1.0.0_amd64.deb ]
[ building ] [ target/debs/bookworm/p4lang-pi_0.1.0-15_amd64.deb-install ]
[ finished ] [ target/debs/bookworm/p4lang-pi_0.1.0-15_amd64.deb-install ]
[ building ] [ target/debs/bookworm/p4lang-bmv2_1.15.0-7_amd64.deb-install ]
[ finished ] [ target/debs/bookworm/p4lang-bmv2_1.15.0-7_amd64.deb-install ]
[ building ] [ target/debs/bookworm/p4lang-p4c_1.2.4.2-2_amd64.deb-install ]
[ finished ] [ target/debs/bookworm/p4lang-p4c_1.2.4.2-2_amd64.deb-install ]
[ building ] [ target/debs/bookworm/libsai_1.0.0_amd64.deb-install ]
[ finished ] [ target/debs/bookworm/libsai_1.0.0_amd64.deb-install ]
[ building ] [ target/debs/bookworm/libsairedis_1.0.0_amd64.deb ]
[ finished ] [ target/debs/bookworm/libsairedis_1.0.0_amd64.deb ]
[ building ] [ target/debs/bookworm/libsairedis-dev_1.0.0_amd64.deb ]
[ finished ] [ target/debs/bookworm/libsairedis-dev_1.0.0_amd64.deb ]
[ building ] [ target/debs/bookworm/libsaimetadata-dev_1.0.0_amd64.deb ]
[ finished ] [ target/debs/bookworm/libsaimetadata-dev_1.0.0_amd64.deb ]
[ building ] [ target/debs/bookworm/libteamdctl0_1.31-1_amd64.deb ]
[ finished ] [ target/debs/bookworm/libteamdctl0_1.31-1_amd64.deb ]
[ building ] [ target/debs/bookworm/libteam-dev_1.31-1_amd64.deb ]
[ finished ] [ target/debs/bookworm/libteam-dev_1.31-1_amd64.deb ]
[ building ] [ target/debs/bookworm/libteam-utils_1.31-1_amd64.deb ]
[ finished ] [ target/debs/bookworm/libteam-utils_1.31-1_amd64.deb ]
[ building ] [ target/debs/bookworm/libsaivs-dev_1.0.0_amd64.deb ]
[ finished ] [ target/debs/bookworm/libsaivs-dev_1.0.0_amd64.deb ]
[ building ] [ target/debs/bookworm/stp_1.0.0_amd64.deb ]
[ finished ] [ target/debs/bookworm/stp_1.0.0_amd64.deb ]
[ building ] [ target/debs/bookworm/libsairedis_1.0.0_amd64.deb-install ]
[ finished ] [ target/debs/bookworm/libsairedis_1.0.0_amd64.deb-install ]
[ building ] [ target/debs/bookworm/libsairedis-dev_1.0.0_amd64.deb-install ]
[ finished ] [ target/debs/bookworm/libsairedis-dev_1.0.0_amd64.deb-install ]
[ building ] [ target/debs/bookworm/libsaimetadata_1.0.0_amd64.deb-install ]
[ finished ] [ target/debs/bookworm/libsaimetadata_1.0.0_amd64.deb-install ]
[ building ] [ target/debs/bookworm/libsaimetadata-dev_1.0.0_amd64.deb-install ]
[ finished ] [ target/debs/bookworm/libsaimetadata-dev_1.0.0_amd64.deb-install ]
[ building ] [ target/debs/bookworm/libteam5_1.31-1_amd64.deb-install ]
[ finished ] [ target/debs/bookworm/libteam5_1.31-1_amd64.deb-install ]
[ building ] [ target/debs/bookworm/libteamdctl0_1.31-1_amd64.deb-install ]
[ finished ] [ target/debs/bookworm/libteamdctl0_1.31-1_amd64.deb-install ]
[ building ] [ target/debs/bookworm/libteam-dev_1.31-1_amd64.deb-install ]
[ finished ] [ target/debs/bookworm/libteam-dev_1.31-1_amd64.deb-install ]
[ building ] [ target/debs/bookworm/libteam-utils_1.31-1_amd64.deb-install ]
[ finished ] [ target/debs/bookworm/libteam-utils_1.31-1_amd64.deb-install ]
[ building ] [ target/debs/bookworm/libsaivs_1.0.0_amd64.deb-install ]
[ finished ] [ target/debs/bookworm/libsaivs_1.0.0_amd64.deb-install ]
[ building ] [ target/debs/bookworm/libsaivs-dev_1.0.0_amd64.deb-install ]
[ finished ] [ target/debs/bookworm/libsaivs-dev_1.0.0_amd64.deb-install ]
[ building ] [ target/debs/bookworm/stp_1.0.0_amd64.deb-install ]
[ finished ] [ target/debs/bookworm/stp_1.0.0_amd64.deb-install ]
[ building ] [ target/debs/bookworm/libdashapi_1.0.0_amd64.deb-install ]
[ finished ] [ target/debs/bookworm/libdashapi_1.0.0_amd64.deb-install ]
[ building ] [ target/debs/bookworm/swss_1.0.0_amd64.deb ]
[ finished ] [ target/debs/bookworm/swss_1.0.0_amd64.deb ]
[ building ] [ target/docker-swss-layer-bookworm.gz ]
[ finished ] [ target/docker-swss-layer-bookworm.gz ]
[ building ] [ target/docker-swss-layer-bookworm.gz-load ]
[ finished ] [ target/docker-swss-layer-bookworm.gz-load ]
[ building ] [ target/docker-dash-ha.gz ]
[ finished ] [ target/docker-dash-ha.gz ]
[ building ] [ target/docker-database.gz ]
[ finished ] [ target/docker-database.gz ]
[ building ] [ target/docker-eventd.gz ]
[ finished ] [ target/docker-eventd.gz ]
[ building ] [ target/python-wheels/bookworm/sonic_bgpcfgd-1.0-py3-none-any.whl ]
[ finished ] [ target/python-wheels/bookworm/sonic_bgpcfgd-1.0-py3-none-any.whl ]
[ building ] [ target/python-wheels/bookworm/sonic_frr_mgmt_framework-1.0-py3-none-any.whl ]
[ finished ] [ target/python-wheels/bookworm/sonic_frr_mgmt_framework-1.0-py3-none-any.whl ]
[ building ] [ target/docker-fpm-frr.gz ]
[ finished ] [ target/docker-fpm-frr.gz ]
[ building ] [ target/docker-gnmi-watchdog.gz ]
[ finished ] [ target/docker-gnmi-watchdog.gz ]
[ building ] [ target/debs/bookworm/sonic-mgmt-common_1.0.0_amd64.deb-install ]
[ finished ] [ target/debs/bookworm/sonic-mgmt-common_1.0.0_amd64.deb-install ]
[ building ] [ target/debs/bookworm/sonic-mgmt-common-codegen_1.0.0_amd64.deb-install ]
[ finished ] [ target/debs/bookworm/sonic-mgmt-common-codegen_1.0.0_amd64.deb-install ]
[ building ] [ target/debs/bookworm/sonic-gnmi_0.1_amd64.deb ]
[ finished ] [ target/debs/bookworm/sonic-gnmi_0.1_amd64.deb ]
[ FAIL LOG START ] [ target/debs/bookworm/sonic-gnmi_0.1_amd64.deb ]
Build start time: Wed Sep 23 06:40:56 UTC 2026
[ REASON ] : target/debs/bookworm/sonic-gnmi_0.1_amd64.deb does not exist NON-EXISTENT PREREQUISITES: target/debs/bookworm/sonic-mgmt-common_1.0.0_amd64.deb-install target/debs/bookworm/sonic-mgmt-common-codegen_1.0.0_amd64.deb-install target/debs/bookworm/libswsscommon-dev_1.0.0_amd64.deb-install target/debs/bookworm/libswsscommon_1.0.0_amd64.deb-install
[ FLAGS FILE ] : []
[ FLAGS DEPENDS ] : []
[ FLAGS DIFF ] : []
/sonic/src/sonic-gnmi /sonic
dpkg-buildpackage: info: source package sonic-gnmi
dpkg-buildpackage: info: source version 0.1
dpkg-buildpackage: info: source distribution UNRELEASED
dpkg-buildpackage: info: source changed by Jipan Yang
dpkg-source --before-build .
dpkg-buildpackage: info: host architecture amd64
fakeroot debian/rules clean
make[1]: Entering directory '/sonic/src/sonic-gnmi'
dh clean
dh: warning: Compatibility levels before 10 are deprecated (level 9 in use)
dh_auto_clean
dh_auto_clean: warning: Compatibility levels before 10 are deprecated (level 9 in use)
make -j1 clean
make[2]: Entering directory '/sonic/src/sonic-gnmi'
rm -f -r build
rm -f -r vendor
make[2]: Leaving directory '/sonic/src/sonic-gnmi'
dh_clean
dh_clean: warning: Compatibility levels before 10 are deprecated (level 9 in use)
make[1]: Leaving directory '/sonic/src/sonic-gnmi'
debian/rules build
make[1]: Entering directory '/sonic/src/sonic-gnmi'
dh build
dh: warning: Compatibility levels before 10 are deprecated (level 9 in use)
dh_update_autotools_config
dh_auto_configure
dh_auto_configure: warning: Compatibility levels before 10 are deprecated (level 9 in use)
dh_auto_build
dh_auto_build: warning: Compatibility levels before 10 are deprecated (level 9 in use)
make -j1
make[2]: Entering directory '/sonic/src/sonic-gnmi'
make -C swsscommon
make[3]: Entering directory '/sonic/src/sonic-gnmi/swsscommon'
cp -f /usr/share/swss/swsscommon.i .
/usr/bin/swig -go -cgo -c++ -intgosize 64 -I/usr/include/swss/ swsscommon.i
/usr/include/swss/dbconnector.h:234: Warning 314: 'select' is a Go keyword, renaming to 'Xselect'
/usr/include/swss/select.h:36: Warning 314: 'select' is a Go keyword, renaming to 'Xselect'
/usr/include/swss/select.h:36: Warning 314: 'select' is a Go keyword, renaming to 'Xselect'
/usr/include/swss/select.h:36: Warning 314: 'select' is a Go keyword, renaming to 'Xselect'
/usr/include/swss/redisreply.h:42: Warning 314: 'type' is a Go keyword, renaming to 'Xtype'
/usr/include/swss/logger.h:123: Warning 325: Nested class not currently supported (ScopeLogger ignored)
/usr/include/swss/logger.h:142: Warning 325: Nested class not currently supported (ScopeTimer ignored)
/usr/include/swss/pubsub.h:16: Warning 401: Base class 'RedisSelect' undefined.
/usr/include/swss/redisselect.h:11: Warning 401: 'RedisSelect' must be defined before it is used as a base class.
/usr/include/swss/redisreply.h:15: Warning 401: Nothing known about base class 'std::runtime_error'. Ignored.
/usr/include/swss/zmqconsumerstatetable.h:15: Warning 401: Base class 'TableBase' undefined.
/usr/include/swss/table.h:35: Warning 401: 'TableBase' must be defined before it is used as a base class.
/usr/include/swss/dbinterface.h:14: Warning 401: Nothing known about base class 'std::runtime_error'. Ignored.
/usr/include/swss/dbconnector.h:60: Warning 503: Can't wrap 'operator ==' unless renamed to a valid identifier.
/usr/include/swss/dbconnector.h:84: Warning 503: Can't wrap 'operator ()' unless renamed to a valid identifier.
swsscommon.i:293: Warning 453: Can't apply (std::vector< std::string > &OUTPUT). No typemaps are defined.
swsscommon.i:294: Warning 453: Can't apply (std::vector< std::string > &OUTPUT). No typemaps are defined.
swsscommon.i:295: Warning 453: Can't apply (std::vector< std::vector< std::pair< std::string,std::string > > > &OUTPUT). No typemaps are defined.
swsscommon.i:296: Warning 453: Can't apply (std::vector< std::pair< std::string,std::string > > &OUTPUT). No typemaps are defined.
swsscommon.i:297: Warning 453: Can't apply (std::string &OUTPUT). No typemaps are defined.
swsscommon.i:309: Warning 453: Can't apply (std::vector< std::pair< std::string,std::string > > &OUTPUT). No typemaps are defined.
swsscommon.i:310: Warning 453: Can't apply (std::string &OUTPUT). No typemaps are defined.
/usr/include/swss/countertable.h:105: Warning 470: Thread/reentrant unsafe wrapping, consider returning by value instead.
swsscommon.i:330: Warning 453: Can't apply (std::string &OUTPUT). No typemaps are defined.
swsscommon.i:331: Warning 453: Can't apply (std::string &OUTPUT). No typemaps are defined.
swsscommon.i:332: Warning 453: Can't apply (std::vector< std::pair< std::string,std::string > > &OUTPUT). No typemaps are defined.
swsscommon.i:345: Warning 453: Can't apply (std::string &OUTPUT). No typemaps are defined.
swsscommon.i:346: Warning 453: Can't apply (std::string &OUTPUT). No typemaps are defined.
swsscommon.i:347: Warning 453: Can't apply (std::vector< std::pair< std::string,std::string > > &OUTPUT). No typemaps are defined.
make[3]: Leaving directory '/sonic/src/sonic-gnmi/swsscommon'
+++++ Generating PROTOBUF files for API Yang modules; +++++
pyang \
-f proto \
--proto-outdir build/gnoi_yang/proto \
--plugindir /sonic/src/sonic-gnmi/tools/pyang_plugins \
--server-rpc-outdir build/gnoi_yang/server \
--client-rpc-outdir build/gnoi_yang/client \
-p /sonic/src/sonic-gnmi/../sonic-mgmt-common/build/yang/common:/sonic/src/sonic-gnmi/../sonic-mgmt-common/build/yang/extensions \
/sonic/src/sonic-gnmi/../sonic-mgmt-common/build/yang/*.yang /sonic/src/sonic-gnmi/../sonic-mgmt-common/build/yang/extensions/*.yang
/sonic/src/sonic-gnmi/../sonic-mgmt-common/build/yang/openconfig-if-ethernet.yang:455: warning: node "openconfig-interfaces::state" is config false and is not part of the accessible tree
writing file: build/gnoi_yang/server/openconfig_register.go
writing file: build/gnoi_yang/server/gnoiyang.go
writing file: build/gnoi_yang/client/gnoi_openconfig_client/main.go
+++++ Generation of protobuf files for API Yang modules completed +++++
touch build/gnoi_yang/proto/.proto_api_done
+++++ Generating PROTOBUF files for SONiC Yang modules; +++++
pyang \
-f proto \
--proto-outdir build/gnoi_yang/proto \
--plugindir /sonic/src/sonic-gnmi/tools/pyang_plugins \
--server-rpc-outdir build/gnoi_yang/server \
--client-rpc-outdir build/gnoi_yang/client \
-p /sonic/src/sonic-gnmi/../sonic-mgmt-common/build/yang/common:/sonic/src/sonic-gnmi/../sonic-mgmt-common/build/yang/sonic/common \
/sonic/src/sonic-gnmi/../sonic-mgmt-common/build/yang/sonic/*.yang
===> processing sonic-show-techsupport ...
writing file: build/gnoi_yang/proto/sonic_show_techsupport/sonic_show_techsupport.proto
writing file: build/gnoi_yang/server/sonic_register.go
file build/gnoi_yang/server/gnoiyang.go unchanged, skipped writing...
writing file: build/gnoi_yang/client/gnoi_sonic_client/main.go
+++++ Generation of protobuf files for SONiC Yang modules completed +++++
touch build/gnoi_yang/proto/.proto_sonic_done
+++++ Compiling PROTOBUF files; +++++
/usr/local/go/bin/go install github.com/gogo/protobuf/protoc-gen-gofast
go: downloading github.com/gogo/protobuf v1.3.2
PATH=/usr/local/sbin:/usr/local/bin:/usr/sbin:/usr/bin:/sbin:/bin:/usr/.cargo/bin:/tmp/go/bin:/sonic/src/sonic-gnmi/build/bin:/usr/local/go/bin:/sonic/src/sonic-gnmi/build/bin protoc -Ibuild/gnoi_yang/proto -I/usr/local/include -I/usr/include --gofast_out=plugins=grpc,Mgoogle/protobuf/struct.proto=github.com/gogo/protobuf/types:build/gnoi_yang/proto build/gnoi_yang/proto/sonic_show_techsupport/sonic_show_techsupport.proto;
+++++ PROTOBUF completion completed; +++++
touch build/gnoi_yang/proto/.gnoi_yang_done
/usr/local/go/bin/go mod vendor
go: downloading github.com/openconfig/gnmi v0.0.0-20200617225440-d2b4e6a45802
go: downloading golang.org/x/net v0.26.0
go: downloading github.com/golang/protobuf v1.5.4
go: downloading google.golang.org/grpc v1.64.1
go: downloading github.com/godbus/dbus/v5 v5.1.0
go: downloading github.com/google/gnxi v0.0.0-20181220173256-89f51f0ce1e2
go: downloading github.com/openconfig/gnoi v0.3.0
go: downloading google.golang.org/protobuf v1.34.1
go: downloading github.com/golang/glog v0.0.0-20160126235308-23def4e6c14b
go: downloading github.com/c9s/goprocinfo v0.0.0-20191125144613-4acdd056c72d
go: downloading google.golang.org/grpc/security/advancedtls v1.0.0
go: downloading github.com/kylelemons/godebug v1.1.0
go: downloading golang.org/x/crypto v0.24.0
go: downloading gopkg.in/yaml.v2 v2.2.8
go: downloading github.com/agiledragon/gomonkey/v2 v2.8.0
go: downloading github.com/openconfig/ygot v0.7.1
go: downloading github.com/openconfig/goyang v0.0.0-20200309174518-a00bece872fc
go: downloading golang.org/x/text v0.16.0
go: downloading github.com/golang/mock v1.6.0
go: downloading github.com/maruel/natural v1.1.1
go: downloading github.com/Workiva/go-datastructures v1.0.50
go: downloading github.com/fsnotify/fsnotify v1.4.7
go: downloading github.com/go-redis/redis v6.15.6+incompatible
go: downloading github.com/dgrijalva/jwt-go v3.2.1-0.20210802184156-9742bd7fca1c+incompatible
go: downloading github.com/msteinert/pam v0.0.0-20201130170657-e61372126161
go: downloading github.com/philopon/go-toposort v0.0.0-20170620085441-9be86dbd762f
go: downloading github.com/google/go-cmp v0.6.0
go: downloading github.com/antchfx/xmlquery v1.3.1
go: downloading github.com/antchfx/xpath v1.1.10
go: downloading github.com/go-redis/redis/v7 v7.0.0-beta.3.0.20190824101152-d19aba07b476
go: downloading github.com/antchfx/jsonquery v1.1.4
go: downloading inet.af/netaddr v0.0.0-20230525184311-b8eac61e914a
go: downloading github.com/golang/groupcache v0.0.0-20200121045136-8c9f03a8e57e
go: downloading golang.org/x/sys v0.26.0
go: downloading go4.org/intern v0.0.0-20211027215823-ae77deb06f29
go: downloading go4.org/unsafe/assume-no-moving-gc v0.0.0-20230525183740-e7c30c78aeb2
go: downloading github.com/cenkalti/backoff/v4 v4.0.0
go: downloading google.golang.org/genproto v0.0.0-20230410155749-daa745c078e1
github.com/sonic-net/sonic-gnmi/gnmi_server imports
golang.org/x/crypto/ssh imports
golang.org/x/crypto/curve25519 imports
crypto/ecdh: google.golang.org/genproto@v0.0.0-20230410155749-daa745c078e1 requires
cloud.google.com/go/datacatalog@v1.13.0: Get "https://proxy.golang.org/cloud.google.com/go/datacatalog/@v/v1.13.0.mod": dial tcp [2600:1900:4250:13::2011]:443: connect: network is unreachable
make[2]: *** [Makefile:69: vendor/.done] Error 1
make[2]: Leaving directory '/sonic/src/sonic-gnmi'
dh_auto_build: error: make -j1 returned exit code 2
make[1]: *** [debian/rules:7: build] Error 25
make[1]: Leaving directory '/sonic/src/sonic-gnmi'
dpkg-buildpackage: error: debian/rules build subprocess returned exit status 2
[ FAIL LOG END ] [ target/debs/bookworm/sonic-gnmi_0.1_amd64.deb ]
make: *** [slave.mk:797: target/debs/bookworm/sonic-gnmi_0.1_amd64.deb] Error 1
make[1]: *** [Makefile.work:611: all] Error 2
make[1]: Leaving directory '/var/lib/jenkins/workspace/DevOps-test2/platform-vs'
make: *** [Makefile:53: all] Error 2
|