Content

상위 폴더로 이동
+++ --- Applying local submodule patches --- +++
  already applied: sonic-utilities
  already applied: sonic-swss
  already applied: sonic-swss-new
  already applied: sonic-sairedis-vslib
  already applied: sonic-sairedis-meta
  already applied: sonic-sairedis-SAI
  already applied: sonic-sairedis-SAI-apidef
  already applied: sonic-mgmt-framework
+++ --- Making all --- +++
./scripts/run_with_retry make BLDENV=bookworm -f Makefile.work all
make[1]: Entering directory '/var/lib/jenkins/workspace/DevOps-test2/platform-broadcom'
"SECURE_UPGRADE_PROD_SIGNING_TOOL": ""
~/workspace/DevOps-test2/platform-broadcom/src/sonic-build-hooks ~/workspace/DevOps-test2/platform-broadcom
make[2]: Entering directory '/var/lib/jenkins/workspace/DevOps-test2/platform-broadcom/src/sonic-build-hooks'
dpkg-deb: building package 'sonic-build-hooks' in 'buildinfo/sonic-build-hooks_1.0_all.deb'.
make[2]: Leaving directory '/var/lib/jenkins/workspace/DevOps-test2/platform-broadcom/src/sonic-build-hooks'
~/workspace/DevOps-test2/platform-broadcom
Checking sonic-slave-base image: sonic-slave-bookworm:2f250bfbb4a
Checking sonic-slave-user image: sonic-slave-bookworm-jenkins:65c8aaa3f92
SONiC Build System

Build Configuration
"CONFIGURED_PLATFORM"             : "broadcom"
"CONFIGURED_ARCH"                 : "amd64"
"SONIC_CONFIG_PRINT_DEPENDENCIES" : ""
"SONIC_BUILD_JOBS"                : "4"
"SONIC_CONFIG_MAKE_JOBS"          : "112"
"USE_NATIVE_DOCKERD_FOR_BUILD"    : ""
"SONIC_USE_DOCKER_BUILDKIT"       : ""
"USERNAME"                        : "admin"
"PASSWORD"                        : "YourPaSsWoRd"
"CHANGE_DEFAULT_PASSWORD"         : "n"
"SECURE_UPGRADE_MODE"             : "no_sign"
"SECURE_UPGRADE_DEV_SIGNING_KEY"  : ""
"SECURE_UPGRADE_SIGNING_CERT"     : ""
"SECURE_UPGRADE_PROD_SIGNING_TOOL": ""
"SECURE_UPGRADE_PROD_TOOL_ARGS"   : ""
"ONIE_IMAGE_PART_SIZE"            : ""
"SHUTDOWN_BGP_ON_START"           : ""
"ENABLE_PFCWD_ON_START"           : ""
"SONIC_BUFFER_MODEL"              : ""
"INSTALL_DEBUG_TOOLS"             : ""
"ROUTING_STACK"                   : "frr"
"FRR_USER_UID"                    : "300"
"FRR_USER_GID"                    : "300"
"ENABLE_SYNCD_RPC"                : ""
"SAITHRIFT_V2"                    : ""
"ENABLE_ORGANIZATION_EXTENSIONS"  : "y"
"HTTP_PROXY"                      : ""
"HTTPS_PROXY"                     : ""
"NO_PROXY"                        : ""
"ENABLE_ZTP"                      : ""
"INCLUDE_PDE"                     : ""
"SONIC_DEBUGGING_ON"              : ""
"SONIC_PROFILING_ON"              : ""
"KERNEL_PROCURE_METHOD"           : "build"
"BUILD_TIMESTAMP"                 : "20260924.143225"
"BUILD_LOG_TIMESTAMP"             : "none"
"SONIC_IMAGE_VERSION"             : "etri-202505.13-8610ff460"
"BLDENV"                          : "bookworm"
"VS_PREPARE_MEM"                  : "yes"
"INCLUDE_MGMT_FRAMEWORK"          : "y"
"INCLUDE_ICCPD"                   : "n"
"INCLUDE_STP"                     : "y"
"INCLUDE_SYSTEM_TELEMETRY"        : "y"
"INCLUDE_SYSTEM_GNMI"             : "y"
"INCLUDE_SYSTEM_BMP"              : "y"
"INCLUDE_SYSTEM_EVENTD"           : "y"
"ENABLE_HOST_SERVICE_ON_START"    : "y"
"INCLUDE_RESTAPI"                 : "n"
"INCLUDE_SFLOW"                   : "y"
"INCLUDE_NAT"                     : "y"
"INCLUDE_DHCP_RELAY"              : "y"
"INCLUDE_DHCP_SERVER"             : "n"
"INCLUDE_P4RT"                    : "n"
"INCLUDE_VS_DASH_SAI"             : "y"
"INCLUDE_KUBERNETES"              : "n"
"INCLUDE_KUBERNETES_MASTER"       : "n"
"INCLUDE_MACSEC"                  : "y"
"INCLUDE_MUX"                     : "y"
"INCLUDE_TEAMD"                   : "y"
"INCLUDE_DASH_HA"                 : "y"
"INCLUDE_ROUTER_ADVERTISER"       : "y"
"INCLUDE_BOOTCHART                : "y"
"ENABLE_BOOTCHART                 : "n"
"INCLUDE_FIPS"                    : "y"
"ENABLE_TRANSLIB_WRITE"           : ""
"ENABLE_NATIVE_WRITE"             : "y"
"ENABLE_DIALOUT"                  : ""
"ENABLE_AUTO_TECH_SUPPORT"        : "y"
"PDDF_SUPPORT"                    : "y"
"MULTIARCH_QEMU_ENVIRON"          : "n"
"SONIC_VERSION_CONTROL_COMPONENTS": "py2,py3,web,git,docker"
"ENABLE_ASAN"                     : "n"
"DEFAULT_CONTAINER_REGISTRY"      : "publicmirror.azurecr.io/"
"CROSS_BUILD_ENVIRON"             : "n"
"LEGACY_SONIC_MGMT_DOCKER"        : "y"
"INCLUDE_EXTERNAL_PATCHES"        : "n"
"PTF_ENV_PY_VER"                  : "py3"
"ENABLE_MULTIDB"                  : ""

mv: cannot move '/etc/apt/sources.list.d/debian.sources' to '/etc/apt/sources.list.d/debian.sources.back': Permission denied
fatal: not a git repository (or any of the parent directories): .git
"SONIC_DPKG_CACHE_METHOD"         : "none"

[ building ] [ target/debs/bookworm/sonic-platform-accton-as5712-54x_1.1_amd64.deb ] 
[ building ] [ target/debs/bookworm/sonic-platform-accton-as7816-64x_1.1_amd64.deb ] 
[ finished ] [ target/debs/bookworm/sonic-platform-accton-as5712-54x_1.1_amd64.deb ] 
[ building ] [ target/debs/bookworm/sonic-platform-accton-as7312-54x_1.1_amd64.deb ] 
[ finished ] [ target/debs/bookworm/sonic-platform-accton-as7816-64x_1.1_amd64.deb ] 
[ building ] [ target/debs/bookworm/sonic-platform-accton-minipack_1.1_amd64.deb ] 
[ finished ] [ target/debs/bookworm/sonic-platform-accton-as7312-54x_1.1_amd64.deb ] 
[ building ] [ target/debs/bookworm/sonic-platform-accton-as5812-54t_1.1_amd64.deb ] 
[ finished ] [ target/debs/bookworm/sonic-platform-accton-minipack_1.1_amd64.deb ] 
[ finished ] [ target/debs/bookworm/sonic-platform-accton-as5812-54t_1.1_amd64.deb ] 
[ building ] [ target/debs/bookworm/platform-modules-haliburton_1.0_amd64.deb ] 
[ building ] [ target/debs/bookworm/platform-modules-seastone2_1.0_amd64.deb ] 
[ finished ] [ target/debs/bookworm/platform-modules-haliburton_1.0_amd64.deb ] 
[ building ] [ target/debs/bookworm/platform-modules-ds1000_1.0_amd64.deb ] 
[ finished ] [ target/debs/bookworm/platform-modules-seastone2_1.0_amd64.deb ] 
[ building ] [ target/debs/bookworm/platform-modules-questone2_1.0_amd64.deb ] 
[ building ] [ target/debs/bookworm/platform-modules-silverstone-v2_1.0_amd64.deb ] 
[ finished ] [ target/debs/bookworm/platform-modules-silverstone-v2_1.0_amd64.deb ] 
[ building ] [ target/debs/bookworm/platform-modules-ds2000_1.0_amd64.deb ] 
[ finished ] [ target/debs/bookworm/platform-modules-ds2000_1.0_amd64.deb ] 
[ building ] [ target/debs/bookworm/platform-modules-silverstone_1.0_amd64.deb ] 
[ finished ] [ target/debs/bookworm/platform-modules-silverstone_1.0_amd64.deb ] 
[ building ] [ target/debs/bookworm/sonic-platform-ufispace-s6301-56st_1.0.0_amd64.deb ] 
[ finished ] [ target/debs/bookworm/sonic-platform-ufispace-s6301-56st_1.0.0_amd64.deb ] 
[ building ] [ target/debs/bookworm/sonic-db-cli_1.0.0_amd64.deb ] 
[ finished ] [ target/debs/bookworm/sonic-db-cli_1.0.0_amd64.deb ] 
[ building ] [ target/debs/bookworm/libswsscommon-dev_1.0.0_amd64.deb ] 
[ finished ] [ target/debs/bookworm/libswsscommon-dev_1.0.0_amd64.deb ] 
[ building ] [ target/debs/bookworm/libnl-3-200_3.7.0-0.2+b1sonic1_amd64.deb-install ] 
[ finished ] [ target/debs/bookworm/libnl-3-200_3.7.0-0.2+b1sonic1_amd64.deb-install ] 
[ building ] [ target/debs/bookworm/libyang_1.0.73_amd64.deb-install ] 
[ finished ] [ target/debs/bookworm/libyang_1.0.73_amd64.deb-install ] 
[ building ] [ target/debs/bookworm/libnl-3-dev_3.7.0-0.2+b1sonic1_amd64.deb-install ] 
[ finished ] [ target/debs/bookworm/libnl-3-dev_3.7.0-0.2+b1sonic1_amd64.deb-install ] 
[ building ] [ target/debs/bookworm/libnl-genl-3-200_3.7.0-0.2+b1sonic1_amd64.deb-install ] 
[ finished ] [ target/debs/bookworm/libnl-genl-3-200_3.7.0-0.2+b1sonic1_amd64.deb-install ] 
[ building ] [ target/debs/bookworm/libnl-route-3-200_3.7.0-0.2+b1sonic1_amd64.deb-install ] 
[ finished ] [ target/debs/bookworm/libnl-route-3-200_3.7.0-0.2+b1sonic1_amd64.deb-install ] 
[ building ] [ target/debs/bookworm/libnl-genl-3-dev_3.7.0-0.2+b1sonic1_amd64.deb-install ] 
[ finished ] [ target/debs/bookworm/libnl-genl-3-dev_3.7.0-0.2+b1sonic1_amd64.deb-install ] 
[ building ] [ target/debs/bookworm/libnl-route-3-dev_3.7.0-0.2+b1sonic1_amd64.deb-install ] 
[ finished ] [ target/debs/bookworm/libnl-route-3-dev_3.7.0-0.2+b1sonic1_amd64.deb-install ] 
[ building ] [ target/debs/bookworm/libyang-dev_1.0.73_amd64.deb-install ] 
[ finished ] [ target/debs/bookworm/libyang-dev_1.0.73_amd64.deb-install ] 
[ building ] [ target/debs/bookworm/libyang-cpp_1.0.73_amd64.deb-install ] 
[ finished ] [ target/debs/bookworm/libyang-cpp_1.0.73_amd64.deb-install ] 
[ building ] [ target/python-wheels/bookworm/redis_dump_load-1.1-py3-none-any.whl-install ] 
[ finished ] [ target/python-wheels/bookworm/redis_dump_load-1.1-py3-none-any.whl-install ] 
[ building ] [ target/debs/bookworm/libnl-nf-3-200_3.7.0-0.2+b1sonic1_amd64.deb-install ] 
[ finished ] [ target/debs/bookworm/libnl-nf-3-200_3.7.0-0.2+b1sonic1_amd64.deb-install ] 
[ building ] [ target/debs/bookworm/python3-yang_1.0.73_amd64.deb-install ] 
[ finished ] [ target/debs/bookworm/python3-yang_1.0.73_amd64.deb-install ] 
[ building ] [ target/python-wheels/bookworm/swsssdk-2.0.1-py3-none-any.whl-install ] 
[ building ] [ target/debs/bookworm/sonic-platform-accton-as7312-54xs_1.1_amd64.deb ] 
[ finished ] [ target/debs/bookworm/sonic-platform-accton-as7312-54xs_1.1_amd64.deb ] 
[ building ] [ target/debs/bookworm/libnl-nf-3-dev_3.7.0-0.2+b1sonic1_amd64.deb-install ] 
[ finished ] [ target/debs/bookworm/platform-modules-ds1000_1.0_amd64.deb ] 
[ building ] [ target/python-wheels/bookworm/sonic_yang_models-1.0-py3-none-any.whl-install ] 
[ finished ] [ target/debs/bookworm/platform-modules-questone2_1.0_amd64.deb ] 
[ finished ] [ target/debs/bookworm/libnl-nf-3-dev_3.7.0-0.2+b1sonic1_amd64.deb-install ] 
[ building ] [ target/debs/bookworm/libdashapi_1.0.0_amd64.deb-install ] 
[ finished ] [ target/python-wheels/bookworm/swsssdk-2.0.1-py3-none-any.whl-install ] 
[ building ] [ target/debs/bookworm/libnl-cli-3-200_3.7.0-0.2+b1sonic1_amd64.deb-install ] 
[ finished ] [ target/debs/bookworm/libdashapi_1.0.0_amd64.deb-install ] 
[ building ] [ target/debs/bookworm/libsaibcm_13.2.1.7_amd64.deb-install ] 
[ building ] [ target/sonic-broadcom.bin__broadcom__rfs.squashfs ] 
[ finished ] [ target/python-wheels/bookworm/sonic_yang_models-1.0-py3-none-any.whl-install ] 
[ building ] [ target/python-wheels/bookworm/sonic_yang_mgmt-1.0-py3-none-any.whl-install ] 
[ finished ] [ target/debs/bookworm/libsaibcm_13.2.1.7_amd64.deb-install ] 
[ building ] [ target/docker-base-bookworm.gz-load ] 
[ finished ] [ target/python-wheels/bookworm/sonic_yang_mgmt-1.0-py3-none-any.whl-install ] 
[ building ] [ target/debs/bookworm/sonic-mgmt-common_1.0.0_amd64.deb-install ] 
[ finished ] [ target/debs/bookworm/sonic-mgmt-common_1.0.0_amd64.deb-install ] 
[ building ] [ target/debs/bookworm/libsaibcm-dev_13.2.1.7_amd64.deb-install ] 
dpkg-query: package 'libsaivs-dev' is not installed and no information is available
Use dpkg --info (= dpkg-deb --info) to examine archive files.
[ finished ] [ target/debs/bookworm/libsaibcm-dev_13.2.1.7_amd64.deb-install ] 
[ building ] [ target/debs/bookworm/sonic-mgmt-common-codegen_1.0.0_amd64.deb-install ] 
[ finished ] [ target/debs/bookworm/sonic-mgmt-common-codegen_1.0.0_amd64.deb-install ] 
[ building ] [ target/debs/bookworm/sonic-mgmt-framework_1.0-01_amd64.deb ] 
[ finished ] [ target/docker-base-bookworm.gz-load ] 
[ finished ] [ target/debs/bookworm/libnl-cli-3-200_3.7.0-0.2+b1sonic1_amd64.deb-install ] 
[ building ] [ target/debs/bookworm/libnl-cli-3-dev_3.7.0-0.2+b1sonic1_amd64.deb-install ] 
[ finished ] [ target/debs/bookworm/libnl-cli-3-dev_3.7.0-0.2+b1sonic1_amd64.deb-install ] 
[ building ] [ target/debs/bookworm/libswsscommon_1.0.0_amd64.deb-install ] 
[ building ] [ target/debs/bookworm/libteam5_1.31-1_amd64.deb-install ] 
[ finished ] [ target/debs/bookworm/libswsscommon_1.0.0_amd64.deb-install ] 
[ building ] [ target/debs/bookworm/libswsscommon-dev_1.0.0_amd64.deb-install ] 
[ finished ] [ target/debs/bookworm/libswsscommon-dev_1.0.0_amd64.deb-install ] 
[ building ] [ target/debs/bookworm/python3-swsscommon_1.0.0_amd64.deb-install ] 
[ finished ] [ target/debs/bookworm/python3-swsscommon_1.0.0_amd64.deb-install ] 
[ building ] [ target/debs/bookworm/sonic-bmp_0.1_amd64.deb ] 
[ finished ] [ target/debs/bookworm/libteam5_1.31-1_amd64.deb-install ] 
[ building ] [ target/debs/bookworm/dash-ha_1.0.0_amd64.deb ] 
[ finished ] [ target/debs/bookworm/dash-ha_1.0.0_amd64.deb ] 
[ building ] [ target/debs/bookworm/libsairedis_1.0.0_amd64.deb ] 
[ finished ] [ target/debs/bookworm/sonic-mgmt-framework_1.0-01_amd64.deb ] 
[ building ] [ target/debs/bookworm/stp_1.0.0_amd64.deb ] 
[ finished ] [ target/debs/bookworm/sonic-bmp_0.1_amd64.deb ] 
[ building ] [ target/debs/bookworm/libteamdctl0_1.31-1_amd64.deb-install ] 
[ finished ] [ target/debs/bookworm/libteamdctl0_1.31-1_amd64.deb-install ] 
[ building ] [ target/debs/bookworm/sonic-gnmi_0.1_amd64.deb ] 
[ finished ] [ target/debs/bookworm/stp_1.0.0_amd64.deb ] 
[ building ] [ target/debs/bookworm/sonic-linkmgrd_1.0.0-1_amd64.deb ] 
[ finished ] [ target/debs/bookworm/sonic-gnmi_0.1_amd64.deb ] 
[ building ] [ target/debs/bookworm/sysmgr_1.0.0_amd64.deb ] 
[ finished ] [ target/debs/bookworm/libsairedis_1.0.0_amd64.deb ] 
[ building ] [ target/debs/bookworm/sonic-dhcpmon_1.0.0-0_amd64.deb ] 
[ finished ] [ target/debs/bookworm/sonic-dhcpmon_1.0.0-0_amd64.deb ] 
[ building ] [ target/debs/bookworm/sonic-dhcp6relay_1.0.0-0_amd64.deb ] 
[ finished ] [ target/sonic-broadcom.bin__broadcom__rfs.squashfs ] 
[ building ] [ target/debs/bookworm/wpasupplicant_2.9.0-14_amd64.deb ] 
[ finished ] [ target/debs/bookworm/sysmgr_1.0.0_amd64.deb ] 
[ building ] [ target/debs/bookworm/sonic-eventd_1.0.0-0_amd64.deb ] 
[ finished ] [ target/debs/bookworm/sonic-dhcp6relay_1.0.0-0_amd64.deb ] 
[ building ] [ target/python-wheels/bookworm/sonic_py_common-1.0-py3-none-any.whl ] 
[ finished ] [ target/debs/bookworm/wpasupplicant_2.9.0-14_amd64.deb ] 
[ building ] [ target/debs/bookworm/sonic-bmp_0.1_amd64.deb-install ] 
[ finished ] [ target/debs/bookworm/sonic-bmp_0.1_amd64.deb-install ] 
[ building ] [ target/debs/bookworm/libsairedis-dev_1.0.0_amd64.deb ] 
[ finished ] [ target/debs/bookworm/libsairedis-dev_1.0.0_amd64.deb ] 
[ building ] [ target/debs/bookworm/libsaimetadata_1.0.0_amd64.deb ] 
[ finished ] [ target/debs/bookworm/libsaimetadata_1.0.0_amd64.deb ] 
[ building ] [ target/debs/bookworm/libsaivs_1.0.0_amd64.deb ] 
[ finished ] [ target/debs/bookworm/libsaivs_1.0.0_amd64.deb ] 
[ building ] [ target/debs/bookworm/libsairedis_1.0.0_amd64.deb-install ] 
[ finished ] [ target/debs/bookworm/libsairedis_1.0.0_amd64.deb-install ] 
[ building ] [ target/debs/bookworm/libteam-dev_1.31-1_amd64.deb-install ] 
[ finished ] [ target/debs/bookworm/libteam-dev_1.31-1_amd64.deb-install ] 
[ building ] [ target/debs/bookworm/libteam-utils_1.31-1_amd64.deb-install ] 
[ finished ] [ target/debs/bookworm/libteam-utils_1.31-1_amd64.deb-install ] 
[ building ] [ target/debs/bookworm/libsaivs_1.0.0_amd64.deb-install ] 
[ finished ] [ target/debs/bookworm/libsaivs_1.0.0_amd64.deb-install ] 
[ building ] [ target/debs/bookworm/stp_1.0.0_amd64.deb-install ] 
[ finished ] [ target/debs/bookworm/stp_1.0.0_amd64.deb-install ] 
[ building ] [ target/debs/bookworm/syncd_1.0.0_amd64.deb ] 
[ finished ] [ target/python-wheels/bookworm/sonic_py_common-1.0-py3-none-any.whl ] 
[ building ] [ target/python-wheels/bookworm/sonic_py_common-1.0-py3-none-any.whl-install ] 
[ finished ] [ target/python-wheels/bookworm/sonic_py_common-1.0-py3-none-any.whl-install ] 
[ building ] [ target/debs/bookworm/libsaimetadata-dev_1.0.0_amd64.deb ] 
[ finished ] [ target/debs/bookworm/libsaimetadata-dev_1.0.0_amd64.deb ] 
[ building ] [ target/debs/bookworm/libsaivs-dev_1.0.0_amd64.deb ] 
[ finished ] [ target/debs/bookworm/libsaivs-dev_1.0.0_amd64.deb ] 
[ building ] [ target/debs/bookworm/libsairedis-dev_1.0.0_amd64.deb-install ] 
[ finished ] [ target/debs/bookworm/libsairedis-dev_1.0.0_amd64.deb-install ] 
[ building ] [ target/debs/bookworm/libsaimetadata_1.0.0_amd64.deb-install ] 
[ finished ] [ target/debs/bookworm/libsaimetadata_1.0.0_amd64.deb-install ] 
[ building ] [ target/debs/bookworm/libsaivs-dev_1.0.0_amd64.deb-install ] 
[ finished ] [ target/debs/bookworm/sonic-eventd_1.0.0-0_amd64.deb ] 
[ building ] [ target/python-wheels/bookworm/sonic_d-2.0.0-py3-none-any.whl ] 
[ finished ] [ target/python-wheels/bookworm/sonic_d-2.0.0-py3-none-any.whl ] 
[ building ] [ target/python-wheels/bookworm/sonic_ledd-1.1-py3-none-any.whl ] 
[ finished ] [ target/python-wheels/bookworm/sonic_ledd-1.1-py3-none-any.whl ] 
[ building ] [ target/python-wheels/bookworm/sonic_pcied-1.0-py3-none-any.whl ] 
[ finished ] [ target/python-wheels/bookworm/sonic_pcied-1.0-py3-none-any.whl ] 
[ building ] [ target/python-wheels/bookworm/sonic_stormond-1.0-py3-none-any.whl ] 
[ finished ] [ target/python-wheels/bookworm/sonic_stormond-1.0-py3-none-any.whl ] 
[ building ] [ target/python-wheels/bookworm/sonic_dhcp_utilities-1.0-py3-none-any.whl ] 
[ finished ] [ target/python-wheels/bookworm/sonic_dhcp_utilities-1.0-py3-none-any.whl ] 
[ building ] [ target/python-wheels/bookworm/sonic_ctrmgrd-1.0.0-py3-none-any.whl ] 
[ finished ] [ target/python-wheels/bookworm/sonic_ctrmgrd-1.0.0-py3-none-any.whl ] 
[ building ] [ target/debs/bookworm/sonic-rsyslog-plugin_1.0.0-0_amd64.deb ] 
[ finished ] [ target/debs/bookworm/sonic-rsyslog-plugin_1.0.0-0_amd64.deb ] 
[ building ] [ target/python-wheels/bookworm/sonic_containercfgd-1.0-py3-none-any.whl ] 
[ finished ] [ target/python-wheels/bookworm/sonic_containercfgd-1.0-py3-none-any.whl ] 
[ building ] [ target/python-wheels/bookworm/sonic_config_engine-1.0-py3-none-any.whl ] 
[ finished ] [ target/debs/bookworm/sonic-linkmgrd_1.0.0-1_amd64.deb ] 
[ building ] [ target/debs/bookworm/libsaimetadata-dev_1.0.0_amd64.deb-install ] 
[ finished ] [ target/debs/bookworm/libsaimetadata-dev_1.0.0_amd64.deb-install ] 
[ finished ] [ target/debs/bookworm/syncd_1.0.0_amd64.deb ] 
dpkg-query: package 'libsaibcm-dev' is not installed and no information is available
Use dpkg --info (= dpkg-deb --info) to examine archive files.
[ finished ] [ target/debs/bookworm/libsaivs-dev_1.0.0_amd64.deb-install ] 
[ building ] [ target/debs/bookworm/swss_1.0.0_amd64.deb ] 
[ finished ] [ target/python-wheels/bookworm/sonic_config_engine-1.0-py3-none-any.whl ] 
[ building ] [ target/docker-config-engine-bookworm.gz ] 
[ building ] [ target/python-wheels/bookworm/sonic_config_engine-1.0-py3-none-any.whl-install ] 
[ finished ] [ target/python-wheels/bookworm/sonic_config_engine-1.0-py3-none-any.whl-install ] 
[ building ] [ target/python-wheels/bookworm/sonic_platform_common-1.0-py3-none-any.whl ] 
[ building ] [ target/python-wheels/bookworm/sonic_bgpcfgd-1.0-py3-none-any.whl ] 
[ finished ] [ target/python-wheels/bookworm/sonic_platform_common-1.0-py3-none-any.whl ] 
[ building ] [ target/python-wheels/bookworm/sonic_frr_mgmt_framework-1.0-py3-none-any.whl ] 
[ finished ] [ target/python-wheels/bookworm/sonic_bgpcfgd-1.0-py3-none-any.whl ] 
[ building ] [ target/python-wheels/bookworm/sonic_platform_common-1.0-py3-none-any.whl-install ] 
[ finished ] [ target/python-wheels/bookworm/sonic_platform_common-1.0-py3-none-any.whl-install ] 
[ building ] [ target/python-wheels/bookworm/system_health-1.0-py3-none-any.whl ] 
[ finished ] [ target/python-wheels/bookworm/sonic_frr_mgmt_framework-1.0-py3-none-any.whl ] 
[ building ] [ target/python-wheels/bookworm/sonic_utilities-1.2-py3-none-any.whl ] 
[ finished ] [ target/python-wheels/bookworm/system_health-1.0-py3-none-any.whl ] 
[ building ] [ target/python-wheels/bookworm/sonic_psud-1.0-py3-none-any.whl ] 
[ finished ] [ target/python-wheels/bookworm/sonic_psud-1.0-py3-none-any.whl ] 
[ building ] [ target/python-wheels/bookworm/sonic_syseepromd-1.0-py3-none-any.whl ] 
[ finished ] [ target/python-wheels/bookworm/sonic_utilities-1.2-py3-none-any.whl ] 
[ building ] [ target/python-wheels/bookworm/sonic_thermalctld-1.0-py3-none-any.whl ] 
[ finished ] [ target/python-wheels/bookworm/sonic_syseepromd-1.0-py3-none-any.whl ] 
[ building ] [ target/python-wheels/bookworm/sonic_sensormond-1.0-py3-none-any.whl ] 
[ finished ] [ target/python-wheels/bookworm/sonic_sensormond-1.0-py3-none-any.whl ] 
[ building ] [ target/python-wheels/bookworm/sonic_xcvrd-1.0-py3-none-any.whl ] 
[ finished ] [ target/python-wheels/bookworm/sonic_thermalctld-1.0-py3-none-any.whl ] 
[ building ] [ target/python-wheels/bookworm/sonic_ycabled-1.0-py3-none-any.whl ] 
[ finished ] [ target/python-wheels/bookworm/sonic_ycabled-1.0-py3-none-any.whl ] 
[ building ] [ target/python-wheels/bookworm/sonic_chassisd-1.0-py3-none-any.whl ] 
[ finished ] [ target/python-wheels/bookworm/sonic_xcvrd-1.0-py3-none-any.whl ] 
[ building ] [ target/python-wheels/bookworm/asyncsnmp-2.1.0-py3-none-any.whl ] 
[ finished ] [ target/python-wheels/bookworm/sonic_chassisd-1.0-py3-none-any.whl ] 
[ building ] [ target/python-wheels/bookworm/sonic_utilities-1.2-py3-none-any.whl-install ] 
[ finished ] [ target/python-wheels/bookworm/sonic_utilities-1.2-py3-none-any.whl-install ] 
[ building ] [ target/python-wheels/bookworm/sonic_bmpcfgd_services-1.0-py3-none-any.whl ] 
[ finished ] [ target/docker-config-engine-bookworm.gz ] 
[ building ] [ target/python-wheels/bookworm/sonic_host_services-1.0-py3-none-any.whl ] 
[ finished ] [ target/python-wheels/bookworm/asyncsnmp-2.1.0-py3-none-any.whl ] 
[ building ] [ target/docker-config-engine-bookworm.gz-load ] 
[ finished ] [ target/docker-config-engine-bookworm.gz-load ] 
[ building ] [ target/docker-auditd-watchdog.gz ] 
[ finished ] [ target/python-wheels/bookworm/sonic_bmpcfgd_services-1.0-py3-none-any.whl ] 
[ building ] [ target/docker-auditd.gz ] 
[ finished ] [ target/debs/bookworm/swss_1.0.0_amd64.deb ] 
[ building ] [ target/docker-bmp-watchdog.gz ] 
[ finished ] [ target/docker-auditd.gz ] 
[ building ] [ target/docker-sonic-bmp.gz ] 
[ finished ] [ target/python-wheels/bookworm/sonic_host_services-1.0-py3-none-any.whl ] 
[ building ] [ target/docker-swss-layer-bookworm.gz ] 
[ finished ] [ target/docker-sonic-bmp.gz ] 
[ building ] [ target/docker-database.gz ] 
[ finished ] [ target/docker-auditd-watchdog.gz ] 
[ building ] [ target/docker-eventd.gz ] 
[ finished ] [ target/docker-bmp-watchdog.gz ] 
[ building ] [ target/docker-gnmi-watchdog.gz ] 
[ finished ] [ target/docker-swss-layer-bookworm.gz ] 
[ building ] [ target/docker-sonic-gnmi.gz ] 
[ finished ] [ target/docker-database.gz ] 
[ building ] [ target/docker-lldp.gz ] 
[ finished ] [ target/docker-eventd.gz ] 
[ building ] [ target/docker-mux.gz ] 
[ finished ] [ target/docker-sonic-gnmi.gz ] 
[ building ] [ target/docker-swss-layer-bookworm.gz-load ] 
[ finished ] [ target/docker-swss-layer-bookworm.gz-load ] 
[ building ] [ target/docker-platform-monitor.gz ] 
[ finished ] [ target/docker-mux.gz ] 
[ building ] [ target/docker-ptp.gz ] 
[ finished ] [ target/docker-lldp.gz ] 
[ building ] [ target/docker-router-advertiser.gz ] 
[ finished ] [ target/docker-ptp.gz ] 
[ building ] [ target/docker-sflow.gz ] 
[ finished ] [ target/docker-router-advertiser.gz ] 
[ building ] [ target/docker-snmp.gz ] 
[ finished ] [ target/docker-gnmi-watchdog.gz ] 
[ building ] [ target/docker-sonic-mgmt-framework.gz ] 
[ finished ] [ target/docker-sflow.gz ] 
[ building ] [ target/docker-stp.gz ] 
[ finished ] [ target/docker-platform-monitor.gz ] 
[ building ] [ target/docker-sysmgr.gz ] 
[ finished ] [ target/docker-sonic-mgmt-framework.gz ] 
[ building ] [ target/docker-teamd.gz ] 
[ finished ] [ target/docker-stp.gz ] 
[ building ] [ target/docker-sonic-gnmi.gz-load ] 
[ finished ] [ target/docker-snmp.gz ] 
[ building ] [ target/docker-syncd-brcm.gz ] 
[ finished ] [ target/docker-sonic-gnmi.gz-load ] 
[ building ] [ target/docker-gbsyncd-credo.gz ] 
[ finished ] [ target/docker-sysmgr.gz ] 
[ building ] [ target/docker-gbsyncd-broncos.gz ] 
[ finished ] [ target/docker-teamd.gz ] 
[ building ] [ target/docker-dhcp-relay.gz ] 
/sonic/dockers/docker-dhcp-relay/cli-plugin-tests /sonic
/sonic
[ finished ] [ target/docker-gbsyncd-credo.gz ] 
[ building ] [ target/docker-macsec.gz ] 
/sonic/dockers/docker-macsec/cli-plugin-tests /sonic
/sonic
[ finished ] [ target/docker-gbsyncd-broncos.gz ] 
[ building ] [ target/docker-dash-ha.gz ] 
[ finished ] [ target/docker-syncd-brcm.gz ] 
[ building ] [ target/docker-fpm-frr.gz ] 
[ finished ] [ target/docker-macsec.gz ] 
[ building ] [ target/docker-nat.gz ] 
[ finished ] [ target/docker-dash-ha.gz ] 
[ building ] [ target/docker-orchagent.gz ] 
[ finished ] [ target/docker-dhcp-relay.gz ] 
[ building ] [ target/docker-sonic-telemetry.gz ] 
[ finished ] [ target/docker-nat.gz ] 
[ building ] [ target/docker-syncd-brcm-dnx.gz ] 
[ finished ] [ target/docker-fpm-frr.gz ] 
[ finished ] [ target/docker-sonic-telemetry.gz ] 
[ finished ] [ target/docker-orchagent.gz ] 
[ finished ] [ target/docker-syncd-brcm-dnx.gz ] 
basename: missing operand
Try 'basename --help' for more information.
basename: missing operand
Try 'basename --help' for more information.
[ building ] [ target/sonic-broadcom.bin ] 
[ building ] [ target/sonic-aboot-broadcom.swi ] 
[ finished ] [ target/sonic-broadcom.bin ] 
[ FAIL LOG START ] [ target/sonic-broadcom.bin ]
Build start time: Thu Sep 24 06:13:16 UTC 2026
++ '[' -f .arch ']'
++ cat .arch
+ CONFIGURED_ARCH=amd64
+ DOCKER_VERSION=5:24.0.2-1~debian.12~bookworm
+ CONTAINERD_IO_VERSION=1.6.21-1
+ LINUX_KERNEL_VERSION=6.1.0-29-2
+ FILESYSTEM_ROOT=./fsroot
+ PLATFORM_DIR=platform
+ HOSTNAME=sonic
+ DEFAULT_USERINFO='Default admin user,,,'
+ BUILD_TOOL_PATH=src/sonic-build-hooks/buildinfo
+ TRUSTED_GPG_DIR=src/sonic-build-hooks/buildinfo/trusted.gpg.d
+ . ./onie-image.conf
++ : 32768
++ : x86_64
++ : broadcom
++ ONIEIMAGE_VERSION=r0
++ FILESYSTEM_ROOT=./fsroot-broadcom
++ FILESYSTEM_SQUASHFS=fs.squashfs
++ INSTALLER_PAYLOAD=fs.zip
++ FILESYSTEM_DOCKERFS=dockerfs.tar.gz
++ DOCKERFS_DIR=docker
++ DOCKER_RAMFS_SIZE=3500M
++ OUTPUT_ONIE_IMAGE=target/sonic-broadcom.bin
++ OUTPUT_RAW_IMAGE=target/sonic-broadcom.raw
++ RAW_IMAGE_DISK_SIZE=1700
++ OUTPUT_KVM_IMAGE=target/sonic-broadcom.img
++ KVM_IMAGE_DISK_SIZE=16
++ OUTPUT_ABOOT_IMAGE=target/sonic-aboot-broadcom.swi
++ ABOOT_BOOT_IMAGE=.sonic-boot.swi
++ OUTPUT_KVM_4ASIC_IMAGE=target/sonic-4asic-broadcom.img
++ OUTPUT_KVM_6ASIC_IMAGE=target/sonic-6asic-broadcom.img
++ OUTPUT_DSC_IMAGE=target/sonic-broadcom.tar
+ '[' -n 32768 ']'
+ '[' -n fs.zip ']'
+ '[' -n fs.squashfs ']'
+ '[' onie = aboot ']'
+ [[ y != y ]]
+ [[ n == y ]]
+ [[ y == y ]]
+ echo '[INFO] RFS build: second stage'
[INFO] RFS build: second stage
+ sudo mount proc /proc -t proc
+ sudo fuser -vm ./fsroot-broadcom
                     USER        PID ACCESS COMMAND
/sonic/fsroot-broadcom:
                     root     kernel mount /usr/sbin/docker-init
                     jenkins       1 ..ce. docker-init
                     jenkins       7 ..c.. bash
                     jenkins       8 ..c.. make
                     root       8261 ....m dockerd
                     root       8427 ....m containerd
                     jenkins   475144 ..c.. bash
                     jenkins   475434 ..c.. bash
                     jenkins   475632 ..c.. build_debian.sh
                     jenkins   475633 ..c.. process_log.sh
                     root      475641 ..c.. sudo
                     jenkins   475642 ..c.. j2
+ sudo rm -rf ./fsroot-broadcom
+ sudo unsquashfs -d ./fsroot-broadcom target/sonic-broadcom.bin__broadcom__rfs.squashfs
Parallel unsquashfs: Using 112 processors
33651 inodes (34124 blocks) to write


[=======/                                                    ]  8447/67775  12%
[===========-                                                ] 13643/67775  20%
[==================\                                         ] 21184/67775  31%
[============================|                               ] 32878/67775  48%
set_attributes: failed to set time on ./fsroot-broadcom/usr/share/base-files/dot.bashrc, because No such file or directory

set_attributes: failed to set time on ./fsroot-broadcom/usr/share/base-files/dot.profile, because No such file or directory

set_attributes: failed to set time on ./fsroot-broadcom/usr/share/base-files/dot.profile.md5sums, because No such file or directory

set_attributes: failed to set time on ./fsroot-broadcom/usr/share/base-files/info.dir, because No such file or directory

set_attributes: failed to set time on ./fsroot-broadcom/usr/share/base-files/motd, because No such file or directory

set_attributes: failed to set time on ./fsroot-broadcom/usr/share/base-files/profile, because No such file or directory

set_attributes: failed to set time on ./fsroot-broadcom/usr/share/base-files/profile.md5sums, because No such file or directory

set_attributes: failed to set time on ./fsroot-broadcom/usr/share/base-files/staff-group-for-usr-local, because No such file or directory

set_attributes: failed to set time on ./fsroot-broadcom/usr/share/base-files, because No such file or directory

set_attributes: failed to set time on ./fsroot-broadcom/usr/share/chrony/chrony.conf, because No such file or directory

set_attributes: failed to set time on ./fsroot-broadcom/usr/share/chrony/chrony.keys, because No such file or directory

set_attributes: failed to set time on ./fsroot-broadcom/usr/share/chrony, because No such file or directory

set_attributes: failed to set time on ./fsroot-broadcom/usr/share/common-licenses/Apache-2.0, because No such file or directory

set_attributes: failed to set time on ./fsroot-broadcom/usr/share/common-licenses/Artistic, because No such file or directory

set_attributes: failed to set time on ./fsroot-broadcom/usr/share/common-licenses/BSD, because No such file or directory

set_attributes: failed to set time on ./fsroot-broadcom/usr/share/common-licenses/CC0-1.0, because No such file or directory

set_attributes: failed to set time on ./fsroot-broadcom/usr/share/common-licenses/GFDL-1.2, because No such file or directory

set_attributes: failed to set time on ./fsroot-broadcom/usr/share/common-licenses/GFDL-1.3, because No such file or directory

set_attributes: failed to set time on ./fsroot-broadcom/usr/share/common-licenses/GPL-1, because No such file or directory

set_attributes: failed to set time on ./fsroot-broadcom/usr/share/common-licenses/GPL-2, because No such file or directory

set_attributes: failed to set time on ./fsroot-broadcom/usr/share/common-licenses/GPL-3, because No such file or directory

set_attributes: failed to set time on ./fsroot-broadcom/usr/share/common-licenses/LGPL-2, because No such file or directory

set_attributes: failed to set time on ./fsroot-broadcom/usr/share/common-licenses/LGPL-2.1, because No such file or directory

set_attributes: failed to set time on ./fsroot-broadcom/usr/share/common-licenses/LGPL-3, because No such file or directory

set_attributes: failed to set time on ./fsroot-broadcom/usr/share/common-licenses/MPL-1.1, because No such file or directory

set_attributes: failed to set time on ./fsroot-broadcom/usr/share/common-licenses/MPL-2.0, because No such file or directory

set_attributes: failed to set time on ./fsroot-broadcom/usr/share/common-licenses, because No such file or directory

set_attributes: failed to set time on ./fsroot-broadcom/usr/share/debconf/confmodule, because No such file or directory

set_attributes: failed to set time on ./fsroot-broadcom/usr/share/debconf/confmodule.sh, because No such file or directory

set_attributes: failed to set time on ./fsroot-broadcom/usr/share/debconf/debconf.conf, because No such file or directory

set_attributes: failed to set time on ./fsroot-broadcom/usr/share/debconf/fix_db.pl, because No such file or directory

set_attributes: failed to set time on ./fsroot-broadcom/usr/share/debconf/frontend, because No such file or directory

set_attributes: failed to set time on ./fsroot-broadcom/usr/share/debconf, because No such file or directory

set_attributes: failed to set time on ./fsroot-broadcom/usr/share/debianutils/shells, because No such file or directory

set_attributes: failed to set time on ./fsroot-broadcom/usr/share/debianutils/shells.d/bash, because No such file or directory

set_attributes: failed to set time on ./fsroot-broadcom/usr/share/debianutils/shells.d/dash, because No such file or directory

set_attributes: failed to set time on ./fsroot-broadcom/usr/share/debianutils/shells.d/screen, because No such file or directory

set_attributes: failed to set time on ./fsroot-broadcom/usr/share/debianutils/shells.d, because No such file or directory

set_attributes: failed to set time on ./fsroot-broadcom/usr/share/debianutils, because No such file or directory

set_attributes: failed to set time on ./fsroot-broadcom/usr/share/dict, because No such file or directory

set_attributes: failed to set time on ./fsroot-broadcom/usr/share/doc/acl/changelog.Debian.gz, because No such file or directory

set_attributes: failed to set time on ./fsroot-broadcom/usr/share/doc/acl/changelog.gz, because No such file or directory

set_attributes: failed to set time on ./fsroot-broadcom/usr/share/doc/acl/copyright, because No such file or directory

set_attributes: failed to set time on ./fsroot-broadcom/usr/share/doc/acl, because No such file or directory

set_attributes: failed to set time on ./fsroot-broadcom/usr/share/doc/adduser/NEWS.Debian.gz, because No such file or directory

set_attributes: failed to set time on ./fsroot-broadcom/usr/share/doc/adduser/README.gz, because No such file or directory

set_attributes: failed to set time on ./fsroot-broadcom/usr/share/doc/adduser/TODO, because No such file or directory

set_attributes: failed to set time on ./fsroot-broadcom/usr/share/doc/adduser/changelog.gz, because No such file or directory

set_attributes: failed to set time on ./fsroot-broadcom/usr/share/doc/adduser/copyright, because No such file or directory

set_attributes: failed to set time on ./fsroot-broadcom/usr/share/doc/adduser/examples/INSTALL, because No such file or directory

set_attributes: failed to set time on ./fsroot-broadcom/usr/share/doc/adduser/examples/README, because No such file or directory

set_attributes: failed to set time on ./fsroot-broadcom/usr/share/doc/adduser/examples/adduser.conf, because No such file or directory

set_attributes: failed to set time on ./fsroot-broadcom/usr/share/doc/adduser/examples/adduser.local, because No such file or directory

set_attributes: failed to set time on ./fsroot-broadcom/usr/share/doc/adduser/examples/adduser.local.conf, because No such file or directory

set_attributes: failed to set time on ./fsroot-broadcom/usr/share/doc/adduser/examples/adduser.local.conf.examples/bash.bashrc, because No such file or directory

set_attributes: failed to set time on ./fsroot-broadcom/usr/share/doc/adduser/examples/adduser.local.conf.examples/profile, because No such file or directory

set_attributes: failed to set time on ./fsroot-broadcom/usr/share/doc/adduser/examples/adduser.local.conf.examples/skel/dot.bash_logout, because No such file or directory

set_attributes: failed to set time on ./fsroot-broadcom/usr/share/doc/adduser/examples/adduser.local.conf.examples/skel/dot.bash_profile, because No such file or directory

set_attributes: failed to set time on ./fsroot-broadcom/usr/share/doc/adduser/examples/adduser.local.conf.examples/skel/dot.bashrc, because No such file or directory

set_attributes: failed to set time on ./fsroot-broadcom/usr/share/doc/adduser/examples/adduser.local.conf.examples/skel, because No such file or directory

set_attributes: failed to set time on ./fsroot-broadcom/usr/share/doc/adduser/examples/adduser.local.conf.examples/skel.other/index.html, because No such file or directory

set_attributes: failed to set time on ./fsroot-broadcom/usr/share/doc/adduser/examples/adduser.local.conf.examples/skel.other, because No such file or directory

set_attributes: failed to set time on ./fsroot-broadcom/usr/share/doc/adduser/examples/adduser.local.conf.examples, because No such file or directory

set_attributes: failed to set time on ./fsroot-broadcom/usr/share/doc/adduser/examples/deluser.conf, because No such file or directory

set_attributes: failed to set time on ./fsroot-broadcom/usr/share/doc/adduser/examples, because No such file or directory

set_attributes: failed to set time on ./fsroot-broadcom/usr/share/doc/adduser, because No such file or directory

set_attributes: failed to set time on ./fsroot-broadcom/usr/share/doc/apparmor/README.Debian, because No such file or directory

set_attributes: failed to set time on ./fsroot-broadcom/usr/share/doc/apparmor/changelog.Debian.gz, because No such file or directory

set_attributes: failed to set time on ./fsroot-broadcom/usr/share/doc/apparmor/copyright, because No such file or directory

set_attributes: failed to set time on ./fsroot-broadcom/usr/share/doc/apparmor, because No such file or directory

set_attributes: failed to set time on ./fsroot-broadcom/usr/share/doc/apt/NEWS.Debian.gz, because No such file or directory

set_attributes: failed to set time on ./fsroot-broadcom/usr/share/doc/apt/README.md.gz, because No such file or directory

set_attributes: failed to set time on ./fsroot-broadcom/usr/share/doc/apt/changelog.gz, because No such file or directory

set_attributes: failed to set time on ./fsroot-broadcom/usr/share/doc/apt/copyright, because No such file or directory

set_attributes: failed to set time on ./fsroot-broadcom/usr/share/doc/apt/examples/apt.conf, because No such file or directory

set_attributes: failed to set time on ./fsroot-broadcom/usr/share/doc/apt/examples/configure-index, because No such file or directory

set_attributes: failed to set time on ./fsroot-broadcom/usr/share/doc/apt/examples/preferences, because No such file or directory

set_attributes: failed to set time on ./fsroot-broadcom/usr/share/doc/apt/examples/sources.list, because No such file or directory

set_attributes: failed to set time on ./fsroot-broadcom/usr/share/doc/apt/examples, because No such file or directory

set_attributes: failed to set time on ./fsroot-broadcom/usr/share/doc/apt, because No such file or directory

set_attributes: failed to set time on ./fsroot-broadcom/usr/share/doc/apt-transport-https/NEWS.Debian.gz, because No such file or directory

set_attributes: failed to set time on ./fsroot-broadcom/usr/share/doc/apt-transport-https/changelog.gz, because No such file or directory

set_attributes: failed to set time on ./fsroot-broadcom/usr/share/doc/apt-transport-https/copyright, because No such file or directory

set_attributes: failed to set time on ./fsroot-broadcom/usr/share/doc/apt-transport-https, because No such file or directory

set_attributes: failed to set time on ./fsroot-broadcom/usr/share/doc/arping/README.Debian, because No such file or directory

set_attributes: failed to set time on ./fsroot-broadcom/usr/share/doc/arping/README.gz, because No such file or directory

set_attributes: failed to set time on ./fsroot-broadcom/usr/share/doc/arping/changelog.Debian.gz, because No such file or directory

set_attributes: failed to set time on ./fsroot-broadcom/usr/share/doc/arping/copyright, because No such file or directory

set_attributes: failed to set time on ./fsroot-broadcom/usr/share/doc/arping/examples/arping-scan-net.sh, because No such file or directory

set_attributes: failed to set time on ./fsroot-broadcom/usr/share/doc/arping/examples/arping.default, because No such file or directory

set_attributes: failed to set time on ./fsroot-broadcom/usr/share/doc/arping/examples/arping.if-up, because No such file or directory

set_attributes: failed to set time on ./fsroot-broadcom/usr/share/doc/arping/examples, because No such file or directory

set_attributes: failed to set time on ./fsroot-broadcom/usr/share/doc/arping, because No such file or directory

set_attributes: failed to set time on ./fsroot-broadcom/usr/share/doc/auditd/NEWS.Debian.gz, because No such file or directory

set_attributes: failed to set time on ./fsroot-broadcom/usr/share/doc/auditd/README.Debian, because No such file or directory

set_attributes: failed to set time on ./fsroot-broadcom/usr/share/doc/auditd/README.gz, because No such file or directory

set_attributes: failed to set time on ./fsroot-broadcom/usr/share/doc/auditd/changelog.Debian.gz, because No such file or directory

set_attributes: failed to set time on ./fsroot-broadcom/usr/share/doc/auditd/changelog.gz, because No such file or directory

set_attributes: failed to set time on ./fsroot-broadcom/usr/share/doc/auditd/copyright, because No such file or directory

set_attributes: failed to set time on ./fsroot-broadcom/usr/share/doc/auditd/examples/auditd.cron, because No such file or directory

set_attributes: failed to set time on ./fsroot-broadcom/usr/share/doc/auditd/examples/rules/10-base-config.rules, because No such file or directory

set_attributes: failed to set time on ./fsroot-broadcom/usr/share/doc/auditd/examples/rules/10-no-audit.rules, because No such file or directory

set_attributes: failed to set time on ./fsroot-broadcom/usr/share/doc/auditd/examples/rules/11-loginuid.rules, because No such file or directory

set_attributes: failed to set time on ./fsroot-broadcom/usr/share/doc/auditd/examples/rules/12-cont-fail.rules, because No such file or directory

set_attributes: failed to set time on ./fsroot-broadcom/usr/share/doc/auditd/examples/rules/12-ignore-error.rules, because No such file or directory

set_attributes: failed to set time on ./fsroot-broadcom/usr/share/doc/auditd/examples/rules/20-dont-audit.rules, because No such file or directory

set_attributes: failed to set time on ./fsroot-broadcom/usr/share/doc/auditd/examples/rules/21-no32bit.rules, because No such file or directory

set_attributes: failed to set time on ./fsroot-broadcom/usr/share/doc/auditd/examples/rules/22-ignore-chrony.rules, because No such file or directory

set_attributes: failed to set time on ./fsroot-broadcom/usr/share/doc/auditd/examples/rules/23-ignore-filesystems.rules, because No such file or directory

set_attributes: failed to set time on ./fsroot-broadcom/usr/share/doc/auditd/examples/rules/30-nispom.rules, because No such file or directory

set_attributes: failed to set time on ./fsroot-broadcom/usr/share/doc/auditd/examples/rules/30-ospp-v42-1-create-failed.rules, because No such file or directory

set_attributes: failed to set time on ./fsroot-broadcom/usr/share/doc/auditd/examples/rules/30-ospp-v42-1-create-success.rules, because No such file or directory

set_attributes: failed to set time on ./fsroot-broadcom/usr/share/doc/auditd/examples/rules/30-ospp-v42-2-modify-failed.rules, because No such file or directory

set_attributes: failed to set time on ./fsroot-broadcom/usr/share/doc/auditd/examples/rules/30-ospp-v42-2-modify-success.rules, because No such file or directory

set_attributes: failed to set time on ./fsroot-broadcom/usr/share/doc/auditd/examples/rules/30-ospp-v42-3-access-failed.rules, because No such file or directory

set_attributes: failed to set time on ./fsroot-broadcom/usr/share/doc/auditd/examples/rules/30-ospp-v42-3-access-success.rules, because No such file or directory

set_attributes: failed to set time on ./fsroot-broadcom/usr/share/doc/auditd/examples/rules/30-ospp-v42-4-delete-failed.rules, because No such file or directory

set_attributes: failed to set time on ./fsroot-broadcom/usr/share/doc/auditd/examples/rules/30-ospp-v42-4-delete-success.rules, because No such file or directory

set_attributes: failed to set time on ./fsroot-broadcom/usr/share/doc/auditd/examples/rules/30-ospp-v42-5-perm-change-failed.rules, because No such file or directory

set_attributes: failed to set time on ./fsroot-broadcom/usr/share/doc/auditd/examples/rules/30-ospp-v42-5-perm-change-success.rules, because No such file or directory

set_attributes: failed to set time on ./fsroot-broadcom/usr/share/doc/auditd/examples/rules/30-ospp-v42-6-owner-change-failed.rules, because No such file or directory

set_attributes: failed to set time on ./fsroot-broadcom/usr/share/doc/auditd/examples/rules/30-ospp-v42-6-owner-change-success.rules, because No such file or directory

set_attributes: failed to set time on ./fsroot-broadcom/usr/share/doc/auditd/examples/rules/30-ospp-v42.rules, because No such file or directory

set_attributes: failed to set time on ./fsroot-broadcom/usr/share/doc/auditd/examples/rules/30-pci-dss-v31.rules, because No such file or directory

set_attributes: failed to set time on ./fsroot-broadcom/usr/share/doc/auditd/examples/rules/30-stig.rules, because No such file or directory

set_attributes: failed to set time on ./fsroot-broadcom/usr/share/doc/auditd/examples/rules/31-privileged.rules, because No such file or directory

set_attributes: failed to set time on ./fsroot-broadcom/usr/share/doc/auditd/examples/rules/32-power-abuse.rules, because No such file or directory

set_attributes: failed to set time on ./fsroot-broadcom/usr/share/doc/auditd/examples/rules/40-local.rules, because No such file or directory

set_attributes: failed to set time on ./fsroot-broadcom/usr/share/doc/auditd/examples/rules/41-containers.rules, because No such file or directory

set_attributes: failed to set time on ./fsroot-broadcom/usr/share/doc/auditd/examples/rules/42-injection.rules, because No such file or directory

set_attributes: failed to set time on ./fsroot-broadcom/usr/share/doc/auditd/examples/rules/43-module-load.rules, because No such file or directory

set_attributes: failed to set time on ./fsroot-broadcom/usr/share/doc/auditd/examples/rules/44-installers.rules, because No such file or directory

set_attributes: failed to set time on ./fsroot-broadcom/usr/share/doc/auditd/examples/rules/70-einval.rules, because No such file or directory

set_attributes: failed to set time on ./fsroot-broadcom/usr/share/doc/auditd/examples/rules/71-networking.rules, because No such file or directory

set_attributes: failed to set time on ./fsroot-broadcom/usr/share/doc/auditd/examples/rules/99-finalize.rules, because No such file or directory

set_attributes: failed to set time on ./fsroot-broadcom/usr/share/doc/auditd/examples/rules/README-rules, because No such file or directory

set_attributes: failed to set time on ./fsroot-broadcom/usr/share/doc/auditd/examples/rules, because No such file or directory

set_attributes: failed to set time on ./fsroot-broadcom/usr/share/doc/auditd/examples, because No such file or directory

set_attributes: failed to set time on ./fsroot-broadcom/usr/share/doc/auditd, because No such file or directory

set_attributes: failed to set time on ./fsroot-broadcom/usr/share/doc/base-files/README, because No such file or directory

set_attributes: failed to set time on ./fsroot-broadcom/usr/share/doc/base-files/README.FHS, because No such file or directory

set_attributes: failed to set time on ./fsroot-broadcom/usr/share/doc/base-files/changelog.gz, because No such file or directory

set_attributes: failed to set time on ./fsroot-broadcom/usr/share/doc/base-files/copyright, because No such file or directory

set_attributes: failed to set time on ./fsroot-broadcom/usr/share/doc/base-files, because No such file or directory

set_attributes: failed to set time on ./fsroot-broadcom/usr/share/doc/base-passwd/README, because No such file or directory

set_attributes: failed to set time on ./fsroot-broadcom/usr/share/doc/base-passwd/changelog.gz, because No such file or directory

set_attributes: failed to set time on ./fsroot-broadcom/usr/share/doc/base-passwd/copyright, because No such file or directory

set_attributes: failed to set time on ./fsroot-broadcom/usr/share/doc/base-passwd/users-and-groups.html, because No such file or directory

set_attributes: failed to set time on ./fsroot-broadcom/usr/share/doc/base-passwd/users-and-groups.txt.gz, because No such file or directory

set_attributes: failed to set time on ./fsroot-broadcom/usr/share/doc/base-passwd, because No such file or directory

set_attributes: failed to set time on ./fsroot-broadcom/usr/share/doc/bash/CHANGES.gz, because No such file or directory

set_attributes: failed to set time on ./fsroot-broadcom/usr/share/doc/bash/COMPAT.gz, because No such file or directory

set_attributes: failed to set time on ./fsroot-broadcom/usr/share/doc/bash/INTRO.gz, because No such file or directory

set_attributes: failed to set time on ./fsroot-broadcom/usr/share/doc/bash/NEWS.gz, because No such file or directory

set_attributes: failed to set time on ./fsroot-broadcom/usr/share/doc/bash/POSIX.gz, because No such file or directory

set_attributes: failed to set time on ./fsroot-broadcom/usr/share/doc/bash/RBASH, because No such file or directory

set_attributes: failed to set time on ./fsroot-broadcom/usr/share/doc/bash/README.Debian.gz, because No such file or directory

set_attributes: failed to set time on ./fsroot-broadcom/usr/share/doc/bash/README.abs-guide, because No such file or directory

set_attributes: failed to set time on ./fsroot-broadcom/usr/share/doc/bash/README.commands.gz, because No such file or directory

set_attributes: failed to set time on ./fsroot-broadcom/usr/share/doc/bash/README.gz, because No such file or directory

set_attributes: failed to set time on ./fsroot-broadcom/usr/share/doc/bash/changelog.Debian.amd64.gz, because No such file or directory

set_attributes: failed to set time on ./fsroot-broadcom/usr/share/doc/bash/changelog.Debian.gz, because No such file or directory

set_attributes: failed to set time on ./fsroot-broadcom/usr/share/doc/bash/changelog.gz, because No such file or directory

set_attributes: failed to set time on ./fsroot-broadcom/usr/share/doc/bash/copyright, because No such file or directory

set_attributes: failed to set time on ./fsroot-broadcom/usr/share/doc/bash/inputrc.arrows, because No such file or directory

set_attributes: failed to set time on ./fsroot-broadcom/usr/share/doc/bash, because No such file or directory

set_attributes: failed to set time on ./fsroot-broadcom/usr/share/doc/binutils/NEWS.gz, because No such file or directory

set_attributes: failed to set time on ./fsroot-broadcom/usr/share/doc/binutils/README.cross.gz, because No such file or directory

set_attributes: failed to set time on ./fsroot-broadcom/usr/share/doc/binutils/bfd/ChangeLog.gz, because No such file or directory

set_attributes: failed to set time on ./fsroot-broadcom/usr/share/doc/binutils/bfd/PORTING.gz, because No such file or directory

set_attributes: failed to set time on ./fsroot-broadcom/usr/share/doc/binutils/bfd/TODO.gz, because No such file or directory

set_attributes: failed to set time on ./fsroot-broadcom/usr/share/doc/binutils/bfd, because No such file or directory

set_attributes: failed to set time on ./fsroot-broadcom/usr/share/doc/binutils/changelog.Debian.gz, because No such file or directory

set_attributes: failed to set time on ./fsroot-broadcom/usr/share/doc/binutils/changelog.gz, because No such file or directory

set_attributes: failed to set time on ./fsroot-broadcom/usr/share/doc/binutils/copyright, because No such file or directory

set_attributes: failed to set time on ./fsroot-broadcom/usr/share/doc/binutils/gas/ChangeLog.gz, because No such file or directory

set_attributes: failed to set time on ./fsroot-broadcom/usr/share/doc/binutils/gas/NEWS.gz, because No such file or directory

set_attributes: failed to set time on ./fsroot-broadcom/usr/share/doc/binutils/gas, because No such file or directory

set_attributes: failed to set time on ./fsroot-broadcom/usr/share/doc/binutils/gprof/ChangeLog.gz, because No such file or directory

set_attributes: failed to set time on ./fsroot-broadcom/usr/share/doc/binutils/gprof/TEST.gz, because No such file or directory

set_attributes: failed to set time on ./fsroot-broadcom/usr/share/doc/binutils/gprof/TODO.gz, because No such file or directory

set_attributes: failed to set time on ./fsroot-broadcom/usr/share/doc/binutils/gprof/bbconv.pl, because No such file or directory

set_attributes: failed to set time on ./fsroot-broadcom/usr/share/doc/binutils/gprof, because No such file or directory

set_attributes: failed to set time on ./fsroot-broadcom/usr/share/doc/binutils/ld/ChangeLog.gz, because No such file or directory

set_attributes: failed to set time on ./fsroot-broadcom/usr/share/doc/binutils/ld/NEWS.gz, because No such file or directory

set_attributes: failed to set time on ./fsroot-broadcom/usr/share/doc/binutils/ld/TODO.gz, because No such file or directory

set_attributes: failed to set time on ./fsroot-broadcom/usr/share/doc/binutils/ld, because No such file or directory

set_attributes: failed to set time on ./fsroot-broadcom/usr/share/doc/binutils/test-summary-amd64.gz, because No such file or directory

set_attributes: failed to set time on ./fsroot-broadcom/usr/share/doc/binutils, because No such file or directory

set_attributes: failed to set time on ./fsroot-broadcom/usr/share/doc/binutils-common/changelog.Debian.gz, because No such file or directory

set_attributes: failed to set time on ./fsroot-broadcom/usr/share/doc/binutils-common/copyright, because No such file or directory

set_attributes: failed to set time on ./fsroot-broadcom/usr/share/doc/binutils-common, because No such file or directory

set_attributes: failed to set time on ./fsroot-broadcom/usr/share/doc/bridge-utils/FAQ, because No such file or directory

set_attributes: failed to set time on ./fsroot-broadcom/usr/share/doc/bridge-utils/FIREWALL, because No such file or directory

set_attributes: failed to set time on ./fsroot-broadcom/usr/share/doc/bridge-utils/HOWTO, because No such file or directory

set_attributes: failed to set time on ./fsroot-broadcom/usr/share/doc/bridge-utils/NEWS.Debian.gz, because No such file or directory

set_attributes: failed to set time on ./fsroot-broadcom/usr/share/doc/bridge-utils/PROJECTS, because No such file or directory

set_attributes: failed to set time on ./fsroot-broadcom/usr/share/doc/bridge-utils/README, because No such file or directory

set_attributes: failed to set time on ./fsroot-broadcom/usr/share/doc/bridge-utils/README.Debian, because No such file or directory

set_attributes: failed to set time on ./fsroot-broadcom/usr/share/doc/bridge-utils/THANKS, because No such file or directory

set_attributes: failed to set time on ./fsroot-broadcom/usr/share/doc/bridge-utils/WISHLIST, because No such file or directory

set_attributes: failed to set time on ./fsroot-broadcom/usr/share/doc/bridge-utils/changelog.Debian.gz, because No such file or directory

set_attributes: failed to set time on ./fsroot-broadcom/usr/share/doc/bridge-utils/changelog.gz, because No such file or directory

set_attributes: failed to set time on ./fsroot-broadcom/usr/share/doc/bridge-utils/copyright, because No such file or directory

set_attributes: failed to set time on ./fsroot-broadcom/usr/share/doc/bridge-utils/examples/bridge.service, because No such file or directory

set_attributes: failed to set time on ./fsroot-broadcom/usr/share/doc/bridge-utils/examples/hibernate, because No such file or directory

set_attributes: failed to set time on ./fsroot-broadcom/usr/share/doc/bridge-utils/examples/interfaces.hotplug.wifi, because No such file or directory

set_attributes: failed to set time on ./fsroot-broadcom/usr/share/doc/bridge-utils/examples/interfaces.networkmanager, because No such file or directory

set_attributes: failed to set time on ./fsroot-broadcom/usr/share/doc/bridge-utils/examples/pm-utils, because No such file or directory

set_attributes: failed to set time on ./fsroot-broadcom/usr/share/doc/bridge-utils/examples, because No such file or directory

set_attributes: failed to set time on ./fsroot-broadcom/usr/share/doc/bridge-utils, because No such file or directory

set_attributes: failed to set time on ./fsroot-broadcom/usr/share/doc/bsdextrautils/changelog.Debian.gz, because No such file or directory

set_attributes: failed to set time on ./fsroot-broadcom/usr/share/doc/bsdextrautils/changelog.gz, because No such file or directory

set_attributes: failed to set time on ./fsroot-broadcom/usr/share/doc/bsdextrautils/copyright, because No such file or directory

set_attributes: failed to set time on ./fsroot-broadcom/usr/share/doc/bsdextrautils, because No such file or directory

set_attributes: failed to set time on ./fsroot-broadcom/usr/share/doc/bsdmainutils/NEWS.Debian.gz, because No such file or directory

set_attributes: failed to set time on ./fsroot-broadcom/usr/share/doc/bsdmainutils/changelog.gz, because No such file or directory

set_attributes: failed to set time on ./fsroot-broadcom/usr/share/doc/bsdmainutils/copyright, because No such file or directory

set_attributes: failed to set time on ./fsroot-broadcom/usr/share/doc/bsdmainutils, because No such file or directory

set_attributes: failed to set time on ./fsroot-broadcom/usr/share/doc/bsdutils/changelog.Debian.gz, because No such file or directory

set_attributes: failed to set time on ./fsroot-broadcom/usr/share/doc/bsdutils/changelog.gz, because No such file or directory

set_attributes: failed to set time on ./fsroot-broadcom/usr/share/doc/bsdutils/copyright, because No such file or directory

set_attributes: failed to set time on ./fsroot-broadcom/usr/share/doc/bsdutils, because No such file or directory

set_attributes: failed to set time on ./fsroot-broadcom/usr/share/doc/busybox/changelog.Debian.amd64.gz, because No such file or directory

set_attributes: failed to set time on ./fsroot-broadcom/usr/share/doc/busybox/changelog.Debian.gz, because No such file or directory

set_attributes: failed to set time on ./fsroot-broadcom/usr/share/doc/busybox/copyright, because No such file or directory

set_attributes: failed to set time on ./fsroot-broadcom/usr/share/doc/busybox/mdev.txt.gz, because No such file or directory

set_attributes: failed to set time on ./fsroot-broadcom/usr/share/doc/busybox/syslog.conf.txt, because No such file or directory

set_attributes: failed to set time on ./fsroot-broadcom/usr/share/doc/busybox, because No such file or directory

set_attributes: failed to set time on ./fsroot-broadcom/usr/share/doc/ca-certificates/README.Debian, because No such file or directory

set_attributes: failed to set time on ./fsroot-broadcom/usr/share/doc/ca-certificates/changelog.gz, because No such file or directory

set_attributes: failed to set time on ./fsroot-broadcom/usr/share/doc/ca-certificates/copyright, because No such file or directory

set_attributes: failed to set time on ./fsroot-broadcom/usr/share/doc/ca-certificates/examples/ca-certificates-local/Makefile, because No such file or directory

set_attributes: failed to set time on ./fsroot-broadcom/usr/share/doc/ca-certificates/examples/ca-certificates-local/README, because No such file or directory

set_attributes: failed to set time on ./fsroot-broadcom/usr/share/doc/ca-certificates/examples/ca-certificates-local/debian/ca-certificates-local.triggers, because No such file or directory

set_attributes: failed to set time on ./fsroot-broadcom/usr/share/doc/ca-certificates/examples/ca-certificates-local/debian/changelog, because No such file or directory

set_attributes: failed to set time on ./fsroot-broadcom/usr/share/doc/ca-certificates/examples/ca-certificates-local/debian/compat, because No such file or directory

set_attributes: failed to set time on ./fsroot-broadcom/usr/share/doc/ca-certificates/examples/ca-certificates-local/debian/control, because No such file or directory

set_attributes: failed to set time on ./fsroot-broadcom/usr/share/doc/ca-certificates/examples/ca-certificates-local/debian/copyright, because No such file or directory

set_attributes: failed to set time on ./fsroot-broadcom/usr/share/doc/ca-certificates/examples/ca-certificates-local/debian/postrm, because No such file or directory

set_attributes: failed to set time on ./fsroot-broadcom/usr/share/doc/ca-certificates/examples/ca-certificates-local/debian/rules, because No such file or directory

set_attributes: failed to set time on ./fsroot-broadcom/usr/share/doc/ca-certificates/examples/ca-certificates-local/debian/source/format, because No such file or directory

set_attributes: failed to set time on ./fsroot-broadcom/usr/share/doc/ca-certificates/examples/ca-certificates-local/debian/source, because No such file or directory

set_attributes: failed to set time on ./fsroot-broadcom/usr/share/doc/ca-certificates/examples/ca-certificates-local/debian, because No such file or directory

set_attributes: failed to set time on ./fsroot-broadcom/usr/share/doc/ca-certificates/examples/ca-certificates-local/local/Local_Root_CA.crt, because No such file or directory

set_attributes: failed to set time on ./fsroot-broadcom/usr/share/doc/ca-certificates/examples/ca-certificates-local/local/Makefile, because No such file or directory

set_attributes: failed to set time on ./fsroot-broadcom/usr/share/doc/ca-certificates/examples/ca-certificates-local/local, because No such file or directory

set_attributes: failed to set time on ./fsroot-broadcom/usr/share/doc/ca-certificates/examples/ca-certificates-local, because No such file or directory

set_attributes: failed to set time on ./fsroot-broadcom/usr/share/doc/ca-certificates/examples, because No such file or directory

set_attributes: failed to set time on ./fsroot-broadcom/usr/share/doc/ca-certificates, because No such file or directory

set_attributes: failed to set time on ./fsroot-broadcom/usr/share/doc/cgroup-tools/NEWS.Debian.gz, because No such file or directory

set_attributes: failed to set time on ./fsroot-broadcom/usr/share/doc/cgroup-tools/README.gz, because No such file or directory

set_attributes: failed to set time on ./fsroot-broadcom/usr/share/doc/cgroup-tools/README_daemon.gz, because No such file or directory

set_attributes: failed to set time on ./fsroot-broadcom/usr/share/doc/cgroup-tools/README_systemd, because No such file or directory

set_attributes: failed to set time on ./fsroot-broadcom/usr/share/doc/cgroup-tools/TODO.Debian, because No such file or directory

set_attributes: failed to set time on ./fsroot-broadcom/usr/share/doc/cgroup-tools/changelog.Debian.gz, because No such file or directory

set_attributes: failed to set time on ./fsroot-broadcom/usr/share/doc/cgroup-tools/copyright, because No such file or directory

set_attributes: failed to set time on ./fsroot-broadcom/usr/share/doc/cgroup-tools/examples/cgconfig, because No such file or directory

set_attributes: failed to set time on ./fsroot-broadcom/usr/share/doc/cgroup-tools/examples/cgconfig.conf, because No such file or directory

set_attributes: failed to set time on ./fsroot-broadcom/usr/share/doc/cgroup-tools/examples/cgconfig.sysconfig, because No such file or directory

set_attributes: failed to set time on ./fsroot-broadcom/usr/share/doc/cgroup-tools/examples/cgred, because No such file or directory

set_attributes: failed to set time on ./fsroot-broadcom/usr/share/doc/cgroup-tools/examples/cgred.conf, because No such file or directory

set_attributes: failed to set time on ./fsroot-broadcom/usr/share/doc/cgroup-tools/examples/cgrules.conf, because No such file or directory

set_attributes: failed to set time on ./fsroot-broadcom/usr/share/doc/cgroup-tools/examples/cgsnapshot_blacklist.conf, because No such file or directory

set_attributes: failed to set time on ./fsroot-broadcom/usr/share/doc/cgroup-tools/examples, because No such file or directory

set_attributes: failed to set time on ./fsroot-broadcom/usr/share/doc/cgroup-tools, because No such file or directory

set_attributes: failed to set time on ./fsroot-broadcom/usr/share/doc/chrony/FAQ.gz, because No such file or directory

set_attributes: failed to set time on ./fsroot-broadcom/usr/share/doc/chrony/NEWS.Debian.gz, because No such file or directory

set_attributes: failed to set time on ./fsroot-broadcom/usr/share/doc/chrony/NEWS.gz, because No such file or directory

set_attributes: failed to set time on ./fsroot-broadcom/usr/share/doc/chrony/README.Debian, because No such file or directory

set_attributes: failed to set time on ./fsroot-broadcom/usr/share/doc/chrony/README.gz, because No such file or directory

set_attributes: failed to set time on ./fsroot-broadcom/usr/share/doc/chrony/changelog.Debian.gz, because No such file or directory

set_attributes: failed to set time on ./fsroot-broadcom/usr/share/doc/chrony/copyright, because No such file or directory

set_attributes: failed to set time on ./fsroot-broadcom/usr/share/doc/chrony/examples/chrony.conf.example1, because No such file or directory

set_attributes: failed to set time on ./fsroot-broadcom/usr/share/doc/chrony/examples/chrony.conf.example2, because No such file or directory

set_attributes: failed to set time on ./fsroot-broadcom/usr/share/doc/chrony/examples/chrony.conf.example3, because No such file or directory

set_attributes: failed to set time on ./fsroot-broadcom/usr/share/doc/chrony/examples, because No such file or directory

set_attributes: failed to set time on ./fsroot-broadcom/usr/share/doc/chrony, because No such file or directory

set_attributes: failed to set time on ./fsroot-broadcom/usr/share/doc/conntrack/changelog.Debian.amd64.gz, because No such file or directory

set_attributes: failed to set time on ./fsroot-broadcom/usr/share/doc/conntrack/changelog.Debian.gz, because No such file or directory

set_attributes: failed to set time on ./fsroot-broadcom/usr/share/doc/conntrack/copyright, because No such file or directory

set_attributes: failed to set time on ./fsroot-broadcom/usr/share/doc/conntrack, because No such file or directory

set_attributes: failed to set time on ./fsroot-broadcom/usr/share/doc/containerd.io/changelog.Debian.gz, because No such file or directory

set_attributes: failed to set time on ./fsroot-broadcom/usr/share/doc/containerd.io/copyright, because No such file or directory

set_attributes: failed to set time on ./fsroot-broadcom/usr/share/doc/containerd.io, because No such file or directory

set_attributes: failed to set time on ./fsroot-broadcom/usr/share/doc/coreutils/AUTHORS, because No such file or directory

set_attributes: failed to set time on ./fsroot-broadcom/usr/share/doc/coreutils/NEWS.Debian.gz, because No such file or directory

set_attributes: failed to set time on ./fsroot-broadcom/usr/share/doc/coreutils/NEWS.gz, because No such file or directory

set_attributes: failed to set time on ./fsroot-broadcom/usr/share/doc/coreutils/README.Debian, because No such file or directory

set_attributes: failed to set time on ./fsroot-broadcom/usr/share/doc/coreutils/README.gz, because No such file or directory

set_attributes: failed to set time on ./fsroot-broadcom/usr/share/doc/coreutils/THANKS.gz, because No such file or directory

set_attributes: failed to set time on ./fsroot-broadcom/usr/share/doc/coreutils/TODO.gz, because No such file or directory

set_attributes: failed to set time on ./fsroot-broadcom/usr/share/doc/coreutils/changelog.Debian.gz, because No such file or directory

set_attributes: failed to set time on ./fsroot-broadcom/usr/share/doc/coreutils/changelog.gz, because No such file or directory

set_attributes: failed to set time on ./fsroot-broadcom/usr/share/doc/coreutils/copyright, because No such file or directory

set_attributes: failed to set time on ./fsroot-broadcom/usr/share/doc/coreutils, because No such file or directory

set_attributes: failed to set time on ./fsroot-broadcom/usr/share/doc/cpio/NEWS.gz, because No such file or directory

set_attributes: failed to set time on ./fsroot-broadcom/usr/share/doc/cpio/README.gz, because No such file or directory

set_attributes: failed to set time on ./fsroot-broadcom/usr/share/doc/cpio/changelog.Debian.gz, because No such file or directory

set_attributes: failed to set time on ./fsroot-broadcom/usr/share/doc/cpio/changelog.gz, because No such file or directory

set_attributes: failed to set time on ./fsroot-broadcom/usr/share/doc/cpio/copyright, because No such file or directory

set_attributes: failed to set time on ./fsroot-broadcom/usr/share/doc/cpio, because No such file or directory

set_attributes: failed to set time on ./fsroot-broadcom/usr/share/doc/cpp/README.Debian, because No such file or directory

set_attributes: failed to set time on ./fsroot-broadcom/usr/share/doc/cpp/changelog.gz, because No such file or directory

set_attributes: failed to set time on ./fsroot-broadcom/usr/share/doc/cpp/copyright, because No such file or directory

set_attributes: failed to set time on ./fsroot-broadcom/usr/share/doc/cpp, because No such file or directory

set_attributes: failed to set time on ./fsroot-broadcom/usr/share/doc/cron/FEATURES, because No such file or directory

set_attributes: failed to set time on ./fsroot-broadcom/usr/share/doc/cron/NEWS.Debian.gz, because No such file or directory

set_attributes: failed to set time on ./fsroot-broadcom/usr/share/doc/cron/README, because No such file or directory

set_attributes: failed to set time on ./fsroot-broadcom/usr/share/doc/cron/README.Debian, because No such file or directory

set_attributes: failed to set time on ./fsroot-broadcom/usr/share/doc/cron/README.anacron, because No such file or directory

set_attributes: failed to set time on ./fsroot-broadcom/usr/share/doc/cron/THANKS, because No such file or directory

set_attributes: failed to set time on ./fsroot-broadcom/usr/share/doc/cron/TODO.Debian, because No such file or directory

set_attributes: failed to set time on ./fsroot-broadcom/usr/share/doc/cron/changelog.Debian.gz, because No such file or directory

set_attributes: failed to set time on ./fsroot-broadcom/usr/share/doc/cron/changelog.gz, because No such file or directory

set_attributes: failed to set time on ./fsroot-broadcom/usr/share/doc/cron/copyright, because No such file or directory

set_attributes: failed to set time on ./fsroot-broadcom/usr/share/doc/cron/examples/cron-stats.pl, because No such file or directory

set_attributes: failed to set time on ./fsroot-broadcom/usr/share/doc/cron/examples/cron-tasks-review.sh, because No such file or directory

set_attributes: failed to set time on ./fsroot-broadcom/usr/share/doc/cron/examples/crontab2english.pl, because No such file or directory

set_attributes: failed to set time on ./fsroot-broadcom/usr/share/doc/cron/examples, because No such file or directory

set_attributes: failed to set time on ./fsroot-broadcom/usr/share/doc/cron, because No such file or directory

set_attributes: failed to set time on ./fsroot-broadcom/usr/share/doc/cron-daemon-common/changelog.Debian.gz, because No such file or directory

set_attributes: failed to set time on ./fsroot-broadcom/usr/share/doc/cron-daemon-common/changelog.gz, because No such file or directory

set_attributes: failed to set time on ./fsroot-broadcom/usr/share/doc/cron-daemon-common/copyright, because No such file or directory

set_attributes: failed to set time on ./fsroot-broadcom/usr/share/doc/cron-daemon-common, because No such file or directory

set_attributes: failed to set time on ./fsroot-broadcom/usr/share/doc/curl/changelog.Debian.gz, because No such file or directory

set_attributes: failed to set time on ./fsroot-broadcom/usr/share/doc/curl/changelog.gz, because No such file or directory

set_attributes: failed to set time on ./fsroot-broadcom/usr/share/doc/curl/copyright, because No such file or directory

set_attributes: failed to set time on ./fsroot-broadcom/usr/share/doc/curl, because No such file or directory

set_attributes: failed to set time on ./fsroot-broadcom/usr/share/doc/dash/NEWS.Debian.gz, because No such file or directory

set_attributes: failed to set time on ./fsroot-broadcom/usr/share/doc/dash/README.Debian.diet, because No such file or directory

set_attributes: failed to set time on ./fsroot-broadcom/usr/share/doc/dash/README.source, because No such file or directory

set_attributes: failed to set time on ./fsroot-broadcom/usr/share/doc/dash/changelog.Debian.gz, because No such file or directory

set_attributes: failed to set time on ./fsroot-broadcom/usr/share/doc/dash/changelog.gz, because No such file or directory

set_attributes: failed to set time on ./fsroot-broadcom/usr/share/doc/dash/copyright, because No such file or directory

set_attributes: failed to set time on ./fsroot-broadcom/usr/share/doc/dash, because No such file or directory

set_attributes: failed to set time on ./fsroot-broadcom/usr/share/doc/dbus/AUTHORS.gz, because No such file or directory

set_attributes: failed to set time on ./fsroot-broadcom/usr/share/doc/dbus/NEWS.gz, because No such file or directory

set_attributes: failed to set time on ./fsroot-broadcom/usr/share/doc/dbus/README.Debian, because No such file or directory

set_attributes: failed to set time on ./fsroot-broadcom/usr/share/doc/dbus/README.gz, because No such file or directory

set_attributes: failed to set time on ./fsroot-broadcom/usr/share/doc/dbus/changelog.Debian.gz, because No such file or directory

set_attributes: failed to set time on ./fsroot-broadcom/usr/share/doc/dbus/copyright, because No such file or directory

set_attributes: failed to set time on ./fsroot-broadcom/usr/share/doc/dbus, because No such file or directory

set_attributes: failed to set time on ./fsroot-broadcom/usr/share/doc/dbus-bin/AUTHORS.gz, because No such file or directory

set_attributes: failed to set time on ./fsroot-broadcom/usr/share/doc/dbus-bin/NEWS.gz, because No such file or directory

set_attributes: failed to set time on ./fsroot-broadcom/usr/share/doc/dbus-bin/README.gz, because No such file or directory

set_attributes: failed to set time on ./fsroot-broadcom/usr/share/doc/dbus-bin/changelog.Debian.gz, because No such file or directory

set_attributes: failed to set time on ./fsroot-broadcom/usr/share/doc/dbus-bin/copyright, because No such file or directory

set_attributes: failed to set time on ./fsroot-broadcom/usr/share/doc/dbus-bin, because No such file or directory

set_attributes: failed to set time on ./fsroot-broadcom/usr/share/doc/dbus-daemon/AUTHORS.gz, because No such file or directory

set_attributes: failed to set time on ./fsroot-broadcom/usr/share/doc/dbus-daemon/NEWS.gz, because No such file or directory

set_attributes: failed to set time on ./fsroot-broadcom/usr/share/doc/dbus-daemon/README.gz, because No such file or directory

set_attributes: failed to set time on ./fsroot-broadcom/usr/share/doc/dbus-daemon/changelog.Debian.gz, because No such file or directory

set_attributes: failed to set time on ./fsroot-broadcom/usr/share/doc/dbus-daemon/copyright, because No such file or directory

set_attributes: failed to set time on ./fsroot-broadcom/usr/share/doc/dbus-daemon, because No such file or directory

set_attributes: failed to set time on ./fsroot-broadcom/usr/share/doc/dbus-session-bus-common/AUTHORS.gz, because No such file or directory

set_attributes: failed to set time on ./fsroot-broadcom/usr/share/doc/dbus-session-bus-common/NEWS.gz, because No such file or directory

set_attributes: failed to set time on ./fsroot-broadcom/usr/share/doc/dbus-session-bus-common/README.gz, because No such file or directory

set_attributes: failed to set time on ./fsroot-broadcom/usr/share/doc/dbus-session-bus-common/changelog.Debian.gz, because No such file or directory

set_attributes: failed to set time on ./fsroot-broadcom/usr/share/doc/dbus-session-bus-common/copyright, because No such file or directory

set_attributes: failed to set time on ./fsroot-broadcom/usr/share/doc/dbus-session-bus-common, because No such file or directory

set_attributes: failed to set time on ./fsroot-broadcom/usr/share/doc/dbus-system-bus-common/AUTHORS.gz, because No such file or directory

set_attributes: failed to set time on ./fsroot-broadcom/usr/share/doc/dbus-system-bus-common/NEWS.gz, because No such file or directory

set_attributes: failed to set time on ./fsroot-broadcom/usr/share/doc/dbus-system-bus-common/README.gz, because No such file or directory

set_attributes: failed to set time on ./fsroot-broadcom/usr/share/doc/dbus-system-bus-common/changelog.Debian.gz, because No such file or directory

set_attributes: failed to set time on ./fsroot-broadcom/usr/share/doc/dbus-system-bus-common/copyright, because No such file or directory

set_attributes: failed to set time on ./fsroot-broadcom/usr/share/doc/dbus-system-bus-common, because No such file or directory

set_attributes: failed to set time on ./fsroot-broadcom/usr/share/doc/debconf/NEWS.Debian.gz, because No such file or directory

set_attributes: failed to set time on ./fsroot-broadcom/usr/share/doc/debconf/README.Debian, because No such file or directory

set_attributes: failed to set time on ./fsroot-broadcom/usr/share/doc/debconf/changelog.gz, because No such file or directory

set_attributes: failed to set time on ./fsroot-broadcom/usr/share/doc/debconf/copyright, because No such file or directory

set_attributes: failed to set time on ./fsroot-broadcom/usr/share/doc/debconf, because No such file or directory

set_attributes: failed to set time on ./fsroot-broadcom/usr/share/doc/debian-archive-keyring/README, because No such file or directory

set_attributes: failed to set time on ./fsroot-broadcom/usr/share/doc/debian-archive-keyring/changelog.gz, because No such file or directory

set_attributes: failed to set time on ./fsroot-broadcom/usr/share/doc/debian-archive-keyring/copyright, because No such file or directory

set_attributes: failed to set time on ./fsroot-broadcom/usr/share/doc/debian-archive-keyring, because No such file or directory

set_attributes: failed to set time on ./fsroot-broadcom/usr/share/doc/debianutils/README.shells.gz, because No such file or directory

set_attributes: failed to set time on ./fsroot-broadcom/usr/share/doc/debianutils/changelog.Debian.gz, because No such file or directory

set_attributes: failed to set time on ./fsroot-broadcom/usr/share/doc/debianutils/changelog.gz, because No such file or directory

set_attributes: failed to set time on ./fsroot-broadcom/usr/share/doc/debianutils/copyright, because No such file or directory

set_attributes: failed to set time on ./fsroot-broadcom/usr/share/doc/debianutils, because No such file or directory

set_attributes: failed to set time on ./fsroot-broadcom/usr/share/doc/device-tree-compiler/README.Debian, because No such file or directory

set_attributes: failed to set time on ./fsroot-broadcom/usr/share/doc/device-tree-compiler/changelog.Debian.amd64.gz, because No such file or directory

set_attributes: failed to set time on ./fsroot-broadcom/usr/share/doc/device-tree-compiler/changelog.Debian.gz, because No such file or directory

set_attributes: failed to set time on ./fsroot-broadcom/usr/share/doc/device-tree-compiler/copyright, because No such file or directory

set_attributes: failed to set time on ./fsroot-broadcom/usr/share/doc/device-tree-compiler/dt-object-internal.txt.gz, because No such file or directory

set_attributes: failed to set time on ./fsroot-broadcom/usr/share/doc/device-tree-compiler/dtc-manual.txt.gz, because No such file or directory

set_attributes: failed to set time on ./fsroot-broadcom/usr/share/doc/device-tree-compiler/dtc-paper.pdf.gz, because No such file or directory

set_attributes: failed to set time on ./fsroot-broadcom/usr/share/doc/device-tree-compiler/dts-format.txt.gz, because No such file or directory

set_attributes: failed to set time on ./fsroot-broadcom/usr/share/doc/device-tree-compiler, because No such file or directory

set_attributes: failed to set time on ./fsroot-broadcom/usr/share/doc/diffutils/NEWS.gz, because No such file or directory

set_attributes: failed to set time on ./fsroot-broadcom/usr/share/doc/diffutils/changelog.Debian.gz, because No such file or directory

set_attributes: failed to set time on ./fsroot-broadcom/usr/share/doc/diffutils/changelog.gz, because No such file or directory

set_attributes: failed to set time on ./fsroot-broadcom/usr/share/doc/diffutils/copyright, because No such file or directory

set_attributes: failed to set time on ./fsroot-broadcom/usr/share/doc/diffutils, because No such file or directory

set_attributes: failed to set time on ./fsroot-broadcom/usr/share/doc/distro-info-data/README.Debian, because No such file or directory

set_attributes: failed to set time on ./fsroot-broadcom/usr/share/doc/distro-info-data/changelog.gz, because No such file or directory

set_attributes: failed to set time on ./fsroot-broadcom/usr/share/doc/distro-info-data/copyright, because No such file or directory

set_attributes: failed to set time on ./fsroot-broadcom/usr/share/doc/distro-info-data, because No such file or directory

set_attributes: failed to set time on ./fsroot-broadcom/usr/share/doc/dmidecode/AUTHORS, because No such file or directory

set_attributes: failed to set time on ./fsroot-broadcom/usr/share/doc/dmidecode/NEWS.gz, because No such file or directory

set_attributes: failed to set time on ./fsroot-broadcom/usr/share/doc/dmidecode/README.gz, because No such file or directory

set_attributes: failed to set time on ./fsroot-broadcom/usr/share/doc/dmidecode/changelog.Debian.gz, because No such file or directory

set_attributes: failed to set time on ./fsroot-broadcom/usr/share/doc/dmidecode/copyright, because No such file or directory

set_attributes: failed to set time on ./fsroot-broadcom/usr/share/doc/dmidecode, because No such file or directory

set_attributes: failed to set time on ./fsroot-broadcom/usr/share/doc/dmsetup/changelog.Debian.devmapper.gz, because No such file or directory

set_attributes: failed to set time on ./fsroot-broadcom/usr/share/doc/dmsetup/changelog.Debian.gz, because No such file or directory

set_attributes: failed to set time on ./fsroot-broadcom/usr/share/doc/dmsetup/copyright, because No such file or directory

set_attributes: failed to set time on ./fsroot-broadcom/usr/share/doc/dmsetup, because No such file or directory

set_attributes: failed to set time on ./fsroot-broadcom/usr/share/doc/docker-ce/README.md, because No such file or directory

set_attributes: failed to set time on ./fsroot-broadcom/usr/share/doc/docker-ce/changelog.Debian.gz, because No such file or directory

set_attributes: failed to set time on ./fsroot-broadcom/usr/share/doc/docker-ce, because No such file or directory

set_attributes: failed to set time on ./fsroot-broadcom/usr/share/doc/docker-ce-cli/changelog.Debian.gz, because No such file or directory

set_attributes: failed to set time on ./fsroot-broadcom/usr/share/doc/docker-ce-cli, because No such file or directory

set_attributes: failed to set time on ./fsroot-broadcom/usr/share/doc/dpkg/AUTHORS, because No such file or directory

set_attributes: failed to set time on ./fsroot-broadcom/usr/share/doc/dpkg/README.api, because No such file or directory

set_attributes: failed to set time on ./fsroot-broadcom/usr/share/doc/dpkg/README.bug-usertags.gz, because No such file or directory

set_attributes: failed to set time on ./fsroot-broadcom/usr/share/doc/dpkg/README.feature-removal-schedule.gz, because No such file or directory

set_attributes: failed to set time on ./fsroot-broadcom/usr/share/doc/dpkg/THANKS.gz, because No such file or directory

set_attributes: failed to set time on ./fsroot-broadcom/usr/share/doc/dpkg/changelog.gz, because No such file or directory

set_attributes: failed to set time on ./fsroot-broadcom/usr/share/doc/dpkg/copyright, because No such file or directory

set_attributes: failed to set time on ./fsroot-broadcom/usr/share/doc/dpkg, because No such file or directory

set_attributes: failed to set time on ./fsroot-broadcom/usr/share/doc/e2fsprogs/NEWS.gz, because No such file or directory

set_attributes: failed to set time on ./fsroot-broadcom/usr/share/doc/e2fsprogs/README, because No such file or directory

set_attributes: failed to set time on ./fsroot-broadcom/usr/share/doc/e2fsprogs/changelog.Debian.amd64.gz, because No such file or directory

set_attributes: failed to set time on ./fsroot-broadcom/usr/share/doc/e2fsprogs/changelog.Debian.gz, because No such file or directory

set_attributes: failed to set time on ./fsroot-broadcom/usr/share/doc/e2fsprogs/copyright, because No such file or directory

set_attributes: failed to set time on ./fsroot-broadcom/usr/share/doc/e2fsprogs, because No such file or directory

set_attributes: failed to set time on ./fsroot-broadcom/usr/share/doc/eatmydata/changelog.Debian.gz, because No such file or directory

set_attributes: failed to set time on ./fsroot-broadcom/usr/share/doc/eatmydata/copyright, because No such file or directory

set_attributes: failed to set time on ./fsroot-broadcom/usr/share/doc/eatmydata, because No such file or directory

set_attributes: failed to set time on ./fsroot-broadcom/usr/share/doc/ebtables/NEWS.Debian.gz, because No such file or directory

set_attributes: failed to set time on ./fsroot-broadcom/usr/share/doc/ebtables/README.Debian, because No such file or directory

set_attributes: failed to set time on ./fsroot-broadcom/usr/share/doc/ebtables/THANKS, because No such file or directory

set_attributes: failed to set time on ./fsroot-broadcom/usr/share/doc/ebtables/changelog.Debian.gz, because No such file or directory

set_attributes: failed to set time on ./fsroot-broadcom/usr/share/doc/ebtables/changelog.gz, because No such file or directory

set_attributes: failed to set time on ./fsroot-broadcom/usr/share/doc/ebtables/copyright, because No such file or directory

set_attributes: failed to set time on ./fsroot-broadcom/usr/share/doc/ebtables/examples/README, because No such file or directory

set_attributes: failed to set time on ./fsroot-broadcom/usr/share/doc/ebtables/examples/ebtables.init, because No such file or directory

set_attributes: failed to set time on ./fsroot-broadcom/usr/share/doc/ebtables/examples, because No such file or directory

set_attributes: failed to set time on ./fsroot-broadcom/usr/share/doc/ebtables, because No such file or directory

set_attributes: failed to set time on ./fsroot-broadcom/usr/share/doc/efibootmgr/README.Debian, because No such file or directory

set_attributes: failed to set time on ./fsroot-broadcom/usr/share/doc/efibootmgr/README.gz, because No such file or directory

set_attributes: failed to set time on ./fsroot-broadcom/usr/share/doc/efibootmgr/TODO, because No such file or directory

set_attributes: failed to set time on ./fsroot-broadcom/usr/share/doc/efibootmgr/changelog.Debian.gz, because No such file or directory

set_attributes: failed to set time on ./fsroot-broadcom/usr/share/doc/efibootmgr/copyright, because No such file or directory

set_attributes: failed to set time on ./fsroot-broadcom/usr/share/doc/efibootmgr, because No such file or directory

set_attributes: failed to set time on ./fsroot-broadcom/usr/share/doc/ethtool/AUTHORS, because No such file or directory

set_attributes: failed to set time on ./fsroot-broadcom/usr/share/doc/ethtool/NEWS.gz, because No such file or directory

set_attributes: failed to set time on ./fsroot-broadcom/usr/share/doc/ethtool/README, because No such file or directory

set_attributes: failed to set time on ./fsroot-broadcom/usr/share/doc/ethtool/README.Debian, because No such file or directory

set_attributes: failed to set time on ./fsroot-broadcom/usr/share/doc/ethtool/changelog.Debian.gz, because No such file or directory

set_attributes: failed to set time on ./fsroot-broadcom/usr/share/doc/ethtool/copyright, because No such file or directory

set_attributes: failed to set time on ./fsroot-broadcom/usr/share/doc/ethtool, because No such file or directory

set_attributes: failed to set time on ./fsroot-broadcom/usr/share/doc/fdisk/changelog.Debian.gz, because No such file or directory

set_attributes: failed to set time on ./fsroot-broadcom/usr/share/doc/fdisk/changelog.gz, because No such file or directory

set_attributes: failed to set time on ./fsroot-broadcom/usr/share/doc/fdisk/copyright, because No such file or directory

set_attributes: failed to set time on ./fsroot-broadcom/usr/share/doc/fdisk, because No such file or directory

set_attributes: failed to set time on ./fsroot-broadcom/usr/share/doc/file/README.Debian, because No such file or directory

set_attributes: failed to set time on ./fsroot-broadcom/usr/share/doc/file/changelog.Debian.gz, because No such file or directory

set_attributes: failed to set time on ./fsroot-broadcom/usr/share/doc/file/changelog.gz, because No such file or directory

set_attributes: failed to set time on ./fsroot-broadcom/usr/share/doc/file/copyright, because No such file or directory

set_attributes: failed to set time on ./fsroot-broadcom/usr/share/doc/file, because No such file or directory

set_attributes: failed to set time on ./fsroot-broadcom/usr/share/doc/findutils/NEWS.Debian.gz, because No such file or directory

set_attributes: failed to set time on ./fsroot-broadcom/usr/share/doc/findutils/NEWS.gz, because No such file or directory

set_attributes: failed to set time on ./fsroot-broadcom/usr/share/doc/findutils/README.gz, because No such file or directory

set_attributes: failed to set time on ./fsroot-broadcom/usr/share/doc/findutils/TODO, because No such file or directory

set_attributes: failed to set time on ./fsroot-broadcom/usr/share/doc/findutils/changelog.Debian.gz, because No such file or directory

set_attributes: failed to set time on ./fsroot-broadcom/usr/share/doc/findutils/changelog.gz, because No such file or directory

set_attributes: failed to set time on ./fsroot-broadcom/usr/share/doc/findutils/copyright, because No such file or directory

set_attributes: failed to set time on ./fsroot-broadcom/usr/share/doc/findutils, because No such file or directory

set_attributes: failed to set time on ./fsroot-broadcom/usr/share/doc/firmware-amd-graphics/changelog.Debian.gz, because No such file or directory

set_attributes: failed to set time on ./fsroot-broadcom/usr/share/doc/firmware-amd-graphics/copyright, because No such file or directory

set_attributes: failed to set time on ./fsroot-broadcom/usr/share/doc/firmware-amd-graphics, because No such file or directory

set_attributes: failed to set time on ./fsroot-broadcom/usr/share/doc/firmware-linux-nonfree/changelog.Debian.gz, because No such file or directory

set_attributes: failed to set time on ./fsroot-broadcom/usr/share/doc/firmware-linux-nonfree/copyright, because No such file or directory

set_attributes: failed to set time on ./fsroot-broadcom/usr/share/doc/firmware-linux-nonfree, because No such file or directory

set_attributes: failed to set time on ./fsroot-broadcom/usr/share/doc/firmware-misc-nonfree/changelog.Debian.gz, because No such file or directory

set_attributes: failed to set time on ./fsroot-broadcom/usr/share/doc/firmware-misc-nonfree/copyright, because No such file or directory

set_attributes: failed to set time on ./fsroot-broadcom/usr/share/doc/firmware-misc-nonfree, because No such file or directory

set_attributes: failed to set time on ./fsroot-broadcom/usr/share/doc/freeipmi-common/AUTHORS, because No such file or directory

set_attributes: failed to set time on ./fsroot-broadcom/usr/share/doc/freeipmi-common/ChangeLog.0.gz, because No such file or directory

set_attributes: failed to set time on ./fsroot-broadcom/usr/share/doc/freeipmi-common/NEWS.Debian.gz, because No such file or directory

set_attributes: failed to set time on ./fsroot-broadcom/usr/share/doc/freeipmi-common/NEWS.gz, because No such file or directory

set_attributes: failed to set time on ./fsroot-broadcom/usr/share/doc/freeipmi-common/README.argp, because No such file or directory

set_attributes: failed to set time on ./fsroot-broadcom/usr/share/doc/freeipmi-common/README.build, because No such file or directory

set_attributes: failed to set time on ./fsroot-broadcom/usr/share/doc/freeipmi-common/README.gz, because No such file or directory

set_attributes: failed to set time on ./fsroot-broadcom/usr/share/doc/freeipmi-common/README.openipmi, because No such file or directory

set_attributes: failed to set time on ./fsroot-broadcom/usr/share/doc/freeipmi-common/TODO.gz, because No such file or directory

set_attributes: failed to set time on ./fsroot-broadcom/usr/share/doc/freeipmi-common/changelog.Debian.gz, because No such file or directory

set_attributes: failed to set time on ./fsroot-broadcom/usr/share/doc/freeipmi-common/changelog.gz, because No such file or directory

set_attributes: failed to set time on ./fsroot-broadcom/usr/share/doc/freeipmi-common/contrib/ganglia/README, because No such file or directory

set_attributes: failed to set time on ./fsroot-broadcom/usr/share/doc/freeipmi-common/contrib/ganglia/ganglia_ipmi_sensors.pl.gz, because No such file or directory

set_attributes: failed to set time on ./fsroot-broadcom/usr/share/doc/freeipmi-common/contrib/ganglia, because No such file or directory

set_attributes: failed to set time on ./fsroot-broadcom/usr/share/doc/freeipmi-common/contrib/libipmimonitoring/ipmimonitoring-sel.c.gz, because No such file or directory

set_attributes: failed to set time on ./fsroot-broadcom/usr/share/doc/freeipmi-common/contrib/libipmimonitoring/ipmimonitoring-sensors.c.gz, because No such file or directory

set_attributes: failed to set time on ./fsroot-broadcom/usr/share/doc/freeipmi-common/contrib/libipmimonitoring, because No such file or directory

set_attributes: failed to set time on ./fsroot-broadcom/usr/share/doc/freeipmi-common/contrib/nagios/README, because No such file or directory

set_attributes: failed to set time on ./fsroot-broadcom/usr/share/doc/freeipmi-common/contrib/nagios/nagios_ipmi_sensors.pl.gz, because No such file or directory

set_attributes: failed to set time on ./fsroot-broadcom/usr/share/doc/freeipmi-common/contrib/nagios, because No such file or directory

set_attributes: failed to set time on ./fsroot-broadcom/usr/share/doc/freeipmi-common/contrib/pet/README.gz, because No such file or directory

set_attributes: failed to set time on ./fsroot-broadcom/usr/share/doc/freeipmi-common/contrib/pet/check_rmcpping, because No such file or directory

set_attributes: failed to set time on ./fsroot-broadcom/usr/share/doc/freeipmi-common/contrib/pet/ipminodes.cfg, because No such file or directory

set_attributes: failed to set time on ./fsroot-broadcom/usr/share/doc/freeipmi-common/contrib/pet/petalert.pl.gz, because No such file or directory

set_attributes: failed to set time on ./fsroot-broadcom/usr/share/doc/freeipmi-common/contrib/pet, because No such file or directory

set_attributes: failed to set time on ./fsroot-broadcom/usr/share/doc/freeipmi-common/contrib, because No such file or directory

set_attributes: failed to set time on ./fsroot-broadcom/usr/share/doc/freeipmi-common/copyright, because No such file or directory

set_attributes: failed to set time on ./fsroot-broadcom/usr/share/doc/freeipmi-common/freeipmi-bugs-issues-and-workarounds.txt.gz, because No such file or directory

set_attributes: failed to set time on ./fsroot-broadcom/usr/share/doc/freeipmi-common/freeipmi-coding.txt.gz, because No such file or directory

set_attributes: failed to set time on ./fsroot-broadcom/usr/share/doc/freeipmi-common/freeipmi-design.txt.gz, because No such file or directory

set_attributes: failed to set time on ./fsroot-broadcom/usr/share/doc/freeipmi-common/freeipmi-hostrange.txt.gz, because No such file or directory

set_attributes: failed to set time on ./fsroot-broadcom/usr/share/doc/freeipmi-common/freeipmi-libraries.txt.gz, because No such file or directory

set_attributes: failed to set time on ./fsroot-broadcom/usr/share/doc/freeipmi-common/freeipmi-oem-documentation-requirements.txt.gz, because No such file or directory

set_attributes: failed to set time on ./fsroot-broadcom/usr/share/doc/freeipmi-common/freeipmi-testing.txt.gz, because No such file or directory

set_attributes: failed to set time on ./fsroot-broadcom/usr/share/doc/freeipmi-common, because No such file or directory

set_attributes: failed to set time on ./fsroot-broadcom/usr/share/doc/gcc-12-base/NEWS.gz, because No such file or directory

set_attributes: failed to set time on ./fsroot-broadcom/usr/share/doc/gcc-12-base/NEWS.html, because No such file or directory

set_attributes: failed to set time on ./fsroot-broadcom/usr/share/doc/gcc-12-base/README.Bugs, because No such file or directory

set_attributes: failed to set time on ./fsroot-broadcom/usr/share/doc/gcc-12-base/README.Debian.amd64.gz, because No such file or directory

set_attributes: failed to set time on ./fsroot-broadcom/usr/share/doc/gcc-12-base/README.ssp, because No such file or directory

set_attributes: failed to set time on ./fsroot-broadcom/usr/share/doc/gcc-12-base/TODO.Debian, because No such file or directory

set_attributes: failed to set time on ./fsroot-broadcom/usr/share/doc/gcc-12-base/changelog.Debian.gz, because No such file or directory

set_attributes: failed to set time on ./fsroot-broadcom/usr/share/doc/gcc-12-base/changelog.gz, because No such file or directory

set_attributes: failed to set time on ./fsroot-broadcom/usr/share/doc/gcc-12-base/copyright, because No such file or directory

set_attributes: failed to set time on ./fsroot-broadcom/usr/share/doc/gcc-12-base/gcc/changelog.gz, because No such file or directory

set_attributes: failed to set time on ./fsroot-broadcom/usr/share/doc/gcc-12-base/gcc, because No such file or directory

set_attributes: failed to set time on ./fsroot-broadcom/usr/share/doc/gcc-12-base/gomp/changelog.gz, because No such file or directory

set_attributes: failed to set time on ./fsroot-broadcom/usr/share/doc/gcc-12-base/gomp, because No such file or directory

set_attributes: failed to set time on ./fsroot-broadcom/usr/share/doc/gcc-12-base/itm/changelog.gz, because No such file or directory

set_attributes: failed to set time on ./fsroot-broadcom/usr/share/doc/gcc-12-base/itm, because No such file or directory

set_attributes: failed to set time on ./fsroot-broadcom/usr/share/doc/gcc-12-base/quadmath/changelog.gz, because No such file or directory

set_attributes: failed to set time on ./fsroot-broadcom/usr/share/doc/gcc-12-base/quadmath, because No such file or directory

set_attributes: failed to set time on ./fsroot-broadcom/usr/share/doc/gcc-12-base/sanitizer/changelog.gz, because No such file or directory

set_attributes: failed to set time on ./fsroot-broadcom/usr/share/doc/gcc-12-base/sanitizer, because No such file or directory

set_attributes: failed to set time on ./fsroot-broadcom/usr/share/doc/gcc-12-base, because No such file or directory

set_attributes: failed to set time on ./fsroot-broadcom/usr/share/doc/gdisk/NEWS.gz, because No such file or directory

set_attributes: failed to set time on ./fsroot-broadcom/usr/share/doc/gdisk/README.gz, because No such file or directory

set_attributes: failed to set time on ./fsroot-broadcom/usr/share/doc/gdisk/cgdisk.html, because No such file or directory

set_attributes: failed to set time on ./fsroot-broadcom/usr/share/doc/gdisk/changelog.Debian.gz, because No such file or directory

set_attributes: failed to set time on ./fsroot-broadcom/usr/share/doc/gdisk/copyright, because No such file or directory

set_attributes: failed to set time on ./fsroot-broadcom/usr/share/doc/gdisk/fixparts.html, because No such file or directory

set_attributes: failed to set time on ./fsroot-broadcom/usr/share/doc/gdisk/gdisk.html, because No such file or directory

set_attributes: failed to set time on ./fsroot-broadcom/usr/share/doc/gdisk/index.html, because No such file or directory

set_attributes: failed to set time on ./fsroot-broadcom/usr/share/doc/gdisk/sgdisk.html, because No such file or directory

set_attributes: failed to set time on ./fsroot-broadcom/usr/share/doc/gdisk, because No such file or directory

set_attributes: failed to set time on ./fsroot-broadcom/usr/share/doc/gettext-base/ABOUT-NLS, because No such file or directory

set_attributes: failed to set time on ./fsroot-broadcom/usr/share/doc/gettext-base/changelog.Debian.gz, because No such file or directory

set_attributes: failed to set time on ./fsroot-broadcom/usr/share/doc/gettext-base/changelog.gz, because No such file or directory

set_attributes: failed to set time on ./fsroot-broadcom/usr/share/doc/gettext-base/copyright, because No such file or directory

set_attributes: failed to set time on ./fsroot-broadcom/usr/share/doc/gettext-base, because No such file or directory

set_attributes: failed to set time on ./fsroot-broadcom/usr/share/doc/gpg/NEWS.Debian.gz, because No such file or directory

set_attributes: failed to set time on ./fsroot-broadcom/usr/share/doc/gpg/changelog.Debian.gz, because No such file or directory

set_attributes: failed to set time on ./fsroot-broadcom/usr/share/doc/gpg/changelog.gz, because No such file or directory

set_attributes: failed to set time on ./fsroot-broadcom/usr/share/doc/gpg/copyright, because No such file or directory

set_attributes: failed to set time on ./fsroot-broadcom/usr/share/doc/gpg, because No such file or directory

set_attributes: failed to set time on ./fsroot-broadcom/usr/share/doc/gpgconf/NEWS.Debian.gz, because No such file or directory

set_attributes: failed to set time on ./fsroot-broadcom/usr/share/doc/gpgconf/changelog.Debian.gz, because No such file or directory

set_attributes: failed to set time on ./fsroot-broadcom/usr/share/doc/gpgconf/changelog.gz, because No such file or directory

set_attributes: failed to set time on ./fsroot-broadcom/usr/share/doc/gpgconf/copyright, because No such file or directory

set_attributes: failed to set time on ./fsroot-broadcom/usr/share/doc/gpgconf/examples/gpgconf.conf, because No such file or directory

set_attributes: failed to set time on ./fsroot-broadcom/usr/share/doc/gpgconf/examples, because No such file or directory

set_attributes: failed to set time on ./fsroot-broadcom/usr/share/doc/gpgconf, because No such file or directory

set_attributes: failed to set time on ./fsroot-broadcom/usr/share/doc/gpgv/NEWS.Debian.gz, because No such file or directory

set_attributes: failed to set time on ./fsroot-broadcom/usr/share/doc/gpgv/changelog.Debian.gz, because No such file or directory

set_attributes: failed to set time on ./fsroot-broadcom/usr/share/doc/gpgv/changelog.gz, because No such file or directory

set_attributes: failed to set time on ./fsroot-broadcom/usr/share/doc/gpgv/copyright, because No such file or directory

set_attributes: failed to set time on ./fsroot-broadcom/usr/share/doc/gpgv, because No such file or directory

set_attributes: failed to set time on ./fsroot-broadcom/usr/share/doc/grep/AUTHORS, because No such file or directory

set_attributes: failed to set time on ./fsroot-broadcom/usr/share/doc/grep/NEWS.Debian.gz, because No such file or directory

set_attributes: failed to set time on ./fsroot-broadcom/usr/share/doc/grep/NEWS.gz, because No such file or directory

set_attributes: failed to set time on ./fsroot-broadcom/usr/share/doc/grep/README, because No such file or directory

set_attributes: failed to set time on ./fsroot-broadcom/usr/share/doc/grep/THANKS.gz, because No such file or directory

set_attributes: failed to set time on ./fsroot-broadcom/usr/share/doc/grep/TODO.gz, because No such file or directory

set_attributes: failed to set time on ./fsroot-broadcom/usr/share/doc/grep/changelog.Debian.gz, because No such file or directory

set_attributes: failed to set time on ./fsroot-broadcom/usr/share/doc/grep/changelog.gz, because No such file or directory

set_attributes: failed to set time on ./fsroot-broadcom/usr/share/doc/grep/copyright, because No such file or directory

set_attributes: failed to set time on ./fsroot-broadcom/usr/share/doc/grep, because No such file or directory

set_attributes: failed to set time on ./fsroot-broadcom/usr/share/doc/grub-common/AUTHORS, because No such file or directory

set_attributes: failed to set time on ./fsroot-broadcom/usr/share/doc/grub-common/NEWS.Debian.gz, because No such file or directory

set_attributes: failed to set time on ./fsroot-broadcom/usr/share/doc/grub-common/NEWS.gz, because No such file or directory

set_attributes: failed to set time on ./fsroot-broadcom/usr/share/doc/grub-common/README, because No such file or directory

set_attributes: failed to set time on ./fsroot-broadcom/usr/share/doc/grub-common/THANKS, because No such file or directory

set_attributes: failed to set time on ./fsroot-broadcom/usr/share/doc/grub-common/TODO, because No such file or directory

set_attributes: failed to set time on ./fsroot-broadcom/usr/share/doc/grub-common/changelog.Debian.gz, because No such file or directory

set_attributes: failed to set time on ./fsroot-broadcom/usr/share/doc/grub-common/changelog.gz, because No such file or directory

set_attributes: failed to set time on ./fsroot-broadcom/usr/share/doc/grub-common/copyright, because No such file or directory

set_attributes: failed to set time on ./fsroot-broadcom/usr/share/doc/grub-common/examples/grub.cfg, because No such file or directory

set_attributes: failed to set time on ./fsroot-broadcom/usr/share/doc/grub-common/examples, because No such file or directory

set_attributes: failed to set time on ./fsroot-broadcom/usr/share/doc/grub-common, because No such file or directory

set_attributes: failed to set time on ./fsroot-broadcom/usr/share/doc/gzip/NEWS.gz, because No such file or directory

set_attributes: failed to set time on ./fsroot-broadcom/usr/share/doc/gzip/README.gz, because No such file or directory

set_attributes: failed to set time on ./fsroot-broadcom/usr/share/doc/gzip/TODO, because No such file or directory

set_attributes: failed to set time on ./fsroot-broadcom/usr/share/doc/gzip/changelog.Debian.gz, because No such file or directory

set_attributes: failed to set time on ./fsroot-broadcom/usr/share/doc/gzip/changelog.gz, because No such file or directory

set_attributes: failed to set time on ./fsroot-broadcom/usr/share/doc/gzip/copyright, because No such file or directory

set_attributes: failed to set time on ./fsroot-broadcom/usr/share/doc/gzip, because No such file or directory

set_attributes: failed to set time on ./fsroot-broadcom/usr/share/doc/haveged/README.Debian, because No such file or directory

set_attributes: failed to set time on ./fsroot-broadcom/usr/share/doc/haveged/README.gz, because No such file or directory

set_attributes: failed to set time on ./fsroot-broadcom/usr/share/doc/haveged/changelog.Debian.gz, because No such file or directory

set_attributes: failed to set time on ./fsroot-broadcom/usr/share/doc/haveged/changelog.gz, because No such file or directory

set_attributes: failed to set time on ./fsroot-broadcom/usr/share/doc/haveged/copyright, because No such file or directory

set_attributes: failed to set time on ./fsroot-broadcom/usr/share/doc/haveged, because No such file or directory

set_attributes: failed to set time on ./fsroot-broadcom/usr/share/doc/hdparm/README.Debian, because No such file or directory

set_attributes: failed to set time on ./fsroot-broadcom/usr/share/doc/hdparm/README.acoustic, because No such file or directory

set_attributes: failed to set time on ./fsroot-broadcom/usr/share/doc/hdparm/TODO, because No such file or directory

set_attributes: failed to set time on ./fsroot-broadcom/usr/share/doc/hdparm/changelog.Debian.gz, because No such file or directory

set_attributes: failed to set time on ./fsroot-broadcom/usr/share/doc/hdparm/changelog.gz, because No such file or directory

set_attributes: failed to set time on ./fsroot-broadcom/usr/share/doc/hdparm/changelog.old.gz, because No such file or directory

set_attributes: failed to set time on ./fsroot-broadcom/usr/share/doc/hdparm/contrib/fix_standby.c.gz, because No such file or directory

set_attributes: failed to set time on ./fsroot-broadcom/usr/share/doc/hdparm/contrib, because No such file or directory

set_attributes: failed to set time on ./fsroot-broadcom/usr/share/doc/hdparm/copyright, because No such file or directory

set_attributes: failed to set time on ./fsroot-broadcom/usr/share/doc/hdparm/wiper/README.txt.gz, because No such file or directory

set_attributes: failed to set time on ./fsroot-broadcom/usr/share/doc/hdparm/wiper/wiper.sh.gz, because No such file or directory

set_attributes: failed to set time on ./fsroot-broadcom/usr/share/doc/hdparm/wiper, because No such file or directory

set_attributes: failed to set time on ./fsroot-broadcom/usr/share/doc/hdparm, because No such file or directory

set_attributes: failed to set time on ./fsroot-broadcom/usr/share/doc/hostname/changelog.gz, because No such file or directory

set_attributes: failed to set time on ./fsroot-broadcom/usr/share/doc/hostname/copyright, because No such file or directory

set_attributes: failed to set time on ./fsroot-broadcom/usr/share/doc/hostname, because No such file or directory

set_attributes: failed to set time on ./fsroot-broadcom/usr/share/doc/hping3/APD.txt.gz, because No such file or directory

set_attributes: failed to set time on ./fsroot-broadcom/usr/share/doc/hping3/API.txt.gz, because No such file or directory

set_attributes: failed to set time on ./fsroot-broadcom/usr/share/doc/hping3/AS-BACKDOOR, because No such file or directory

set_attributes: failed to set time on ./fsroot-broadcom/usr/share/doc/hping3/BUGS, because No such file or directory

set_attributes: failed to set time on ./fsroot-broadcom/usr/share/doc/hping3/HPING3.txt, because No such file or directory

set_attributes: failed to set time on ./fsroot-broadcom/usr/share/doc/hping3/MORE-FUN-WITH-IPID, because No such file or directory

set_attributes: failed to set time on ./fsroot-broadcom/usr/share/doc/hping3/NEWS.gz, because No such file or directory

set_attributes: failed to set time on ./fsroot-broadcom/usr/share/doc/hping3/README, because No such file or directory

set_attributes: failed to set time on ./fsroot-broadcom/usr/share/doc/hping3/SPOOFED_SCAN.txt.gz, because No such file or directory

set_attributes: failed to set time on ./fsroot-broadcom/usr/share/doc/hping3/TODO, because No such file or directory

set_attributes: failed to set time on ./fsroot-broadcom/usr/share/doc/hping3/changelog.Debian.gz, because No such file or directory

set_attributes: failed to set time on ./fsroot-broadcom/usr/share/doc/hping3/changelog.gz, because No such file or directory

set_attributes: failed to set time on ./fsroot-broadcom/usr/share/doc/hping3/copyright, because No such file or directory

set_attributes: failed to set time on ./fsroot-broadcom/usr/share/doc/hping3/examples/apd.htcl, because No such file or directory

set_attributes: failed to set time on ./fsroot-broadcom/usr/share/doc/hping3/examples/apd2.htcl, because No such file or directory

set_attributes: failed to set time on ./fsroot-broadcom/usr/share/doc/hping3/examples/ciscoios.htcl, because No such file or directory

set_attributes: failed to set time on ./fsroot-broadcom/usr/share/doc/hping3/examples/ciscoios0.htcl, because No such file or directory

set_attributes: failed to set time on ./fsroot-broadcom/usr/share/doc/hping3/examples/cloner.htcl, because No such file or directory

set_attributes: failed to set time on ./fsroot-broadcom/usr/share/doc/hping3/examples/hpingstdlib.htcl, because No such file or directory

set_attributes: failed to set time on ./fsroot-broadcom/usr/share/doc/hping3/examples/igrp.htcl, because No such file or directory

set_attributes: failed to set time on ./fsroot-broadcom/usr/share/doc/hping3/examples/nat-noise.htcl, because No such file or directory

set_attributes: failed to set time on ./fsroot-broadcom/usr/share/doc/hping3/examples/passivets.htcl, because No such file or directory

set_attributes: failed to set time on ./fsroot-broadcom/usr/share/doc/hping3/examples/ping.htcl, because No such file or directory

set_attributes: failed to set time on ./fsroot-broadcom/usr/share/doc/hping3/examples/raw.htcl, because No such file or directory

set_attributes: failed to set time on ./fsroot-broadcom/usr/share/doc/hping3/examples/show-tcpseq.htcl, because No such file or directory

set_attributes: failed to set time on ./fsroot-broadcom/usr/share/doc/hping3/examples/showled.htcl, because No such file or directory

set_attributes: failed to set time on ./fsroot-broadcom/usr/share/doc/hping3/examples, because No such file or directory

set_attributes: failed to set time on ./fsroot-broadcom/usr/share/doc/hping3, because No such file or directory

set_attributes: failed to set time on ./fsroot-broadcom/usr/share/doc/i2c-tools/changelog.Debian.amd64.gz, because No such file or directory

set_attributes: failed to set time on ./fsroot-broadcom/usr/share/doc/i2c-tools/changelog.Debian.gz, because No such file or directory

set_attributes: failed to set time on ./fsroot-broadcom/usr/share/doc/i2c-tools/changelog.gz, because No such file or directory

set_attributes: failed to set time on ./fsroot-broadcom/usr/share/doc/i2c-tools/copyright, because No such file or directory

set_attributes: failed to set time on ./fsroot-broadcom/usr/share/doc/i2c-tools, because No such file or directory

set_attributes: failed to set time on ./fsroot-broadcom/usr/share/doc/ifmetric/README.gz, because No such file or directory

set_attributes: failed to set time on ./fsroot-broadcom/usr/share/doc/ifmetric/changelog.Debian.gz, because No such file or directory

set_attributes: failed to set time on ./fsroot-broadcom/usr/share/doc/ifmetric/changelog.gz, because No such file or directory

set_attributes: failed to set time on ./fsroot-broadcom/usr/share/doc/ifmetric/copyright, because No such file or directory

set_attributes: failed to set time on ./fsroot-broadcom/usr/share/doc/ifmetric, because No such file or directory

set_attributes: failed to set time on ./fsroot-broadcom/usr/share/doc/init-system-helpers/README.invoke-rc.d.gz, because No such file or directory

set_attributes: failed to set time on ./fsroot-broadcom/usr/share/doc/init-system-helpers/README.policy-rc.d.gz, because No such file or directory

set_attributes: failed to set time on ./fsroot-broadcom/usr/share/doc/init-system-helpers/changelog.gz, because No such file or directory

set_attributes: failed to set time on ./fsroot-broadcom/usr/share/doc/init-system-helpers/copyright, because No such file or directory

set_attributes: failed to set time on ./fsroot-broadcom/usr/share/doc/init-system-helpers, because No such file or directory

set_attributes: failed to set time on ./fsroot-broadcom/usr/share/doc/initramfs-tools/NEWS.Debian.gz, because No such file or directory

set_attributes: failed to set time on ./fsroot-broadcom/usr/share/doc/initramfs-tools/TODO, because No such file or directory

set_attributes: failed to set time on ./fsroot-broadcom/usr/share/doc/initramfs-tools/changelog.gz, because No such file or directory

set_attributes: failed to set time on ./fsroot-broadcom/usr/share/doc/initramfs-tools/copyright, because No such file or directory

set_attributes: failed to set time on ./fsroot-broadcom/usr/share/doc/initramfs-tools, because No such file or directory

set_attributes: failed to set time on ./fsroot-broadcom/usr/share/doc/initramfs-tools-core/NEWS.Debian.gz, because No such file or directory

set_attributes: failed to set time on ./fsroot-broadcom/usr/share/doc/initramfs-tools-core/changelog.gz, because No such file or directory

set_attributes: failed to set time on ./fsroot-broadcom/usr/share/doc/initramfs-tools-core/copyright, because No such file or directory

set_attributes: failed to set time on ./fsroot-broadcom/usr/share/doc/initramfs-tools-core/examples/example_hook, because No such file or directory

set_attributes: failed to set time on ./fsroot-broadcom/usr/share/doc/initramfs-tools-core/examples/example_script, because No such file or directory

set_attributes: failed to set time on ./fsroot-broadcom/usr/share/doc/initramfs-tools-core/examples/framebuffer, because No such file or directory

set_attributes: failed to set time on ./fsroot-broadcom/usr/share/doc/initramfs-tools-core/examples/modules, because No such file or directory

set_attributes: failed to set time on ./fsroot-broadcom/usr/share/doc/initramfs-tools-core/examples, because No such file or directory

set_attributes: failed to set time on ./fsroot-broadcom/usr/share/doc/initramfs-tools-core, because No such file or directory

set_attributes: failed to set time on ./fsroot-broadcom/usr/share/doc/ipmitool/AUTHORS, because No such file or directory

set_attributes: failed to set time on ./fsroot-broadcom/usr/share/doc/ipmitool/NEWS.Debian.gz, because No such file or directory

set_attributes: failed to set time on ./fsroot-broadcom/usr/share/doc/ipmitool/README.Debian, because No such file or directory

set_attributes: failed to set time on ./fsroot-broadcom/usr/share/doc/ipmitool/README.gz, because No such file or directory

set_attributes: failed to set time on ./fsroot-broadcom/usr/share/doc/ipmitool/changelog.Debian.gz, because No such file or directory

set_attributes: failed to set time on ./fsroot-broadcom/usr/share/doc/ipmitool/changelog.gz, because No such file or directory

set_attributes: failed to set time on ./fsroot-broadcom/usr/share/doc/ipmitool/copyright, because No such file or directory

set_attributes: failed to set time on ./fsroot-broadcom/usr/share/doc/ipmitool, because No such file or directory

set_attributes: failed to set time on ./fsroot-broadcom/usr/share/doc/iproute2/README.Debian, because No such file or directory

set_attributes: failed to set time on ./fsroot-broadcom/usr/share/doc/iproute2/changelog.Debian.gz, because No such file or directory

set_attributes: failed to set time on ./fsroot-broadcom/usr/share/doc/iproute2/copyright, because No such file or directory

set_attributes: failed to set time on ./fsroot-broadcom/usr/share/doc/iproute2, because No such file or directory

set_attributes: failed to set time on ./fsroot-broadcom/usr/share/doc/iptables/NEWS.Debian.gz, because No such file or directory

set_attributes: failed to set time on ./fsroot-broadcom/usr/share/doc/iptables/README.Debian, because No such file or directory

set_attributes: failed to set time on ./fsroot-broadcom/usr/share/doc/iptables/changelog.Debian.gz, because No such file or directory

set_attributes: failed to set time on ./fsroot-broadcom/usr/share/doc/iptables/copyright, because No such file or directory

set_attributes: failed to set time on ./fsroot-broadcom/usr/share/doc/iptables, because No such file or directory

set_attributes: failed to set time on ./fsroot-broadcom/usr/share/doc/iptables-persistent/NEWS.Debian.gz, because No such file or directory

set_attributes: failed to set time on ./fsroot-broadcom/usr/share/doc/iptables-persistent/README, because No such file or directory

set_attributes: failed to set time on ./fsroot-broadcom/usr/share/doc/iptables-persistent/changelog.gz, because No such file or directory

set_attributes: failed to set time on ./fsroot-broadcom/usr/share/doc/iptables-persistent/copyright, because No such file or directory

set_attributes: failed to set time on ./fsroot-broadcom/usr/share/doc/iptables-persistent, because No such file or directory

set_attributes: failed to set time on ./fsroot-broadcom/usr/share/doc/iputils-ping/NEWS.Debian.gz, because No such file or directory

set_attributes: failed to set time on ./fsroot-broadcom/usr/share/doc/iputils-ping/changelog.Debian.gz, because No such file or directory

set_attributes: failed to set time on ./fsroot-broadcom/usr/share/doc/iputils-ping/changelog.gz, because No such file or directory

set_attributes: failed to set time on ./fsroot-broadcom/usr/share/doc/iputils-ping/copyright, because No such file or directory

set_attributes: failed to set time on ./fsroot-broadcom/usr/share/doc/iputils-ping, because No such file or directory

set_attributes: failed to set time on ./fsroot-broadcom/usr/share/doc/isc-dhcp-client/NEWS.Debian.gz, because No such file or directory

set_attributes: failed to set time on ./fsroot-broadcom/usr/share/doc/isc-dhcp-client/README.gz, because No such file or directory

set_attributes: failed to set time on ./fsroot-broadcom/usr/share/doc/isc-dhcp-client/changelog.Debian.gz, because No such file or directory

set_attributes: failed to set time on ./fsroot-broadcom/usr/share/doc/isc-dhcp-client/changelog.gz, because No such file or directory

set_attributes: failed to set time on ./fsroot-broadcom/usr/share/doc/isc-dhcp-client/copyright, because No such file or directory

set_attributes: failed to set time on ./fsroot-broadcom/usr/share/doc/isc-dhcp-client/dhclient.conf.example, because No such file or directory

set_attributes: failed to set time on ./fsroot-broadcom/usr/share/doc/isc-dhcp-client, because No such file or directory

set_attributes: failed to set time on ./fsroot-broadcom/usr/share/doc/jq/AUTHORS.gz, because No such file or directory

set_attributes: failed to set time on ./fsroot-broadcom/usr/share/doc/jq/README, because No such file or directory

set_attributes: failed to set time on ./fsroot-broadcom/usr/share/doc/jq/changelog.Debian.gz, because No such file or directory

set_attributes: failed to set time on ./fsroot-broadcom/usr/share/doc/jq/changelog.gz, because No such file or directory

set_attributes: failed to set time on ./fsroot-broadcom/usr/share/doc/jq/copyright, because No such file or directory

set_attributes: failed to set time on ./fsroot-broadcom/usr/share/doc/jq, because No such file or directory

set_attributes: failed to set time on ./fsroot-broadcom/usr/share/doc/kexec-tools/News, because No such file or directory

set_attributes: failed to set time on ./fsroot-broadcom/usr/share/doc/kexec-tools/README.Debian, because No such file or directory

set_attributes: failed to set time on ./fsroot-broadcom/usr/share/doc/kexec-tools/TODO, because No such file or directory

set_attributes: failed to set time on ./fsroot-broadcom/usr/share/doc/kexec-tools/changelog.Debian.gz, because No such file or directory

set_attributes: failed to set time on ./fsroot-broadcom/usr/share/doc/kexec-tools/copyright, because No such file or directory

set_attributes: failed to set time on ./fsroot-broadcom/usr/share/doc/kexec-tools, because No such file or directory

set_attributes: failed to set time on ./fsroot-broadcom/usr/share/doc/less/LESSOPEN, because No such file or directory

set_attributes: failed to set time on ./fsroot-broadcom/usr/share/doc/less/NEWS.gz, because No such file or directory

set_attributes: failed to set time on ./fsroot-broadcom/usr/share/doc/less/README.Debian, because No such file or directory

set_attributes: failed to set time on ./fsroot-broadcom/usr/share/doc/less/changelog.Debian.gz, because No such file or directory

set_attributes: failed to set time on ./fsroot-broadcom/usr/share/doc/less/copyright, because No such file or directory

set_attributes: failed to set time on ./fsroot-broadcom/usr/share/doc/less, because No such file or directory

set_attributes: failed to set time on ./fsroot-broadcom/usr/share/doc/libabsl20220623/changelog.Debian.gz, because No such file or directory

set_attributes: failed to set time on ./fsroot-broadcom/usr/share/doc/libabsl20220623/copyright, because No such file or directory

set_attributes: failed to set time on ./fsroot-broadcom/usr/share/doc/libabsl20220623, because No such file or directory

set_attributes: failed to set time on ./fsroot-broadcom/usr/share/doc/libacl1/changelog.Debian.gz, because No such file or directory

set_attributes: failed to set time on ./fsroot-broadcom/usr/share/doc/libacl1/changelog.gz, because No such file or directory

set_attributes: failed to set time on ./fsroot-broadcom/usr/share/doc/libacl1/copyright, because No such file or directory

set_attributes: failed to set time on ./fsroot-broadcom/usr/share/doc/libacl1, because No such file or directory

set_attributes: failed to set time on ./fsroot-broadcom/usr/share/doc/libapparmor1/changelog.Debian.gz, because No such file or directory

set_attributes: failed to set time on ./fsroot-broadcom/usr/share/doc/libapparmor1/copyright, because No such file or directory

set_attributes: failed to set time on ./fsroot-broadcom/usr/share/doc/libapparmor1, because No such file or directory

set_attributes: failed to set time on ./fsroot-broadcom/usr/share/doc/libapt-pkg6.0/NEWS.Debian.gz, because No such file or directory

set_attributes: failed to set time on ./fsroot-broadcom/usr/share/doc/libapt-pkg6.0/changelog.gz, because No such file or directory

set_attributes: failed to set time on ./fsroot-broadcom/usr/share/doc/libapt-pkg6.0/copyright, because No such file or directory

set_attributes: failed to set time on ./fsroot-broadcom/usr/share/doc/libapt-pkg6.0, because No such file or directory

set_attributes: failed to set time on ./fsroot-broadcom/usr/share/doc/libargon2-1/changelog.Debian.gz, because No such file or directory

set_attributes: failed to set time on ./fsroot-broadcom/usr/share/doc/libargon2-1/changelog.gz, because No such file or directory

set_attributes: failed to set time on ./fsroot-broadcom/usr/share/doc/libargon2-1/copyright, because No such file or directory

set_attributes: failed to set time on ./fsroot-broadcom/usr/share/doc/libargon2-1, because No such file or directory

set_attributes: failed to set time on ./fsroot-broadcom/usr/share/doc/libassuan0/changelog.Debian.gz, because No such file or directory

set_attributes: failed to set time on ./fsroot-broadcom/usr/share/doc/libassuan0/changelog.gz, because No such file or directory

set_attributes: failed to set time on ./fsroot-broadcom/usr/share/doc/libassuan0/copyright, because No such file or directory

set_attributes: failed to set time on ./fsroot-broadcom/usr/share/doc/libassuan0, because No such file or directory

set_attributes: failed to set time on ./fsroot-broadcom/usr/share/doc/libattr1/changelog.Debian.gz, because No such file or directory

set_attributes: failed to set time on ./fsroot-broadcom/usr/share/doc/libattr1/changelog.gz, because No such file or directory

set_attributes: failed to set time on ./fsroot-broadcom/usr/share/doc/libattr1/copyright, because No such file or directory

set_attributes: failed to set time on ./fsroot-broadcom/usr/share/doc/libattr1, because No such file or directory

set_attributes: failed to set time on ./fsroot-broadcom/usr/share/doc/libaudit-common/changelog.Debian.gz, because No such file or directory

set_attributes: failed to set time on ./fsroot-broadcom/usr/share/doc/libaudit-common/changelog.gz, because No such file or directory

set_attributes: failed to set time on ./fsroot-broadcom/usr/share/doc/libaudit-common/copyright, because No such file or directory

set_attributes: failed to set time on ./fsroot-broadcom/usr/share/doc/libaudit-common, because No such file or directory

[=====================================/                      ] 43581/67775  64%
[========================================================-   ] 64369/67775  94%
[===========================================================-] 67775/67775 100%

created 25922 files
created 3484 directories
created 2373 symlinks
created 5351 devices
created 0 fifos
created 0 sockets
created 5 hardlinks
[  FAIL LOG END  ] [ target/sonic-broadcom.bin ]
make: *** [slave.mk:1435: target/sonic-broadcom.bin] Error 1
make: *** Waiting for unfinished jobs....
[ finished ] [ target/sonic-aboot-broadcom.swi ] 
[ FAIL LOG START ] [ target/sonic-aboot-broadcom.swi ]
Build start time: Thu Sep 24 06:13:17 UTC 2026
++ '[' -f .arch ']'
++ cat .arch
+ CONFIGURED_ARCH=amd64
+ DOCKER_VERSION=5:24.0.2-1~debian.12~bookworm
+ CONTAINERD_IO_VERSION=1.6.21-1
+ LINUX_KERNEL_VERSION=6.1.0-29-2
+ FILESYSTEM_ROOT=./fsroot
+ PLATFORM_DIR=platform
+ HOSTNAME=sonic
+ DEFAULT_USERINFO='Default admin user,,,'
+ BUILD_TOOL_PATH=src/sonic-build-hooks/buildinfo
+ TRUSTED_GPG_DIR=src/sonic-build-hooks/buildinfo/trusted.gpg.d
+ . ./onie-image.conf
++ : 32768
++ : x86_64
++ : broadcom
++ ONIEIMAGE_VERSION=r0
++ FILESYSTEM_ROOT=./fsroot-broadcom
++ FILESYSTEM_SQUASHFS=fs.squashfs
++ INSTALLER_PAYLOAD=fs.zip
++ FILESYSTEM_DOCKERFS=dockerfs.tar.gz
++ DOCKERFS_DIR=docker
++ DOCKER_RAMFS_SIZE=3500M
++ OUTPUT_ONIE_IMAGE=target/sonic-broadcom.bin
++ OUTPUT_RAW_IMAGE=target/sonic-broadcom.raw
++ RAW_IMAGE_DISK_SIZE=1700
++ OUTPUT_KVM_IMAGE=target/sonic-broadcom.img
++ KVM_IMAGE_DISK_SIZE=16
++ OUTPUT_ABOOT_IMAGE=target/sonic-aboot-broadcom.swi
++ ABOOT_BOOT_IMAGE=.sonic-boot.swi
++ OUTPUT_KVM_4ASIC_IMAGE=target/sonic-4asic-broadcom.img
++ OUTPUT_KVM_6ASIC_IMAGE=target/sonic-6asic-broadcom.img
++ OUTPUT_DSC_IMAGE=target/sonic-broadcom.tar
+ '[' -n 32768 ']'
+ '[' -n fs.zip ']'
+ '[' -n fs.squashfs ']'
+ '[' aboot = aboot ']'
+ TARGET_BOOTLOADER=aboot
+ [[ y != y ]]
+ [[ n == y ]]
+ [[ y == y ]]
+ echo '[INFO] RFS build: second stage'
[INFO] RFS build: second stage
+ sudo mount proc /proc -t proc
+ sudo fuser -vm ./fsroot-broadcom
                     USER        PID ACCESS COMMAND
/sonic/fsroot-broadcom:
                     root     kernel mount /usr/sbin/docker-init
                     jenkins       1 ..ce. docker-init
                     jenkins       7 ..c.. bash
                     jenkins       8 ..c.. make
                     root       8261 ....m dockerd
                     root       8427 ....m containerd
                     jenkins   475144 ..c.. bash
                     jenkins   475434 ..c.. bash
                     jenkins   475632 ..c.. build_debian.sh
                     jenkins   475633 ..c.. process_log.sh
                     root      475649 ..c.. sudo
                     root      475650 F.c.. unsquashfs
                     jenkins   475771 ..c.. build_debian.sh
                     jenkins   475772 ..c.. process_log.sh
                     root      475780 ..c.. sudo
+ sudo rm -rf ./fsroot-broadcom
rm: cannot remove './fsroot-broadcom/usr/share/doc': Directory not empty
[  FAIL LOG END  ] [ target/sonic-aboot-broadcom.swi ]
make: *** [slave.mk:1435: target/sonic-aboot-broadcom.swi] Error 1
WARNING: Ignoring invalid distribution ~onic-thermalctld (/var/jenkins/.local/lib/python3.11/site-packages)
make[1]: *** [Makefile.work:611: all] Error 2
make[1]: Leaving directory '/var/lib/jenkins/workspace/DevOps-test2/platform-broadcom'
make: *** [Makefile:53: all] Error 2