+++ --- Applying local submodule patches --- +++
already applied: sonic-utilities
already applied: sonic-swss
already applied: sonic-swss-new
already applied: sonic-sairedis-vslib
already applied: sonic-sairedis-meta
already applied: sonic-sairedis-SAI
already applied: sonic-sairedis-SAI-apidef
already applied: sonic-mgmt-framework
+++ --- Making all --- +++
./scripts/run_with_retry make BLDENV=bookworm -f Makefile.work all
make[1]: Entering directory '/var/lib/jenkins/workspace/DevOps-test2/platform-vs'
"SECURE_UPGRADE_PROD_SIGNING_TOOL": ""
~/workspace/DevOps-test2/platform-vs/src/sonic-build-hooks ~/workspace/DevOps-test2/platform-vs
make[2]: Entering directory '/var/lib/jenkins/workspace/DevOps-test2/platform-vs/src/sonic-build-hooks'
dpkg-deb: building package 'sonic-build-hooks' in 'buildinfo/sonic-build-hooks_1.0_all.deb'.
make[2]: Leaving directory '/var/lib/jenkins/workspace/DevOps-test2/platform-vs/src/sonic-build-hooks'
~/workspace/DevOps-test2/platform-vs
Checking sonic-slave-base image: sonic-slave-bookworm:2f250bfbb4a
Checking sonic-slave-user image: sonic-slave-bookworm-jenkins:d05b1641d68
SONiC Build System
Build Configuration
"CONFIGURED_PLATFORM" : "vs"
"CONFIGURED_ARCH" : "amd64"
"SONIC_CONFIG_PRINT_DEPENDENCIES" : ""
"SONIC_BUILD_JOBS" : "4"
"SONIC_CONFIG_MAKE_JOBS" : "112"
"USE_NATIVE_DOCKERD_FOR_BUILD" : ""
"SONIC_USE_DOCKER_BUILDKIT" : ""
"USERNAME" : "admin"
"PASSWORD" : "YourPaSsWoRd"
"CHANGE_DEFAULT_PASSWORD" : "n"
"SECURE_UPGRADE_MODE" : "no_sign"
"SECURE_UPGRADE_DEV_SIGNING_KEY" : ""
"SECURE_UPGRADE_SIGNING_CERT" : ""
"SECURE_UPGRADE_PROD_SIGNING_TOOL": ""
"SECURE_UPGRADE_PROD_TOOL_ARGS" : ""
"ONIE_IMAGE_PART_SIZE" : ""
"SHUTDOWN_BGP_ON_START" : ""
"ENABLE_PFCWD_ON_START" : ""
"SONIC_BUFFER_MODEL" : ""
"INSTALL_DEBUG_TOOLS" : ""
"ROUTING_STACK" : "frr"
"FRR_USER_UID" : "300"
"FRR_USER_GID" : "300"
"ENABLE_SYNCD_RPC" : ""
"SAITHRIFT_V2" : ""
"ENABLE_ORGANIZATION_EXTENSIONS" : "y"
"HTTP_PROXY" : ""
"HTTPS_PROXY" : ""
"NO_PROXY" : ""
"ENABLE_ZTP" : ""
"INCLUDE_PDE" : ""
"SONIC_DEBUGGING_ON" : ""
"SONIC_PROFILING_ON" : ""
"KERNEL_PROCURE_METHOD" : "build"
"BUILD_TIMESTAMP" : "20260927.004124"
"BUILD_LOG_TIMESTAMP" : "none"
"SONIC_IMAGE_VERSION" : "etri-202505.17-8610ff460"
"BLDENV" : "bookworm"
"VS_PREPARE_MEM" : "yes"
"INCLUDE_MGMT_FRAMEWORK" : "y"
"INCLUDE_ICCPD" : "n"
"INCLUDE_STP" : "y"
"INCLUDE_SYSTEM_TELEMETRY" : "y"
"INCLUDE_SYSTEM_GNMI" : "y"
"INCLUDE_SYSTEM_BMP" : "y"
"INCLUDE_SYSTEM_EVENTD" : "y"
"ENABLE_HOST_SERVICE_ON_START" : "y"
"INCLUDE_RESTAPI" : "n"
"INCLUDE_SFLOW" : "y"
"INCLUDE_NAT" : "y"
"INCLUDE_DHCP_RELAY" : "y"
"INCLUDE_DHCP_SERVER" : "n"
"INCLUDE_P4RT" : "n"
"INCLUDE_VS_DASH_SAI" : "y"
"INCLUDE_KUBERNETES" : "n"
"INCLUDE_KUBERNETES_MASTER" : "n"
"INCLUDE_MACSEC" : "y"
"INCLUDE_MUX" : "y"
"INCLUDE_TEAMD" : "y"
"INCLUDE_DASH_HA" : "y"
"INCLUDE_ROUTER_ADVERTISER" : "y"
"INCLUDE_BOOTCHART : "y"
"ENABLE_BOOTCHART : "n"
"INCLUDE_FIPS" : "y"
"ENABLE_TRANSLIB_WRITE" : ""
"ENABLE_NATIVE_WRITE" : "y"
"ENABLE_DIALOUT" : ""
"ENABLE_AUTO_TECH_SUPPORT" : "y"
"PDDF_SUPPORT" : "y"
"MULTIARCH_QEMU_ENVIRON" : "n"
"SONIC_VERSION_CONTROL_COMPONENTS": "py2,py3,web,git,docker"
"ENABLE_ASAN" : "n"
"DEFAULT_CONTAINER_REGISTRY" : "publicmirror.azurecr.io/"
"BUILD_MULTIASIC_KVM" : "n"
"CROSS_BUILD_ENVIRON" : "n"
"LEGACY_SONIC_MGMT_DOCKER" : "y"
"INCLUDE_EXTERNAL_PATCHES" : "n"
"PTF_ENV_PY_VER" : "py3"
"ENABLE_MULTIDB" : ""
mv: cannot move '/etc/apt/sources.list.d/debian.sources' to '/etc/apt/sources.list.d/debian.sources.back': Permission denied
fatal: not a git repository (or any of the parent directories): .git
"SONIC_DPKG_CACHE_METHOD" : "none"
[ building ] [ target/debs/bookworm/libyang_1.0.73_amd64.deb ]
[ building ] [ target/debs/bookworm/libnl-3-200_3.7.0-0.2+b1sonic1_amd64.deb-install ]
[ building ] [ target/python-wheels/bookworm/redis_dump_load-1.1-py3-none-any.whl-install ]
[ finished ] [ target/debs/bookworm/libnl-3-200_3.7.0-0.2+b1sonic1_amd64.deb-install ]
[ building ] [ target/debs/bookworm/p4lang-pi_0.1.0-15_amd64.deb-install ]
[ building ] [ target/debs/bookworm/libnl-3-dev_3.7.0-0.2+b1sonic1_amd64.deb-install ]
[ finished ] [ target/debs/bookworm/p4lang-pi_0.1.0-15_amd64.deb-install ]
[ building ] [ target/debs/bookworm/libnl-genl-3-200_3.7.0-0.2+b1sonic1_amd64.deb-install ]
[ finished ] [ target/debs/bookworm/libnl-genl-3-200_3.7.0-0.2+b1sonic1_amd64.deb-install ]
[ building ] [ target/debs/bookworm/libnl-route-3-200_3.7.0-0.2+b1sonic1_amd64.deb-install ]
[ finished ] [ target/python-wheels/bookworm/redis_dump_load-1.1-py3-none-any.whl-install ]
[ building ] [ target/debs/bookworm/p4lang-bmv2_1.15.0-7_amd64.deb-install ]
[ finished ] [ target/debs/bookworm/libnl-route-3-200_3.7.0-0.2+b1sonic1_amd64.deb-install ]
[ building ] [ target/debs/bookworm/libdashapi_1.0.0_amd64.deb-install ]
[ finished ] [ target/debs/bookworm/libdashapi_1.0.0_amd64.deb-install ]
[ building ] [ target/python-wheels/bookworm/swsssdk-2.0.1-py3-none-any.whl-install ]
[ finished ] [ target/python-wheels/bookworm/swsssdk-2.0.1-py3-none-any.whl-install ]
[ building ] [ target/debs/bookworm/frr-snmp_10.3-sonic-0_amd64.deb ]
[ finished ] [ target/debs/bookworm/frr-snmp_10.3-sonic-0_amd64.deb ]
[ building ] [ target/docker-base-bookworm.gz-load ]
[ finished ] [ target/docker-base-bookworm.gz-load ]
[ building ] [ target/sonic-vs.bin__vs__rfs.squashfs ]
[ finished ] [ target/debs/bookworm/libnl-3-dev_3.7.0-0.2+b1sonic1_amd64.deb-install ]
[ building ] [ target/files/bookworm/sonic_version.yml ]
[ finished ] [ target/files/bookworm/sonic_version.yml ]
[ building ] [ target/debs/bookworm/libnl-genl-3-dev_3.7.0-0.2+b1sonic1_amd64.deb-install ]
[ finished ] [ target/debs/bookworm/libnl-genl-3-dev_3.7.0-0.2+b1sonic1_amd64.deb-install ]
[ building ] [ target/debs/bookworm/libnl-route-3-dev_3.7.0-0.2+b1sonic1_amd64.deb-install ]
[ finished ] [ target/debs/bookworm/libnl-route-3-dev_3.7.0-0.2+b1sonic1_amd64.deb-install ]
[ building ] [ target/debs/bookworm/libnl-nf-3-200_3.7.0-0.2+b1sonic1_amd64.deb-install ]
[ finished ] [ target/debs/bookworm/libnl-nf-3-200_3.7.0-0.2+b1sonic1_amd64.deb-install ]
[ building ] [ target/debs/bookworm/libnl-nf-3-dev_3.7.0-0.2+b1sonic1_amd64.deb-install ]
[ finished ] [ target/debs/bookworm/libnl-nf-3-dev_3.7.0-0.2+b1sonic1_amd64.deb-install ]
[ building ] [ target/debs/bookworm/libnl-cli-3-200_3.7.0-0.2+b1sonic1_amd64.deb-install ]
[ finished ] [ target/debs/bookworm/libnl-cli-3-200_3.7.0-0.2+b1sonic1_amd64.deb-install ]
[ building ] [ target/debs/bookworm/libnl-cli-3-dev_3.7.0-0.2+b1sonic1_amd64.deb-install ]
[ finished ] [ target/debs/bookworm/libnl-cli-3-dev_3.7.0-0.2+b1sonic1_amd64.deb-install ]
[ building ] [ target/debs/bookworm/libteamdctl0_1.31-1_amd64.deb ]
[ finished ] [ target/debs/bookworm/libteamdctl0_1.31-1_amd64.deb ]
[ building ] [ target/debs/bookworm/libteam5_1.31-1_amd64.deb-install ]
[ finished ] [ target/debs/bookworm/libteam5_1.31-1_amd64.deb-install ]
[ building ] [ target/debs/bookworm/libteam-dev_1.31-1_amd64.deb ]
[ finished ] [ target/debs/bookworm/libteam-dev_1.31-1_amd64.deb ]
[ building ] [ target/debs/bookworm/libteam-utils_1.31-1_amd64.deb ]
[ finished ] [ target/debs/bookworm/libteam-utils_1.31-1_amd64.deb ]
[ building ] [ target/debs/bookworm/libteamdctl0_1.31-1_amd64.deb-install ]
[ finished ] [ target/debs/bookworm/libteamdctl0_1.31-1_amd64.deb-install ]
[ building ] [ target/debs/bookworm/libteam-dev_1.31-1_amd64.deb-install ]
[ finished ] [ target/debs/bookworm/libteam-dev_1.31-1_amd64.deb-install ]
[ building ] [ target/debs/bookworm/libteam-utils_1.31-1_amd64.deb-install ]
[ finished ] [ target/debs/bookworm/libteam-utils_1.31-1_amd64.deb-install ]
[ finished ] [ target/debs/bookworm/p4lang-bmv2_1.15.0-7_amd64.deb-install ]
[ building ] [ target/debs/bookworm/p4lang-p4c_1.2.4.2-2_amd64.deb ]
[ finished ] [ target/debs/bookworm/libyang_1.0.73_amd64.deb ]
[ building ] [ target/debs/bookworm/libyang-cpp_1.0.73_amd64.deb ]
[ building ] [ target/debs/bookworm/libyang_1.0.73_amd64.deb-install ]
[ finished ] [ target/debs/bookworm/libyang_1.0.73_amd64.deb-install ]
[ building ] [ target/debs/bookworm/libyang-dev_1.0.73_amd64.deb ]
[ finished ] [ target/debs/bookworm/libyang-dev_1.0.73_amd64.deb ]
[ building ] [ target/debs/bookworm/libyang-dev_1.0.73_amd64.deb-install ]
[ finished ] [ target/debs/bookworm/libyang-dev_1.0.73_amd64.deb-install ]
[ finished ] [ target/debs/bookworm/libyang-cpp_1.0.73_amd64.deb ]
[ building ] [ target/debs/bookworm/python3-yang_1.0.73_amd64.deb ]
[ building ] [ target/debs/bookworm/libyang-cpp_1.0.73_amd64.deb-install ]
[ finished ] [ target/debs/bookworm/python3-yang_1.0.73_amd64.deb ]
[ finished ] [ target/debs/bookworm/libyang-cpp_1.0.73_amd64.deb-install ]
[ building ] [ target/debs/bookworm/python3-yang_1.0.73_amd64.deb-install ]
[ finished ] [ target/debs/bookworm/python3-yang_1.0.73_amd64.deb-install ]
[ building ] [ target/python-wheels/bookworm/sonic_yang_models-1.0-py3-none-any.whl ]
[ finished ] [ target/python-wheels/bookworm/sonic_yang_models-1.0-py3-none-any.whl ]
[ building ] [ target/python-wheels/bookworm/sonic_yang_models-1.0-py3-none-any.whl-install ]
[ finished ] [ target/python-wheels/bookworm/sonic_yang_models-1.0-py3-none-any.whl-install ]
[ building ] [ target/python-wheels/bookworm/sonic_yang_mgmt-1.0-py3-none-any.whl ]
[ building ] [ target/debs/bookworm/sonic-mgmt-common_1.0.0_amd64.deb ]
[ finished ] [ target/python-wheels/bookworm/sonic_yang_mgmt-1.0-py3-none-any.whl ]
[ building ] [ target/python-wheels/bookworm/sonic_yang_mgmt-1.0-py3-none-any.whl-install ]
[ finished ] [ target/python-wheels/bookworm/sonic_yang_mgmt-1.0-py3-none-any.whl-install ]
[ building ] [ target/debs/bookworm/libswsscommon_1.0.0_amd64.deb ]
[ finished ] [ target/debs/bookworm/sonic-mgmt-common_1.0.0_amd64.deb ]
[ building ] [ target/debs/bookworm/sonic-mgmt-common-codegen_1.0.0_amd64.deb ]
[ finished ] [ target/debs/bookworm/sonic-mgmt-common-codegen_1.0.0_amd64.deb ]
[ building ] [ target/debs/bookworm/sonic-mgmt-common_1.0.0_amd64.deb-install ]
[ finished ] [ target/debs/bookworm/sonic-mgmt-common_1.0.0_amd64.deb-install ]
[ building ] [ target/debs/bookworm/sonic-mgmt-common-codegen_1.0.0_amd64.deb-install ]
[ finished ] [ target/debs/bookworm/sonic-mgmt-common-codegen_1.0.0_amd64.deb-install ]
[ building ] [ target/debs/bookworm/sonic-mgmt-framework_1.0-01_amd64.deb ]
[ finished ] [ target/debs/bookworm/libswsscommon_1.0.0_amd64.deb ]
[ finished ] [ target/sonic-vs.bin__vs__rfs.squashfs ]
[ building ] [ target/debs/bookworm/python3-swsscommon_1.0.0_amd64.deb ]
[ building ] [ target/debs/bookworm/sonic-db-cli_1.0.0_amd64.deb ]
[ finished ] [ target/debs/bookworm/sonic-db-cli_1.0.0_amd64.deb ]
[ building ] [ target/debs/bookworm/libswsscommon-dev_1.0.0_amd64.deb ]
[ finished ] [ target/debs/bookworm/libswsscommon-dev_1.0.0_amd64.deb ]
[ building ] [ target/debs/bookworm/libswsscommon_1.0.0_amd64.deb-install ]
[ finished ] [ target/debs/bookworm/libswsscommon_1.0.0_amd64.deb-install ]
[ building ] [ target/debs/bookworm/libswsscommon-dev_1.0.0_amd64.deb-install ]
[ finished ] [ target/debs/bookworm/libswsscommon-dev_1.0.0_amd64.deb-install ]
[ building ] [ target/debs/bookworm/sonic-eventd_1.0.0-0_amd64.deb ]
[ finished ] [ target/debs/bookworm/python3-swsscommon_1.0.0_amd64.deb ]
[ building ] [ target/debs/bookworm/sonic-bmp_0.1_amd64.deb ]
[ finished ] [ target/debs/bookworm/sonic-mgmt-framework_1.0-01_amd64.deb ]
[ building ] [ target/debs/bookworm/python3-swsscommon_1.0.0_amd64.deb-install ]
[ finished ] [ target/debs/bookworm/python3-swsscommon_1.0.0_amd64.deb-install ]
[ building ] [ target/debs/bookworm/dash-ha_1.0.0_amd64.deb ]
[ finished ] [ target/debs/bookworm/sonic-eventd_1.0.0-0_amd64.deb ]
[ building ] [ target/debs/bookworm/stp_1.0.0_amd64.deb ]
[ finished ] [ target/debs/bookworm/stp_1.0.0_amd64.deb ]
[ finished ] [ target/debs/bookworm/dash-ha_1.0.0_amd64.deb ]
[ building ] [ target/debs/bookworm/sonic-gnmi_0.1_amd64.deb ]
[ building ] [ target/debs/bookworm/sonic-linkmgrd_1.0.0-1_amd64.deb ]
[ finished ] [ target/debs/bookworm/sonic-bmp_0.1_amd64.deb ]
[ building ] [ target/debs/bookworm/sysmgr_1.0.0_amd64.deb ]
[ finished ] [ target/debs/bookworm/sonic-gnmi_0.1_amd64.deb ]
[ finished ] [ target/debs/bookworm/sysmgr_1.0.0_amd64.deb ]
[ building ] [ target/debs/bookworm/sonic-dhcpmon_1.0.0-0_amd64.deb ]
[ building ] [ target/debs/bookworm/sonic-dhcp6relay_1.0.0-0_amd64.deb ]
[ finished ] [ target/debs/bookworm/sonic-dhcpmon_1.0.0-0_amd64.deb ]
[ building ] [ target/debs/bookworm/wpasupplicant_2.9.0-14_amd64.deb ]
[ finished ] [ target/debs/bookworm/wpasupplicant_2.9.0-14_amd64.deb ]
[ building ] [ target/debs/bookworm/sonic-rsyslog-plugin_1.0.0-0_amd64.deb ]
[ finished ] [ target/debs/bookworm/sonic-rsyslog-plugin_1.0.0-0_amd64.deb ]
[ building ] [ target/python-wheels/bookworm/sonic_py_common-1.0-py3-none-any.whl ]
[ finished ] [ target/debs/bookworm/sonic-dhcp6relay_1.0.0-0_amd64.deb ]
[ building ] [ target/debs/bookworm/sonic-bmp_0.1_amd64.deb-install ]
[ finished ] [ target/debs/bookworm/sonic-bmp_0.1_amd64.deb-install ]
[ building ] [ target/debs/bookworm/stp_1.0.0_amd64.deb-install ]
[ finished ] [ target/debs/bookworm/stp_1.0.0_amd64.deb-install ]
[ finished ] [ target/python-wheels/bookworm/sonic_py_common-1.0-py3-none-any.whl ]
[ building ] [ target/python-wheels/bookworm/sonic_py_common-1.0-py3-none-any.whl-install ]
[ finished ] [ target/python-wheels/bookworm/sonic_py_common-1.0-py3-none-any.whl-install ]
[ building ] [ target/python-wheels/bookworm/sonic_containercfgd-1.0-py3-none-any.whl ]
[ building ] [ target/python-wheels/bookworm/sonic_config_engine-1.0-py3-none-any.whl ]
[ finished ] [ target/python-wheels/bookworm/sonic_containercfgd-1.0-py3-none-any.whl ]
[ building ] [ target/python-wheels/bookworm/sonic_d-2.0.0-py3-none-any.whl ]
[ finished ] [ target/python-wheels/bookworm/sonic_d-2.0.0-py3-none-any.whl ]
[ building ] [ target/python-wheels/bookworm/sonic_ledd-1.1-py3-none-any.whl ]
[ finished ] [ target/python-wheels/bookworm/sonic_ledd-1.1-py3-none-any.whl ]
[ building ] [ target/python-wheels/bookworm/sonic_pcied-1.0-py3-none-any.whl ]
[ finished ] [ target/python-wheels/bookworm/sonic_pcied-1.0-py3-none-any.whl ]
[ building ] [ target/python-wheels/bookworm/sonic_stormond-1.0-py3-none-any.whl ]
[ finished ] [ target/python-wheels/bookworm/sonic_stormond-1.0-py3-none-any.whl ]
[ building ] [ target/python-wheels/bookworm/sonic_dhcp_utilities-1.0-py3-none-any.whl ]
[ finished ] [ target/python-wheels/bookworm/sonic_dhcp_utilities-1.0-py3-none-any.whl ]
[ building ] [ target/python-wheels/bookworm/sonic_ctrmgrd-1.0.0-py3-none-any.whl ]
[ finished ] [ target/python-wheels/bookworm/sonic_ctrmgrd-1.0.0-py3-none-any.whl ]
[ finished ] [ target/debs/bookworm/sonic-linkmgrd_1.0.0-1_amd64.deb ]
[ finished ] [ target/debs/bookworm/p4lang-p4c_1.2.4.2-2_amd64.deb ]
[ building ] [ target/debs/bookworm/p4lang-p4c_1.2.4.2-2_amd64.deb-install ]
[ finished ] [ target/debs/bookworm/p4lang-p4c_1.2.4.2-2_amd64.deb-install ]
[ building ] [ target/debs/bookworm/libsai_1.0.0_amd64.deb ]
[ finished ] [ target/python-wheels/bookworm/sonic_config_engine-1.0-py3-none-any.whl ]
[ building ] [ target/docker-config-engine-bookworm.gz ]
[ building ] [ target/python-wheels/bookworm/sonic_config_engine-1.0-py3-none-any.whl-install ]
[ finished ] [ target/python-wheels/bookworm/sonic_config_engine-1.0-py3-none-any.whl-install ]
[ building ] [ target/python-wheels/bookworm/sonic_platform_common-1.0-py3-none-any.whl ]
[ building ] [ target/python-wheels/bookworm/sonic_bgpcfgd-1.0-py3-none-any.whl ]
[ finished ] [ target/debs/bookworm/libsai_1.0.0_amd64.deb ]
[ building ] [ target/python-wheels/bookworm/sonic_frr_mgmt_framework-1.0-py3-none-any.whl ]
[ finished ] [ target/python-wheels/bookworm/sonic_bgpcfgd-1.0-py3-none-any.whl ]
[ building ] [ target/python-wheels/bookworm/system_health-1.0-py3-none-any.whl ]
[ finished ] [ target/python-wheels/bookworm/sonic_platform_common-1.0-py3-none-any.whl ]
[ building ] [ target/python-wheels/bookworm/sonic_platform_common-1.0-py3-none-any.whl-install ]
[ finished ] [ target/python-wheels/bookworm/sonic_frr_mgmt_framework-1.0-py3-none-any.whl ]
[ building ] [ target/debs/bookworm/libsai_1.0.0_amd64.deb-install ]
[ finished ] [ target/debs/bookworm/libsai_1.0.0_amd64.deb-install ]
[ building ] [ target/debs/bookworm/libsairedis_1.0.0_amd64.deb ]
[ finished ] [ target/python-wheels/bookworm/sonic_platform_common-1.0-py3-none-any.whl-install ]
[ building ] [ target/python-wheels/bookworm/sonic_utilities-1.2-py3-none-any.whl ]
[ finished ] [ target/python-wheels/bookworm/system_health-1.0-py3-none-any.whl ]
[ building ] [ target/python-wheels/bookworm/sonic_psud-1.0-py3-none-any.whl ]
[ finished ] [ target/docker-config-engine-bookworm.gz ]
[ building ] [ target/python-wheels/bookworm/sonic_syseepromd-1.0-py3-none-any.whl ]
[ finished ] [ target/python-wheels/bookworm/sonic_utilities-1.2-py3-none-any.whl ]
[ building ] [ target/python-wheels/bookworm/sonic_thermalctld-1.0-py3-none-any.whl ]
[ finished ] [ target/python-wheels/bookworm/sonic_psud-1.0-py3-none-any.whl ]
[ building ] [ target/python-wheels/bookworm/sonic_sensormond-1.0-py3-none-any.whl ]
[ finished ] [ target/python-wheels/bookworm/sonic_syseepromd-1.0-py3-none-any.whl ]
[ building ] [ target/python-wheels/bookworm/sonic_xcvrd-1.0-py3-none-any.whl ]
[ finished ] [ target/python-wheels/bookworm/sonic_thermalctld-1.0-py3-none-any.whl ]
[ building ] [ target/python-wheels/bookworm/sonic_ycabled-1.0-py3-none-any.whl ]
[ finished ] [ target/python-wheels/bookworm/sonic_sensormond-1.0-py3-none-any.whl ]
[ building ] [ target/python-wheels/bookworm/sonic_chassisd-1.0-py3-none-any.whl ]
[ finished ] [ target/python-wheels/bookworm/sonic_xcvrd-1.0-py3-none-any.whl ]
[ building ] [ target/docker-config-engine-bookworm.gz-load ]
[ finished ] [ target/docker-config-engine-bookworm.gz-load ]
[ building ] [ target/python-wheels/bookworm/asyncsnmp-2.1.0-py3-none-any.whl ]
[ finished ] [ target/python-wheels/bookworm/sonic_ycabled-1.0-py3-none-any.whl ]
[ building ] [ target/docker-sonic-mgmt-framework.gz ]
[ finished ] [ target/python-wheels/bookworm/sonic_chassisd-1.0-py3-none-any.whl ]
[ building ] [ target/docker-sysmgr.gz ]
[ finished ] [ target/python-wheels/bookworm/asyncsnmp-2.1.0-py3-none-any.whl ]
[ building ] [ target/docker-dash-engine.gz ]
[ finished ] [ target/docker-sysmgr.gz ]
[ building ] [ target/python-wheels/bookworm/sonic_utilities-1.2-py3-none-any.whl-install ]
[ finished ] [ target/python-wheels/bookworm/sonic_utilities-1.2-py3-none-any.whl-install ]
[ building ] [ target/docker-auditd-watchdog.gz ]
[ finished ] [ target/docker-sonic-mgmt-framework.gz ]
[ building ] [ target/docker-auditd.gz ]
[ finished ] [ target/docker-auditd.gz ]
[ building ] [ target/docker-bmp-watchdog.gz ]
[ finished ] [ target/docker-dash-engine.gz ]
[ building ] [ target/python-wheels/bookworm/sonic_bmpcfgd_services-1.0-py3-none-any.whl ]
[ finished ] [ target/docker-auditd-watchdog.gz ]
[ building ] [ target/docker-database.gz ]
[ finished ] [ target/python-wheels/bookworm/sonic_bmpcfgd_services-1.0-py3-none-any.whl ]
[ building ] [ target/docker-eventd.gz ]
[ finished ] [ target/docker-eventd.gz ]
[ building ] [ target/docker-gnmi-watchdog.gz ]
[ finished ] [ target/docker-database.gz ]
[ building ] [ target/docker-sonic-gnmi.gz ]
[ finished ] [ target/docker-bmp-watchdog.gz ]
[ building ] [ target/docker-lldp.gz ]
[ finished ] [ target/debs/bookworm/libsairedis_1.0.0_amd64.deb ]
[ building ] [ target/docker-mux.gz ]
[ finished ] [ target/docker-sonic-gnmi.gz ]
[ building ] [ target/docker-platform-monitor.gz ]
[ finished ] [ target/docker-mux.gz ]
[ building ] [ target/docker-ptp.gz ]
[ finished ] [ target/docker-lldp.gz ]
[ building ] [ target/docker-router-advertiser.gz ]
[ finished ] [ target/docker-ptp.gz ]
[ building ] [ target/docker-snmp.gz ]
[ finished ] [ target/docker-gnmi-watchdog.gz ]
[ finished ] [ target/docker-router-advertiser.gz ]
[ building ] [ target/docker-sonic-gnmi.gz-load ]
[ building ] [ target/debs/bookworm/syncd-vs_1.0.0_amd64.deb ]
[ finished ] [ target/debs/bookworm/syncd-vs_1.0.0_amd64.deb ]
[ building ] [ target/docker-dhcp-relay.gz ]
/sonic/dockers/docker-dhcp-relay/cli-plugin-tests /sonic
[ finished ] [ target/docker-sonic-gnmi.gz-load ]
[ building ] [ target/python-wheels/bookworm/sonic_host_services-1.0-py3-none-any.whl ]
/sonic
[ finished ] [ target/python-wheels/bookworm/sonic_host_services-1.0-py3-none-any.whl ]
[ building ] [ target/docker-sonic-bmp.gz ]
[ finished ] [ target/docker-platform-monitor.gz ]
[ building ] [ target/debs/bookworm/libsairedis-dev_1.0.0_amd64.deb ]
[ finished ] [ target/debs/bookworm/libsairedis-dev_1.0.0_amd64.deb ]
[ building ] [ target/debs/bookworm/libsaimetadata_1.0.0_amd64.deb ]
[ finished ] [ target/debs/bookworm/libsaimetadata_1.0.0_amd64.deb ]
[ building ] [ target/debs/bookworm/libsaivs_1.0.0_amd64.deb ]
[ finished ] [ target/debs/bookworm/libsaivs_1.0.0_amd64.deb ]
[ building ] [ target/debs/bookworm/libsairedis_1.0.0_amd64.deb-install ]
[ finished ] [ target/debs/bookworm/libsairedis_1.0.0_amd64.deb-install ]
[ building ] [ target/docker-sonic-telemetry.gz ]
[ finished ] [ target/docker-dhcp-relay.gz ]
[ building ] [ target/docker-syncd-vs.gz ]
[ finished ] [ target/docker-snmp.gz ]
[ building ] [ target/docker-gbsyncd-vs.gz ]
[ finished ] [ target/docker-sonic-bmp.gz ]
[ building ] [ target/debs/bookworm/libsaimetadata-dev_1.0.0_amd64.deb ]
[ finished ] [ target/debs/bookworm/libsaimetadata-dev_1.0.0_amd64.deb ]
[ building ] [ target/debs/bookworm/libsaivs-dev_1.0.0_amd64.deb ]
[ finished ] [ target/debs/bookworm/libsaivs-dev_1.0.0_amd64.deb ]
[ building ] [ target/debs/bookworm/libsairedis-dev_1.0.0_amd64.deb-install ]
[ finished ] [ target/debs/bookworm/libsairedis-dev_1.0.0_amd64.deb-install ]
[ building ] [ target/debs/bookworm/libsaimetadata_1.0.0_amd64.deb-install ]
[ finished ] [ target/debs/bookworm/libsaimetadata_1.0.0_amd64.deb-install ]
[ building ] [ target/debs/bookworm/libsaivs_1.0.0_amd64.deb-install ]
[ finished ] [ target/debs/bookworm/libsaivs_1.0.0_amd64.deb-install ]
[ building ] [ target/debs/bookworm/libsaimetadata-dev_1.0.0_amd64.deb-install ]
[ finished ] [ target/debs/bookworm/libsaimetadata-dev_1.0.0_amd64.deb-install ]
[ building ] [ target/debs/bookworm/libsaivs-dev_1.0.0_amd64.deb-install ]
[ finished ] [ target/debs/bookworm/libsaivs-dev_1.0.0_amd64.deb-install ]
[ building ] [ target/debs/bookworm/swss_1.0.0_amd64.deb ]
[ finished ] [ target/docker-sonic-telemetry.gz ]
[ finished ] [ target/docker-gbsyncd-vs.gz ]
[ finished ] [ target/docker-syncd-vs.gz ]
[ finished ] [ target/debs/bookworm/swss_1.0.0_amd64.deb ]
[ building ] [ target/docker-swss-layer-bookworm.gz ]
[ building ] [ target/docker-stp.gz ]
[ finished ] [ target/docker-swss-layer-bookworm.gz ]
[ building ] [ target/docker-swss-layer-bookworm.gz-load ]
[ finished ] [ target/docker-swss-layer-bookworm.gz-load ]
[ building ] [ target/docker-dash-ha.gz ]
[ building ] [ target/docker-fpm-frr.gz ]
[ building ] [ target/docker-nat.gz ]
[ finished ] [ target/docker-stp.gz ]
[ building ] [ target/docker-orchagent.gz ]
[ finished ] [ target/docker-dash-ha.gz ]
[ building ] [ target/docker-sflow.gz ]
[ finished ] [ target/docker-nat.gz ]
[ building ] [ target/docker-teamd.gz ]
[ finished ] [ target/docker-fpm-frr.gz ]
[ building ] [ target/docker-macsec.gz ]
/sonic/dockers/docker-macsec/cli-plugin-tests /sonic
/sonic
[ finished ] [ target/docker-sflow.gz ]
[ building ] [ target/docker-sonic-vs.gz ]
[ finished ] [ target/docker-teamd.gz ]
[ finished ] [ target/docker-orchagent.gz ]
[ finished ] [ target/docker-macsec.gz ]
basename: missing operand
Try 'basename --help' for more information.
basename: missing operand
Try 'basename --help' for more information.
[ building ] [ target/sonic-vs.bin ]
[ building ] [ target/sonic-vs.img.gz ]
[ finished ] [ target/sonic-vs.img.gz ]
[ FAIL LOG START ] [ target/sonic-vs.img.gz ]
Build start time: Sat Sep 26 16:28:44 UTC 2026
++ '[' -f .arch ']'
++ cat .arch
+ CONFIGURED_ARCH=amd64
+ DOCKER_VERSION=5:24.0.2-1~debian.12~bookworm
+ CONTAINERD_IO_VERSION=1.6.21-1
+ LINUX_KERNEL_VERSION=6.1.0-29-2
+ FILESYSTEM_ROOT=./fsroot
+ PLATFORM_DIR=platform
+ HOSTNAME=sonic
+ DEFAULT_USERINFO='Default admin user,,,'
+ BUILD_TOOL_PATH=src/sonic-build-hooks/buildinfo
+ TRUSTED_GPG_DIR=src/sonic-build-hooks/buildinfo/trusted.gpg.d
+ . ./onie-image.conf
++ : 32768
++ : x86_64
++ : vs
++ ONIEIMAGE_VERSION=r0
++ FILESYSTEM_ROOT=./fsroot-vs
++ FILESYSTEM_SQUASHFS=fs.squashfs
++ INSTALLER_PAYLOAD=fs.zip
++ FILESYSTEM_DOCKERFS=dockerfs.tar.gz
++ DOCKERFS_DIR=docker
++ DOCKER_RAMFS_SIZE=3500M
++ OUTPUT_ONIE_IMAGE=target/sonic-vs.bin
++ OUTPUT_RAW_IMAGE=target/sonic-vs.raw
++ RAW_IMAGE_DISK_SIZE=1700
++ OUTPUT_KVM_IMAGE=target/sonic-vs.img
++ KVM_IMAGE_DISK_SIZE=16
++ OUTPUT_ABOOT_IMAGE=target/sonic-aboot-vs.swi
++ ABOOT_BOOT_IMAGE=.sonic-boot.swi
++ OUTPUT_KVM_4ASIC_IMAGE=target/sonic-4asic-vs.img
++ OUTPUT_KVM_6ASIC_IMAGE=target/sonic-6asic-vs.img
++ OUTPUT_DSC_IMAGE=target/sonic-vs.tar
+ '[' -n 32768 ']'
+ '[' -n fs.zip ']'
+ '[' -n fs.squashfs ']'
+ '[' kvm = aboot ']'
+ [[ y != y ]]
+ [[ n == y ]]
+ [[ y == y ]]
+ echo '[INFO] RFS build: second stage'
[INFO] RFS build: second stage
+ sudo mount proc /proc -t proc
+ sudo fuser -vm ./fsroot-vs
USER PID ACCESS COMMAND
/sonic/fsroot-vs: root kernel mount /usr/sbin/docker-init
jenkins 1 ..ce. docker-init
jenkins 7 ..c.. bash
jenkins 8 ..c.. make
root 6235 ....m dockerd
root 6320 ....m containerd
jenkins 497680 ..c.. bash
jenkins 498232 ..c.. docker
jenkins 498233 ..c.. process_log.sh
jenkins 506108 ..c.. bash
jenkins 506373 ..c.. bash
jenkins 507107 ..c.. build_debian.sh
jenkins 507108 ..c.. process_log.sh
root 507243 ..c.. sudo
root 507247 F.c.. unsquashfs
jenkins 507477 ..c.. build_debian.sh
jenkins 507478 ..c.. process_log.sh
root 507486 ..c.. sudo
+ sudo rm -rf ./fsroot-vs
rm: cannot remove './fsroot-vs/usr/lib': Directory not empty
[ FAIL LOG END ] [ target/sonic-vs.img.gz ]
make: *** [slave.mk:1435: target/sonic-vs.img.gz] Error 1
make: *** Waiting for unfinished jobs....
[ finished ] [ target/sonic-vs.bin ]
[ FAIL LOG START ] [ target/sonic-vs.bin ]
Build start time: Sat Sep 26 16:28:44 UTC 2026
++ '[' -f .arch ']'
++ cat .arch
+ CONFIGURED_ARCH=amd64
+ DOCKER_VERSION=5:24.0.2-1~debian.12~bookworm
+ CONTAINERD_IO_VERSION=1.6.21-1
+ LINUX_KERNEL_VERSION=6.1.0-29-2
+ FILESYSTEM_ROOT=./fsroot
+ PLATFORM_DIR=platform
+ HOSTNAME=sonic
+ DEFAULT_USERINFO='Default admin user,,,'
+ BUILD_TOOL_PATH=src/sonic-build-hooks/buildinfo
+ TRUSTED_GPG_DIR=src/sonic-build-hooks/buildinfo/trusted.gpg.d
+ . ./onie-image.conf
++ : 32768
++ : x86_64
++ : vs
++ ONIEIMAGE_VERSION=r0
++ FILESYSTEM_ROOT=./fsroot-vs
++ FILESYSTEM_SQUASHFS=fs.squashfs
++ INSTALLER_PAYLOAD=fs.zip
++ FILESYSTEM_DOCKERFS=dockerfs.tar.gz
++ DOCKERFS_DIR=docker
++ DOCKER_RAMFS_SIZE=3500M
++ OUTPUT_ONIE_IMAGE=target/sonic-vs.bin
++ OUTPUT_RAW_IMAGE=target/sonic-vs.raw
++ RAW_IMAGE_DISK_SIZE=1700
++ OUTPUT_KVM_IMAGE=target/sonic-vs.img
++ KVM_IMAGE_DISK_SIZE=16
++ OUTPUT_ABOOT_IMAGE=target/sonic-aboot-vs.swi
++ ABOOT_BOOT_IMAGE=.sonic-boot.swi
++ OUTPUT_KVM_4ASIC_IMAGE=target/sonic-4asic-vs.img
++ OUTPUT_KVM_6ASIC_IMAGE=target/sonic-6asic-vs.img
++ OUTPUT_DSC_IMAGE=target/sonic-vs.tar
+ '[' -n 32768 ']'
+ '[' -n fs.zip ']'
+ '[' -n fs.squashfs ']'
+ '[' onie = aboot ']'
+ [[ y != y ]]
+ [[ n == y ]]
+ [[ y == y ]]
+ echo '[INFO] RFS build: second stage'
[INFO] RFS build: second stage
+ sudo mount proc /proc -t proc
+ sudo fuser -vm ./fsroot-vs
USER PID ACCESS COMMAND
/sonic/fsroot-vs: root kernel mount /usr/sbin/docker-init
jenkins 1 ..ce. docker-init
jenkins 7 ..c.. bash
jenkins 8 ..c.. make
root 6235 ....m dockerd
root 6320 ....m containerd
jenkins 497680 ..c.. bash
jenkins 498232 ..c.. docker
jenkins 498233 ..c.. process_log.sh
jenkins 506108 ..c.. bash
jenkins 506373 ..c.. bash
jenkins 507106 ..c.. j2
jenkins 507107 ..c.. build_debian.sh
jenkins 507108 ..c.. process_log.sh
root 507116 ..c.. sudo
+ sudo rm -rf ./fsroot-vs
+ sudo unsquashfs -d ./fsroot-vs target/sonic-vs.bin__vs__rfs.squashfs
Parallel unsquashfs: Using 112 processors
33651 inodes (34124 blocks) to write
[======| ] 7260/67775 10%
[==========- ] 11983/67775 17%
[==============\ ] 16599/67775 24%
[==================| ] 21078/67775 31%
set_attributes: failed to set time on ./fsroot-vs/usr/lib/perf-core/dlfilters/dlfilter-show-cycles.so, because No such file or directory
set_attributes: failed to set time on ./fsroot-vs/usr/lib/perf-core/dlfilters/dlfilter-test-api-v0.so, because No such file or directory
set_attributes: failed to set time on ./fsroot-vs/usr/lib/perf-core/dlfilters, because No such file or directory
set_attributes: failed to set time on ./fsroot-vs/usr/lib/perf-core/perf-archive, because No such file or directory
set_attributes: failed to set time on ./fsroot-vs/usr/lib/perf-core/perf-iostat, because No such file or directory
set_attributes: failed to set time on ./fsroot-vs/usr/lib/perf-core/perf-read-vdso32, because No such file or directory
set_attributes: failed to set time on ./fsroot-vs/usr/lib/perf-core/perf-read-vdsox32, because No such file or directory
set_attributes: failed to set time on ./fsroot-vs/usr/lib/perf-core/scripts/perl/Perf-Trace-Util/lib/Perf/Trace/Context.pm, because No such file or directory
set_attributes: failed to set time on ./fsroot-vs/usr/lib/perf-core/scripts/perl/Perf-Trace-Util/lib/Perf/Trace/Core.pm, because No such file or directory
set_attributes: failed to set time on ./fsroot-vs/usr/lib/perf-core/scripts/perl/Perf-Trace-Util/lib/Perf/Trace/Util.pm, because No such file or directory
set_attributes: failed to set time on ./fsroot-vs/usr/lib/perf-core/scripts/perl/Perf-Trace-Util/lib/Perf/Trace, because No such file or directory
set_attributes: failed to set time on ./fsroot-vs/usr/lib/perf-core/scripts/perl/Perf-Trace-Util/lib/Perf, because No such file or directory
set_attributes: failed to set time on ./fsroot-vs/usr/lib/perf-core/scripts/perl/Perf-Trace-Util/lib, because No such file or directory
set_attributes: failed to set time on ./fsroot-vs/usr/lib/perf-core/scripts/perl/Perf-Trace-Util, because No such file or directory
set_attributes: failed to set time on ./fsroot-vs/usr/lib/perf-core/scripts/perl/bin/check-perf-trace-record, because No such file or directory
set_attributes: failed to set time on ./fsroot-vs/usr/lib/perf-core/scripts/perl/bin/failed-syscalls-record, because No such file or directory
set_attributes: failed to set time on ./fsroot-vs/usr/lib/perf-core/scripts/perl/bin/failed-syscalls-report, because No such file or directory
set_attributes: failed to set time on ./fsroot-vs/usr/lib/perf-core/scripts/perl/bin/rw-by-file-record, because No such file or directory
set_attributes: failed to set time on ./fsroot-vs/usr/lib/perf-core/scripts/perl/bin/rw-by-file-report, because No such file or directory
set_attributes: failed to set time on ./fsroot-vs/usr/lib/perf-core/scripts/perl/bin/rw-by-pid-record, because No such file or directory
set_attributes: failed to set time on ./fsroot-vs/usr/lib/perf-core/scripts/perl/bin/rw-by-pid-report, because No such file or directory
set_attributes: failed to set time on ./fsroot-vs/usr/lib/perf-core/scripts/perl/bin/rwtop-record, because No such file or directory
set_attributes: failed to set time on ./fsroot-vs/usr/lib/perf-core/scripts/perl/bin/rwtop-report, because No such file or directory
set_attributes: failed to set time on ./fsroot-vs/usr/lib/perf-core/scripts/perl/bin/wakeup-latency-record, because No such file or directory
set_attributes: failed to set time on ./fsroot-vs/usr/lib/perf-core/scripts/perl/bin/wakeup-latency-report, because No such file or directory
set_attributes: failed to set time on ./fsroot-vs/usr/lib/perf-core/scripts/perl/bin, because No such file or directory
set_attributes: failed to set time on ./fsroot-vs/usr/lib/perf-core/scripts/perl/check-perf-trace.pl, because No such file or directory
set_attributes: failed to set time on ./fsroot-vs/usr/lib/perf-core/scripts/perl/failed-syscalls.pl, because No such file or directory
set_attributes: failed to set time on ./fsroot-vs/usr/lib/perf-core/scripts/perl/rw-by-file.pl, because No such file or directory
set_attributes: failed to set time on ./fsroot-vs/usr/lib/perf-core/scripts/perl/rw-by-pid.pl, because No such file or directory
set_attributes: failed to set time on ./fsroot-vs/usr/lib/perf-core/scripts/perl/rwtop.pl, because No such file or directory
set_attributes: failed to set time on ./fsroot-vs/usr/lib/perf-core/scripts/perl/wakeup-latency.pl, because No such file or directory
set_attributes: failed to set time on ./fsroot-vs/usr/lib/perf-core/scripts/perl, because No such file or directory
set_attributes: failed to set time on ./fsroot-vs/usr/lib/perf-core/scripts/python/Perf-Trace-Util/lib/Perf/Trace/Core.py, because No such file or directory
set_attributes: failed to set time on ./fsroot-vs/usr/lib/perf-core/scripts/python/Perf-Trace-Util/lib/Perf/Trace/EventClass.py, because No such file or directory
set_attributes: failed to set time on ./fsroot-vs/usr/lib/perf-core/scripts/python/Perf-Trace-Util/lib/Perf/Trace/SchedGui.py, because No such file or directory
set_attributes: failed to set time on ./fsroot-vs/usr/lib/perf-core/scripts/python/Perf-Trace-Util/lib/Perf/Trace/Util.py, because No such file or directory
set_attributes: failed to set time on ./fsroot-vs/usr/lib/perf-core/scripts/python/Perf-Trace-Util/lib/Perf/Trace/__pycache__/Core.cpython-311.pyc, because No such file or directory
set_attributes: failed to set time on ./fsroot-vs/usr/lib/perf-core/scripts/python/Perf-Trace-Util/lib/Perf/Trace/__pycache__/EventClass.cpython-311.pyc, because No such file or directory
set_attributes: failed to set time on ./fsroot-vs/usr/lib/perf-core/scripts/python/Perf-Trace-Util/lib/Perf/Trace/__pycache__/SchedGui.cpython-311.pyc, because No such file or directory
set_attributes: failed to set time on ./fsroot-vs/usr/lib/perf-core/scripts/python/Perf-Trace-Util/lib/Perf/Trace/__pycache__/Util.cpython-311.pyc, because No such file or directory
set_attributes: failed to set time on ./fsroot-vs/usr/lib/perf-core/scripts/python/Perf-Trace-Util/lib/Perf/Trace/__pycache__, because No such file or directory
set_attributes: failed to set time on ./fsroot-vs/usr/lib/perf-core/scripts/python/Perf-Trace-Util/lib/Perf/Trace, because No such file or directory
set_attributes: failed to set time on ./fsroot-vs/usr/lib/perf-core/scripts/python/Perf-Trace-Util/lib/Perf, because No such file or directory
set_attributes: failed to set time on ./fsroot-vs/usr/lib/perf-core/scripts/python/Perf-Trace-Util/lib, because No such file or directory
set_attributes: failed to set time on ./fsroot-vs/usr/lib/perf-core/scripts/python/Perf-Trace-Util, because No such file or directory
set_attributes: failed to set time on ./fsroot-vs/usr/lib/perf-core/scripts/python/arm-cs-trace-disasm.py, because No such file or directory
set_attributes: failed to set time on ./fsroot-vs/usr/lib/perf-core/scripts/python/bin/compaction-times-record, because No such file or directory
set_attributes: failed to set time on ./fsroot-vs/usr/lib/perf-core/scripts/python/bin/compaction-times-report, because No such file or directory
set_attributes: failed to set time on ./fsroot-vs/usr/lib/perf-core/scripts/python/bin/event_analyzing_sample-record, because No such file or directory
set_attributes: failed to set time on ./fsroot-vs/usr/lib/perf-core/scripts/python/bin/event_analyzing_sample-report, because No such file or directory
set_attributes: failed to set time on ./fsroot-vs/usr/lib/perf-core/scripts/python/bin/export-to-postgresql-record, because No such file or directory
set_attributes: failed to set time on ./fsroot-vs/usr/lib/perf-core/scripts/python/bin/export-to-postgresql-report, because No such file or directory
set_attributes: failed to set time on ./fsroot-vs/usr/lib/perf-core/scripts/python/bin/export-to-sqlite-record, because No such file or directory
set_attributes: failed to set time on ./fsroot-vs/usr/lib/perf-core/scripts/python/bin/export-to-sqlite-report, because No such file or directory
set_attributes: failed to set time on ./fsroot-vs/usr/lib/perf-core/scripts/python/bin/failed-syscalls-by-pid-record, because No such file or directory
set_attributes: failed to set time on ./fsroot-vs/usr/lib/perf-core/scripts/python/bin/failed-syscalls-by-pid-report, because No such file or directory
set_attributes: failed to set time on ./fsroot-vs/usr/lib/perf-core/scripts/python/bin/flamegraph-record, because No such file or directory
set_attributes: failed to set time on ./fsroot-vs/usr/lib/perf-core/scripts/python/bin/flamegraph-report, because No such file or directory
set_attributes: failed to set time on ./fsroot-vs/usr/lib/perf-core/scripts/python/bin/futex-contention-record, because No such file or directory
set_attributes: failed to set time on ./fsroot-vs/usr/lib/perf-core/scripts/python/bin/futex-contention-report, because No such file or directory
set_attributes: failed to set time on ./fsroot-vs/usr/lib/perf-core/scripts/python/bin/intel-pt-events-record, because No such file or directory
set_attributes: failed to set time on ./fsroot-vs/usr/lib/perf-core/scripts/python/bin/intel-pt-events-report, because No such file or directory
set_attributes: failed to set time on ./fsroot-vs/usr/lib/perf-core/scripts/python/bin/mem-phys-addr-record, because No such file or directory
set_attributes: failed to set time on ./fsroot-vs/usr/lib/perf-core/scripts/python/bin/mem-phys-addr-report, because No such file or directory
set_attributes: failed to set time on ./fsroot-vs/usr/lib/perf-core/scripts/python/bin/net_dropmonitor-record, because No such file or directory
set_attributes: failed to set time on ./fsroot-vs/usr/lib/perf-core/scripts/python/bin/net_dropmonitor-report, because No such file or directory
set_attributes: failed to set time on ./fsroot-vs/usr/lib/perf-core/scripts/python/bin/netdev-times-record, because No such file or directory
set_attributes: failed to set time on ./fsroot-vs/usr/lib/perf-core/scripts/python/bin/netdev-times-report, because No such file or directory
set_attributes: failed to set time on ./fsroot-vs/usr/lib/perf-core/scripts/python/bin/powerpc-hcalls-record, because No such file or directory
set_attributes: failed to set time on ./fsroot-vs/usr/lib/perf-core/scripts/python/bin/powerpc-hcalls-report, because No such file or directory
set_attributes: failed to set time on ./fsroot-vs/usr/lib/perf-core/scripts/python/bin/sched-migration-record, because No such file or directory
set_attributes: failed to set time on ./fsroot-vs/usr/lib/perf-core/scripts/python/bin/sched-migration-report, because No such file or directory
set_attributes: failed to set time on ./fsroot-vs/usr/lib/perf-core/scripts/python/bin/sctop-record, because No such file or directory
set_attributes: failed to set time on ./fsroot-vs/usr/lib/perf-core/scripts/python/bin/sctop-report, because No such file or directory
set_attributes: failed to set time on ./fsroot-vs/usr/lib/perf-core/scripts/python/bin/stackcollapse-record, because No such file or directory
set_attributes: failed to set time on ./fsroot-vs/usr/lib/perf-core/scripts/python/bin/stackcollapse-report, because No such file or directory
set_attributes: failed to set time on ./fsroot-vs/usr/lib/perf-core/scripts/python/bin/syscall-counts-by-pid-record, because No such file or directory
set_attributes: failed to set time on ./fsroot-vs/usr/lib/perf-core/scripts/python/bin/syscall-counts-by-pid-report, because No such file or directory
set_attributes: failed to set time on ./fsroot-vs/usr/lib/perf-core/scripts/python/bin/syscall-counts-record, because No such file or directory
set_attributes: failed to set time on ./fsroot-vs/usr/lib/perf-core/scripts/python/bin/syscall-counts-report, because No such file or directory
set_attributes: failed to set time on ./fsroot-vs/usr/lib/perf-core/scripts/python/bin, because No such file or directory
set_attributes: failed to set time on ./fsroot-vs/usr/lib/perf-core/scripts/python/check-perf-trace.py, because No such file or directory
set_attributes: failed to set time on ./fsroot-vs/usr/lib/perf-core/scripts/python/compaction-times.py, because No such file or directory
set_attributes: failed to set time on ./fsroot-vs/usr/lib/perf-core/scripts/python/event_analyzing_sample.py, because No such file or directory
set_attributes: failed to set time on ./fsroot-vs/usr/lib/perf-core/scripts/python/export-to-postgresql.py, because No such file or directory
set_attributes: failed to set time on ./fsroot-vs/usr/lib/perf-core/scripts/python/export-to-sqlite.py, because No such file or directory
set_attributes: failed to set time on ./fsroot-vs/usr/lib/perf-core/scripts/python/exported-sql-viewer.py, because No such file or directory
set_attributes: failed to set time on ./fsroot-vs/usr/lib/perf-core/scripts/python/failed-syscalls-by-pid.py, because No such file or directory
set_attributes: failed to set time on ./fsroot-vs/usr/lib/perf-core/scripts/python/flamegraph.py, because No such file or directory
set_attributes: failed to set time on ./fsroot-vs/usr/lib/perf-core/scripts/python/futex-contention.py, because No such file or directory
set_attributes: failed to set time on ./fsroot-vs/usr/lib/perf-core/scripts/python/intel-pt-events.py, because No such file or directory
set_attributes: failed to set time on ./fsroot-vs/usr/lib/perf-core/scripts/python/libxed.py, because No such file or directory
set_attributes: failed to set time on ./fsroot-vs/usr/lib/perf-core/scripts/python/mem-phys-addr.py, because No such file or directory
set_attributes: failed to set time on ./fsroot-vs/usr/lib/perf-core/scripts/python/net_dropmonitor.py, because No such file or directory
set_attributes: failed to set time on ./fsroot-vs/usr/lib/perf-core/scripts/python/netdev-times.py, because No such file or directory
set_attributes: failed to set time on ./fsroot-vs/usr/lib/perf-core/scripts/python/powerpc-hcalls.py, because No such file or directory
set_attributes: failed to set time on ./fsroot-vs/usr/lib/perf-core/scripts/python/sched-migration.py, because No such file or directory
set_attributes: failed to set time on ./fsroot-vs/usr/lib/perf-core/scripts/python/sctop.py, because No such file or directory
set_attributes: failed to set time on ./fsroot-vs/usr/lib/perf-core/scripts/python/stackcollapse.py, because No such file or directory
set_attributes: failed to set time on ./fsroot-vs/usr/lib/perf-core/scripts/python/stat-cpi.py, because No such file or directory
set_attributes: failed to set time on ./fsroot-vs/usr/lib/perf-core/scripts/python/syscall-counts-by-pid.py, because No such file or directory
set_attributes: failed to set time on ./fsroot-vs/usr/lib/perf-core/scripts/python/syscall-counts.py, because No such file or directory
set_attributes: failed to set time on ./fsroot-vs/usr/lib/perf-core/scripts/python, because No such file or directory
set_attributes: failed to set time on ./fsroot-vs/usr/lib/perf-core/scripts, because No such file or directory
set_attributes: failed to set time on ./fsroot-vs/usr/lib/perf-core/tests/attr/README, because No such file or directory
set_attributes: failed to set time on ./fsroot-vs/usr/lib/perf-core/tests/attr/base-record, because No such file or directory
set_attributes: failed to set time on ./fsroot-vs/usr/lib/perf-core/tests/attr/base-record-spe, because No such file or directory
set_attributes: failed to set time on ./fsroot-vs/usr/lib/perf-core/tests/attr/base-stat, because No such file or directory
set_attributes: failed to set time on ./fsroot-vs/usr/lib/perf-core/tests/attr/system-wide-dummy, because No such file or directory
set_attributes: failed to set time on ./fsroot-vs/usr/lib/perf-core/tests/attr/test-record-C0, because No such file or directory
set_attributes: failed to set time on ./fsroot-vs/usr/lib/perf-core/tests/attr/test-record-basic, because No such file or directory
set_attributes: failed to set time on ./fsroot-vs/usr/lib/perf-core/tests/attr/test-record-branch-any, because No such file or directory
set_attributes: failed to set time on ./fsroot-vs/usr/lib/perf-core/tests/attr/test-record-branch-filter-any, because No such file or directory
set_attributes: failed to set time on ./fsroot-vs/usr/lib/perf-core/tests/attr/test-record-branch-filter-any_call, because No such file or directory
set_attributes: failed to set time on ./fsroot-vs/usr/lib/perf-core/tests/attr/test-record-branch-filter-any_ret, because No such file or directory
set_attributes: failed to set time on ./fsroot-vs/usr/lib/perf-core/tests/attr/test-record-branch-filter-hv, because No such file or directory
set_attributes: failed to set time on ./fsroot-vs/usr/lib/perf-core/tests/attr/test-record-branch-filter-ind_call, because No such file or directory
set_attributes: failed to set time on ./fsroot-vs/usr/lib/perf-core/tests/attr/test-record-branch-filter-k, because No such file or directory
set_attributes: failed to set time on ./fsroot-vs/usr/lib/perf-core/tests/attr/test-record-branch-filter-u, because No such file or directory
set_attributes: failed to set time on ./fsroot-vs/usr/lib/perf-core/tests/attr/test-record-count, because No such file or directory
set_attributes: failed to set time on ./fsroot-vs/usr/lib/perf-core/tests/attr/test-record-data, because No such file or directory
set_attributes: failed to set time on ./fsroot-vs/usr/lib/perf-core/tests/attr/test-record-freq, because No such file or directory
set_attributes: failed to set time on ./fsroot-vs/usr/lib/perf-core/tests/attr/test-record-graph-default, because No such file or directory
set_attributes: failed to set time on ./fsroot-vs/usr/lib/perf-core/tests/attr/test-record-graph-default-aarch64, because No such file or directory
set_attributes: failed to set time on ./fsroot-vs/usr/lib/perf-core/tests/attr/test-record-graph-dwarf, because No such file or directory
set_attributes: failed to set time on ./fsroot-vs/usr/lib/perf-core/tests/attr/test-record-graph-fp, because No such file or directory
set_attributes: failed to set time on ./fsroot-vs/usr/lib/perf-core/tests/attr/test-record-graph-fp-aarch64, because No such file or directory
set_attributes: failed to set time on ./fsroot-vs/usr/lib/perf-core/tests/attr/test-record-group, because No such file or directory
set_attributes: failed to set time on ./fsroot-vs/usr/lib/perf-core/tests/attr/test-record-group-sampling, because No such file or directory
set_attributes: failed to set time on ./fsroot-vs/usr/lib/perf-core/tests/attr/test-record-group1, because No such file or directory
set_attributes: failed to set time on ./fsroot-vs/usr/lib/perf-core/tests/attr/test-record-group2, because No such file or directory
set_attributes: failed to set time on ./fsroot-vs/usr/lib/perf-core/tests/attr/test-record-no-buffering, because No such file or directory
set_attributes: failed to set time on ./fsroot-vs/usr/lib/perf-core/tests/attr/test-record-no-inherit, because No such file or directory
set_attributes: failed to set time on ./fsroot-vs/usr/lib/perf-core/tests/attr/test-record-no-samples, because No such file or directory
set_attributes: failed to set time on ./fsroot-vs/usr/lib/perf-core/tests/attr/test-record-period, because No such file or directory
set_attributes: failed to set time on ./fsroot-vs/usr/lib/perf-core/tests/attr/test-record-pfm-period, because No such file or directory
set_attributes: failed to set time on ./fsroot-vs/usr/lib/perf-core/tests/attr/test-record-raw, because No such file or directory
set_attributes: failed to set time on ./fsroot-vs/usr/lib/perf-core/tests/attr/test-record-spe-period, because No such file or directory
set_attributes: failed to set time on ./fsroot-vs/usr/lib/perf-core/tests/attr/test-record-spe-period-term, because No such file or directory
set_attributes: failed to set time on ./fsroot-vs/usr/lib/perf-core/tests/attr/test-record-spe-physical-address, because No such file or directory
set_attributes: failed to set time on ./fsroot-vs/usr/lib/perf-core/tests/attr/test-stat-C0, because No such file or directory
set_attributes: failed to set time on ./fsroot-vs/usr/lib/perf-core/tests/attr/test-stat-basic, because No such file or directory
set_attributes: failed to set time on ./fsroot-vs/usr/lib/perf-core/tests/attr/test-stat-default, because No such file or directory
set_attributes: failed to set time on ./fsroot-vs/usr/lib/perf-core/tests/attr/test-stat-detailed-1, because No such file or directory
set_attributes: failed to set time on ./fsroot-vs/usr/lib/perf-core/tests/attr/test-stat-detailed-2, because No such file or directory
set_attributes: failed to set time on ./fsroot-vs/usr/lib/perf-core/tests/attr/test-stat-detailed-3, because No such file or directory
set_attributes: failed to set time on ./fsroot-vs/usr/lib/perf-core/tests/attr/test-stat-group, because No such file or directory
set_attributes: failed to set time on ./fsroot-vs/usr/lib/perf-core/tests/attr/test-stat-group1, because No such file or directory
set_attributes: failed to set time on ./fsroot-vs/usr/lib/perf-core/tests/attr/test-stat-no-inherit, because No such file or directory
set_attributes: failed to set time on ./fsroot-vs/usr/lib/perf-core/tests/attr, because No such file or directory
set_attributes: failed to set time on ./fsroot-vs/usr/lib/perf-core/tests/attr.py, because No such file or directory
set_attributes: failed to set time on ./fsroot-vs/usr/lib/perf-core/tests/pe-file.exe, because No such file or directory
set_attributes: failed to set time on ./fsroot-vs/usr/lib/perf-core/tests/pe-file.exe.debug, because No such file or directory
set_attributes: failed to set time on ./fsroot-vs/usr/lib/perf-core/tests/shell/buildid.sh, because No such file or directory
set_attributes: failed to set time on ./fsroot-vs/usr/lib/perf-core/tests/shell/coresight/asm_pure_loop.sh, because No such file or directory
set_attributes: failed to set time on ./fsroot-vs/usr/lib/perf-core/tests/shell/coresight/memcpy_thread_16k_10.sh, because No such file or directory
set_attributes: failed to set time on ./fsroot-vs/usr/lib/perf-core/tests/shell/coresight/thread_loop_check_tid_10.sh, because No such file or directory
set_attributes: failed to set time on ./fsroot-vs/usr/lib/perf-core/tests/shell/coresight/thread_loop_check_tid_2.sh, because No such file or directory
set_attributes: failed to set time on ./fsroot-vs/usr/lib/perf-core/tests/shell/coresight/unroll_loop_thread_10.sh, because No such file or directory
set_attributes: failed to set time on ./fsroot-vs/usr/lib/perf-core/tests/shell/coresight, because No such file or directory
set_attributes: failed to set time on ./fsroot-vs/usr/lib/perf-core/tests/shell/daemon.sh, because No such file or directory
set_attributes: failed to set time on ./fsroot-vs/usr/lib/perf-core/tests/shell/lib/coresight.sh, because No such file or directory
set_attributes: failed to set time on ./fsroot-vs/usr/lib/perf-core/tests/shell/lib/perf_json_output_lint.py, because No such file or directory
set_attributes: failed to set time on ./fsroot-vs/usr/lib/perf-core/tests/shell/lib/probe.sh, because No such file or directory
set_attributes: failed to set time on ./fsroot-vs/usr/lib/perf-core/tests/shell/lib/probe_vfs_getname.sh, because No such file or directory
set_attributes: failed to set time on ./fsroot-vs/usr/lib/perf-core/tests/shell/lib/waiting.sh, because No such file or directory
set_attributes: failed to set time on ./fsroot-vs/usr/lib/perf-core/tests/shell/lib, because No such file or directory
set_attributes: failed to set time on ./fsroot-vs/usr/lib/perf-core/tests/shell/lock_contention.sh, because No such file or directory
set_attributes: failed to set time on ./fsroot-vs/usr/lib/perf-core/tests/shell/pipe_test.sh, because No such file or directory
set_attributes: failed to set time on ./fsroot-vs/usr/lib/perf-core/tests/shell/probe_vfs_getname.sh, because No such file or directory
set_attributes: failed to set time on ./fsroot-vs/usr/lib/perf-core/tests/shell/record+probe_libc_inet_pton.sh, because No such file or directory
set_attributes: failed to set time on ./fsroot-vs/usr/lib/perf-core/tests/shell/record+script_probe_vfs_getname.sh, because No such file or directory
set_attributes: failed to set time on ./fsroot-vs/usr/lib/perf-core/tests/shell/record+zstd_comp_decomp.sh, because No such file or directory
set_attributes: failed to set time on ./fsroot-vs/usr/lib/perf-core/tests/shell/record.sh, because No such file or directory
set_attributes: failed to set time on ./fsroot-vs/usr/lib/perf-core/tests/shell/record_offcpu.sh, because No such file or directory
set_attributes: failed to set time on ./fsroot-vs/usr/lib/perf-core/tests/shell/stat+csv_output.sh, because No such file or directory
set_attributes: failed to set time on ./fsroot-vs/usr/lib/perf-core/tests/shell/stat+csv_summary.sh, because No such file or directory
set_attributes: failed to set time on ./fsroot-vs/usr/lib/perf-core/tests/shell/stat+json_output.sh, because No such file or directory
set_attributes: failed to set time on ./fsroot-vs/usr/lib/perf-core/tests/shell/stat+shadow_stat.sh, because No such file or directory
set_attributes: failed to set time on ./fsroot-vs/usr/lib/perf-core/tests/shell/stat.sh, because No such file or directory
set_attributes: failed to set time on ./fsroot-vs/usr/lib/perf-core/tests/shell/stat_all_metricgroups.sh, because No such file or directory
set_attributes: failed to set time on ./fsroot-vs/usr/lib/perf-core/tests/shell/stat_all_metrics.sh, because No such file or directory
set_attributes: failed to set time on ./fsroot-vs/usr/lib/perf-core/tests/shell/stat_all_pmu.sh, because No such file or directory
set_attributes: failed to set time on ./fsroot-vs/usr/lib/perf-core/tests/shell/stat_bpf_counters.sh, because No such file or directory
set_attributes: failed to set time on ./fsroot-vs/usr/lib/perf-core/tests/shell/stat_bpf_counters_cgrp.sh, because No such file or directory
set_attributes: failed to set time on ./fsroot-vs/usr/lib/perf-core/tests/shell/test_arm_callgraph_fp.sh, because No such file or directory
set_attributes: failed to set time on ./fsroot-vs/usr/lib/perf-core/tests/shell/test_arm_coresight.sh, because No such file or directory
set_attributes: failed to set time on ./fsroot-vs/usr/lib/perf-core/tests/shell/test_arm_spe.sh, because No such file or directory
set_attributes: failed to set time on ./fsroot-vs/usr/lib/perf-core/tests/shell/test_arm_spe_fork.sh, because No such file or directory
set_attributes: failed to set time on ./fsroot-vs/usr/lib/perf-core/tests/shell/test_brstack.sh, because No such file or directory
set_attributes: failed to set time on ./fsroot-vs/usr/lib/perf-core/tests/shell/test_data_symbol.sh, because No such file or directory
set_attributes: failed to set time on ./fsroot-vs/usr/lib/perf-core/tests/shell/test_intel_pt.sh, because No such file or directory
set_attributes: failed to set time on ./fsroot-vs/usr/lib/perf-core/tests/shell/test_java_symbol.sh, because No such file or directory
set_attributes: failed to set time on ./fsroot-vs/usr/lib/perf-core/tests/shell/test_uprobe_from_different_cu.sh, because No such file or directory
set_attributes: failed to set time on ./fsroot-vs/usr/lib/perf-core/tests/shell/trace+probe_vfs_getname.sh, because No such file or directory
set_attributes: failed to set time on ./fsroot-vs/usr/lib/perf-core/tests/shell, because No such file or directory
set_attributes: failed to set time on ./fsroot-vs/usr/lib/perf-core/tests, because No such file or directory
set_attributes: failed to set time on ./fsroot-vs/usr/lib/perf-core, because No such file or directory
[===========================/ ] 31783/67775 46%
[==============================- ] 34472/67775 50%
[=================================\ ] 38810/67775 57%
[===================================| ] 41143/67775 60%
[===================================================/ ] 58757/67775 86%
[======================================================/ ] 62800/67775 92%
[========================================================- ] 64461/67775 95%
[==========================================================| ] 67678/67775 99%
[===========================================================|] 67775/67775 100%
created 25922 files
created 3484 directories
created 2373 symlinks
created 5351 devices
created 0 fifos
created 0 sockets
created 5 hardlinks
[ FAIL LOG END ] [ target/sonic-vs.bin ]
make: *** [slave.mk:1435: target/sonic-vs.bin] Error 1
[ finished ] [ target/docker-sonic-vs.gz ]
make[1]: *** [Makefile.work:611: all] Error 2
make[1]: Leaving directory '/var/lib/jenkins/workspace/DevOps-test2/platform-vs'
make: *** [Makefile:53: all] Error 2
|