Content

상위 폴더로 이동
+++ --- Applying local submodule patches --- +++
  already applied: sonic-utilities
  already applied: sonic-swss
  already applied: sonic-swss-new
  already applied: sonic-sairedis-vslib
  already applied: sonic-sairedis-meta
  already applied: sonic-sairedis-SAI
  already applied: sonic-sairedis-SAI-apidef
  already applied: sonic-mgmt-framework
+++ --- Making all --- +++
./scripts/run_with_retry make BLDENV=bookworm -f Makefile.work all
make[1]: Entering directory '/var/lib/jenkins/workspace/DevOps-test2/platform-vs'
"SECURE_UPGRADE_PROD_SIGNING_TOOL": ""
~/workspace/DevOps-test2/platform-vs/src/sonic-build-hooks ~/workspace/DevOps-test2/platform-vs
make[2]: Entering directory '/var/lib/jenkins/workspace/DevOps-test2/platform-vs/src/sonic-build-hooks'
dpkg-deb: building package 'sonic-build-hooks' in 'buildinfo/sonic-build-hooks_1.0_all.deb'.
make[2]: Leaving directory '/var/lib/jenkins/workspace/DevOps-test2/platform-vs/src/sonic-build-hooks'
~/workspace/DevOps-test2/platform-vs
Checking sonic-slave-base image: sonic-slave-bookworm:2f250bfbb4a
Checking sonic-slave-user image: sonic-slave-bookworm-jenkins:d05b1641d68
SONiC Build System

Build Configuration
"CONFIGURED_PLATFORM"             : "vs"
"CONFIGURED_ARCH"                 : "amd64"
"SONIC_CONFIG_PRINT_DEPENDENCIES" : ""
"SONIC_BUILD_JOBS"                : "4"
"SONIC_CONFIG_MAKE_JOBS"          : "112"
"USE_NATIVE_DOCKERD_FOR_BUILD"    : ""
"SONIC_USE_DOCKER_BUILDKIT"       : ""
"USERNAME"                        : "admin"
"PASSWORD"                        : "YourPaSsWoRd"
"CHANGE_DEFAULT_PASSWORD"         : "n"
"SECURE_UPGRADE_MODE"             : "no_sign"
"SECURE_UPGRADE_DEV_SIGNING_KEY"  : ""
"SECURE_UPGRADE_SIGNING_CERT"     : ""
"SECURE_UPGRADE_PROD_SIGNING_TOOL": ""
"SECURE_UPGRADE_PROD_TOOL_ARGS"   : ""
"ONIE_IMAGE_PART_SIZE"            : ""
"SHUTDOWN_BGP_ON_START"           : ""
"ENABLE_PFCWD_ON_START"           : ""
"SONIC_BUFFER_MODEL"              : ""
"INSTALL_DEBUG_TOOLS"             : ""
"ROUTING_STACK"                   : "frr"
"FRR_USER_UID"                    : "300"
"FRR_USER_GID"                    : "300"
"ENABLE_SYNCD_RPC"                : ""
"SAITHRIFT_V2"                    : ""
"ENABLE_ORGANIZATION_EXTENSIONS"  : "y"
"HTTP_PROXY"                      : ""
"HTTPS_PROXY"                     : ""
"NO_PROXY"                        : ""
"ENABLE_ZTP"                      : ""
"INCLUDE_PDE"                     : ""
"SONIC_DEBUGGING_ON"              : ""
"SONIC_PROFILING_ON"              : ""
"KERNEL_PROCURE_METHOD"           : "build"
"BUILD_TIMESTAMP"                 : "20260927.013943"
"BUILD_LOG_TIMESTAMP"             : "none"
"SONIC_IMAGE_VERSION"             : "etri-202505.17-8610ff460"
"BLDENV"                          : "bookworm"
"VS_PREPARE_MEM"                  : "yes"
"INCLUDE_MGMT_FRAMEWORK"          : "y"
"INCLUDE_ICCPD"                   : "n"
"INCLUDE_STP"                     : "y"
"INCLUDE_SYSTEM_TELEMETRY"        : "y"
"INCLUDE_SYSTEM_GNMI"             : "y"
"INCLUDE_SYSTEM_BMP"              : "y"
"INCLUDE_SYSTEM_EVENTD"           : "y"
"ENABLE_HOST_SERVICE_ON_START"    : "y"
"INCLUDE_RESTAPI"                 : "n"
"INCLUDE_SFLOW"                   : "y"
"INCLUDE_NAT"                     : "y"
"INCLUDE_DHCP_RELAY"              : "y"
"INCLUDE_DHCP_SERVER"             : "n"
"INCLUDE_P4RT"                    : "n"
"INCLUDE_VS_DASH_SAI"             : "y"
"INCLUDE_KUBERNETES"              : "n"
"INCLUDE_KUBERNETES_MASTER"       : "n"
"INCLUDE_MACSEC"                  : "y"
"INCLUDE_MUX"                     : "y"
"INCLUDE_TEAMD"                   : "y"
"INCLUDE_DASH_HA"                 : "y"
"INCLUDE_ROUTER_ADVERTISER"       : "y"
"INCLUDE_BOOTCHART                : "y"
"ENABLE_BOOTCHART                 : "n"
"INCLUDE_FIPS"                    : "y"
"ENABLE_TRANSLIB_WRITE"           : ""
"ENABLE_NATIVE_WRITE"             : "y"
"ENABLE_DIALOUT"                  : ""
"ENABLE_AUTO_TECH_SUPPORT"        : "y"
"PDDF_SUPPORT"                    : "y"
"MULTIARCH_QEMU_ENVIRON"          : "n"
"SONIC_VERSION_CONTROL_COMPONENTS": "py2,py3,web,git,docker"
"ENABLE_ASAN"                     : "n"
"DEFAULT_CONTAINER_REGISTRY"      : "publicmirror.azurecr.io/"
"BUILD_MULTIASIC_KVM"             : "n"
"CROSS_BUILD_ENVIRON"             : "n"
"LEGACY_SONIC_MGMT_DOCKER"        : "y"
"INCLUDE_EXTERNAL_PATCHES"        : "n"
"PTF_ENV_PY_VER"                  : "py3"
"ENABLE_MULTIDB"                  : ""

mv: cannot move '/etc/apt/sources.list.d/debian.sources' to '/etc/apt/sources.list.d/debian.sources.back': Permission denied
fatal: not a git repository (or any of the parent directories): .git
"SONIC_DPKG_CACHE_METHOD"         : "none"

basename: missing operand
Try 'basename --help' for more information.
basename: missing operand
Try 'basename --help' for more information.
[ building ] [ target/sonic-vs.bin ] 
[ building ] [ target/sonic-vs.img.gz ] 
[ building ] [ target/files/bookworm/sonic_version.yml ] 
[ finished ] [ target/files/bookworm/sonic_version.yml ] 
[ building ] [ target/docker-swss-layer-bookworm.gz-load ] 
[ finished ] [ target/docker-swss-layer-bookworm.gz-load ] 
[ building ] [ target/docker-sonic-vs.gz ] 
[ finished ] [ target/sonic-vs.img.gz ] 
[ FAIL LOG START ] [ target/sonic-vs.img.gz ]
Build start time: Sat Sep 26 16:40:04 UTC 2026
++ '[' -f .arch ']'
++ cat .arch
+ CONFIGURED_ARCH=amd64
+ DOCKER_VERSION=5:24.0.2-1~debian.12~bookworm
+ CONTAINERD_IO_VERSION=1.6.21-1
+ LINUX_KERNEL_VERSION=6.1.0-29-2
+ FILESYSTEM_ROOT=./fsroot
+ PLATFORM_DIR=platform
+ HOSTNAME=sonic
+ DEFAULT_USERINFO='Default admin user,,,'
+ BUILD_TOOL_PATH=src/sonic-build-hooks/buildinfo
+ TRUSTED_GPG_DIR=src/sonic-build-hooks/buildinfo/trusted.gpg.d
+ . ./onie-image.conf
++ : 32768
++ : x86_64
++ : vs
++ ONIEIMAGE_VERSION=r0
++ FILESYSTEM_ROOT=./fsroot-vs
++ FILESYSTEM_SQUASHFS=fs.squashfs
++ INSTALLER_PAYLOAD=fs.zip
++ FILESYSTEM_DOCKERFS=dockerfs.tar.gz
++ DOCKERFS_DIR=docker
++ DOCKER_RAMFS_SIZE=3500M
++ OUTPUT_ONIE_IMAGE=target/sonic-vs.bin
++ OUTPUT_RAW_IMAGE=target/sonic-vs.raw
++ RAW_IMAGE_DISK_SIZE=1700
++ OUTPUT_KVM_IMAGE=target/sonic-vs.img
++ KVM_IMAGE_DISK_SIZE=16
++ OUTPUT_ABOOT_IMAGE=target/sonic-aboot-vs.swi
++ ABOOT_BOOT_IMAGE=.sonic-boot.swi
++ OUTPUT_KVM_4ASIC_IMAGE=target/sonic-4asic-vs.img
++ OUTPUT_KVM_6ASIC_IMAGE=target/sonic-6asic-vs.img
++ OUTPUT_DSC_IMAGE=target/sonic-vs.tar
+ '[' -n 32768 ']'
+ '[' -n fs.zip ']'
+ '[' -n fs.squashfs ']'
+ '[' kvm = aboot ']'
+ [[ y != y ]]
+ [[ n == y ]]
+ [[ y == y ]]
+ echo '[INFO] RFS build: second stage'
[INFO] RFS build: second stage
+ sudo mount proc /proc -t proc
+ sudo fuser -vm ./fsroot-vs
                     USER        PID ACCESS COMMAND
/sonic/fsroot-vs:    root     kernel mount /usr/sbin/docker-init
                     jenkins       1 ..ce. docker-init
                     jenkins       7 ..c.. bash
                     jenkins       8 ..c.. make
                     jenkins    6229 ..c.. bash
                     jenkins    6494 ..c.. bash
                     root       6683 ....m dockerd
                     root       6767 ....m containerd
                     jenkins    7301 ..c.. bash
                     jenkins    7521 ..c.. docker
                     jenkins    7522 ..c.. process_log.sh
                     jenkins   13022 ..c.. build_debian.sh
                     jenkins   13023 ..c.. process_log.sh
                     root      13036 ..c.. sudo
                     root      13037 F.c.. unsquashfs
                     jenkins   13156 ..c.. build_debian.sh
                     jenkins   13157 ..c.. process_log.sh
                     root      13165 ..c.. sudo
+ sudo rm -rf ./fsroot-vs
rm: cannot remove './fsroot-vs/usr/lib/modules/6.1.0-29-2-amd64/kernel/drivers/net/wireless': Directory not empty
[  FAIL LOG END  ] [ target/sonic-vs.img.gz ]
make: *** [slave.mk:1435: target/sonic-vs.img.gz] Error 1
make: *** Waiting for unfinished jobs....
[ finished ] [ target/sonic-vs.bin ] 
[ FAIL LOG START ] [ target/sonic-vs.bin ]
Build start time: Sat Sep 26 16:40:03 UTC 2026
++ '[' -f .arch ']'
++ cat .arch
+ CONFIGURED_ARCH=amd64
+ DOCKER_VERSION=5:24.0.2-1~debian.12~bookworm
+ CONTAINERD_IO_VERSION=1.6.21-1
+ LINUX_KERNEL_VERSION=6.1.0-29-2
+ FILESYSTEM_ROOT=./fsroot
+ PLATFORM_DIR=platform
+ HOSTNAME=sonic
+ DEFAULT_USERINFO='Default admin user,,,'
+ BUILD_TOOL_PATH=src/sonic-build-hooks/buildinfo
+ TRUSTED_GPG_DIR=src/sonic-build-hooks/buildinfo/trusted.gpg.d
+ . ./onie-image.conf
++ : 32768
++ : x86_64
++ : vs
++ ONIEIMAGE_VERSION=r0
++ FILESYSTEM_ROOT=./fsroot-vs
++ FILESYSTEM_SQUASHFS=fs.squashfs
++ INSTALLER_PAYLOAD=fs.zip
++ FILESYSTEM_DOCKERFS=dockerfs.tar.gz
++ DOCKERFS_DIR=docker
++ DOCKER_RAMFS_SIZE=3500M
++ OUTPUT_ONIE_IMAGE=target/sonic-vs.bin
++ OUTPUT_RAW_IMAGE=target/sonic-vs.raw
++ RAW_IMAGE_DISK_SIZE=1700
++ OUTPUT_KVM_IMAGE=target/sonic-vs.img
++ KVM_IMAGE_DISK_SIZE=16
++ OUTPUT_ABOOT_IMAGE=target/sonic-aboot-vs.swi
++ ABOOT_BOOT_IMAGE=.sonic-boot.swi
++ OUTPUT_KVM_4ASIC_IMAGE=target/sonic-4asic-vs.img
++ OUTPUT_KVM_6ASIC_IMAGE=target/sonic-6asic-vs.img
++ OUTPUT_DSC_IMAGE=target/sonic-vs.tar
+ '[' -n 32768 ']'
+ '[' -n fs.zip ']'
+ '[' -n fs.squashfs ']'
+ '[' onie = aboot ']'
+ [[ y != y ]]
+ [[ n == y ]]
+ [[ y == y ]]
+ echo '[INFO] RFS build: second stage'
[INFO] RFS build: second stage
+ sudo mount proc /proc -t proc
+ sudo fuser -vm ./fsroot-vs
                     USER        PID ACCESS COMMAND
/sonic/fsroot-vs:    root     kernel mount /usr/sbin/docker-init
                     jenkins       1 ..ce. docker-init
                     jenkins       7 ..c.. bash
                     jenkins       8 ..c.. make
                     jenkins    6229 ..c.. bash
                     jenkins    6494 ..c.. bash
                     root       6683 ....m dockerd
                     root       6767 ....m containerd
                     jenkins    7301 ..c.. bash
                     jenkins    7521 ..c.. docker
                     jenkins    7522 ..c.. process_log.sh
                     jenkins   13019 ..c.. j2
                     jenkins   13022 ..c.. build_debian.sh
                     jenkins   13023 ..c.. process_log.sh
                     root      13031 ..c.. sudo
+ sudo rm -rf ./fsroot-vs
+ sudo unsquashfs -d ./fsroot-vs target/sonic-vs.bin__vs__rfs.squashfs
Parallel unsquashfs: Using 112 processors
33651 inodes (34124 blocks) to write


[======|                                                     ]  8036/67775  11%
[===========-                                                ] 13157/67775  19%
set_attributes: failed to set time on ./fsroot-vs/usr/lib/modprobe.d/aliases.conf, because No such file or directory

set_attributes: failed to set time on ./fsroot-vs/usr/lib/modprobe.d/fbdev-blacklist.conf, because No such file or directory

set_attributes: failed to set time on ./fsroot-vs/usr/lib/modprobe.d/systemd.conf, because No such file or directory

set_attributes: failed to set time on ./fsroot-vs/usr/lib/modprobe.d, because No such file or directory

set_attributes: failed to set time on ./fsroot-vs/usr/lib/modules/6.1.0-29-2-amd64/kernel/drivers/infiniband/hw/mlx4/mlx4_ib.ko, because No such file or directory

set_attributes: failed to set time on ./fsroot-vs/usr/lib/modules/6.1.0-29-2-amd64/kernel/drivers/infiniband/hw/mlx4, because No such file or directory

set_attributes: failed to set time on ./fsroot-vs/usr/lib/modules/6.1.0-29-2-amd64/kernel/drivers/infiniband/hw/mlx5/mlx5_ib.ko, because No such file or directory

set_attributes: failed to set time on ./fsroot-vs/usr/lib/modules/6.1.0-29-2-amd64/kernel/drivers/infiniband/hw/mlx5, because No such file or directory

set_attributes: failed to set time on ./fsroot-vs/usr/lib/modules/6.1.0-29-2-amd64/kernel/drivers/infiniband/hw/mthca/ib_mthca.ko, because No such file or directory

set_attributes: failed to set time on ./fsroot-vs/usr/lib/modules/6.1.0-29-2-amd64/kernel/drivers/infiniband/hw/mthca, because No such file or directory

set_attributes: failed to set time on ./fsroot-vs/usr/lib/modules/6.1.0-29-2-amd64/kernel/drivers/infiniband/hw/ocrdma/ocrdma.ko, because No such file or directory

set_attributes: failed to set time on ./fsroot-vs/usr/lib/modules/6.1.0-29-2-amd64/kernel/drivers/infiniband/hw/ocrdma, because No such file or directory

set_attributes: failed to set time on ./fsroot-vs/usr/lib/modules/6.1.0-29-2-amd64/kernel/drivers/infiniband/hw/qedr/qedr.ko, because No such file or directory

set_attributes: failed to set time on ./fsroot-vs/usr/lib/modules/6.1.0-29-2-amd64/kernel/drivers/infiniband/hw/qedr, because No such file or directory

set_attributes: failed to set time on ./fsroot-vs/usr/lib/modules/6.1.0-29-2-amd64/kernel/drivers/infiniband/hw/qib/ib_qib.ko, because No such file or directory

set_attributes: failed to set time on ./fsroot-vs/usr/lib/modules/6.1.0-29-2-amd64/kernel/drivers/infiniband/hw/qib, because No such file or directory

set_attributes: failed to set time on ./fsroot-vs/usr/lib/modules/6.1.0-29-2-amd64/kernel/drivers/infiniband/hw/usnic/usnic_verbs.ko, because No such file or directory

set_attributes: failed to set time on ./fsroot-vs/usr/lib/modules/6.1.0-29-2-amd64/kernel/drivers/infiniband/hw/usnic, because No such file or directory

set_attributes: failed to set time on ./fsroot-vs/usr/lib/modules/6.1.0-29-2-amd64/kernel/drivers/infiniband/hw, because No such file or directory

set_attributes: failed to set time on ./fsroot-vs/usr/lib/modules/6.1.0-29-2-amd64/kernel/drivers/infiniband/sw/rdmavt/rdmavt.ko, because No such file or directory

set_attributes: failed to set time on ./fsroot-vs/usr/lib/modules/6.1.0-29-2-amd64/kernel/drivers/infiniband/sw/rdmavt, because No such file or directory

set_attributes: failed to set time on ./fsroot-vs/usr/lib/modules/6.1.0-29-2-amd64/kernel/drivers/infiniband/sw/rxe/rdma_rxe.ko, because No such file or directory

set_attributes: failed to set time on ./fsroot-vs/usr/lib/modules/6.1.0-29-2-amd64/kernel/drivers/infiniband/sw/rxe, because No such file or directory

set_attributes: failed to set time on ./fsroot-vs/usr/lib/modules/6.1.0-29-2-amd64/kernel/drivers/infiniband/sw, because No such file or directory

set_attributes: failed to set time on ./fsroot-vs/usr/lib/modules/6.1.0-29-2-amd64/kernel/drivers/infiniband/ulp/ipoib/ib_ipoib.ko, because No such file or directory

set_attributes: failed to set time on ./fsroot-vs/usr/lib/modules/6.1.0-29-2-amd64/kernel/drivers/infiniband/ulp/ipoib, because No such file or directory

set_attributes: failed to set time on ./fsroot-vs/usr/lib/modules/6.1.0-29-2-amd64/kernel/drivers/infiniband/ulp/iser/ib_iser.ko, because No such file or directory

set_attributes: failed to set time on ./fsroot-vs/usr/lib/modules/6.1.0-29-2-amd64/kernel/drivers/infiniband/ulp/iser, because No such file or directory

set_attributes: failed to set time on ./fsroot-vs/usr/lib/modules/6.1.0-29-2-amd64/kernel/drivers/infiniband/ulp/isert/ib_isert.ko, because No such file or directory

set_attributes: failed to set time on ./fsroot-vs/usr/lib/modules/6.1.0-29-2-amd64/kernel/drivers/infiniband/ulp/isert, because No such file or directory

set_attributes: failed to set time on ./fsroot-vs/usr/lib/modules/6.1.0-29-2-amd64/kernel/drivers/infiniband/ulp/srp/ib_srp.ko, because No such file or directory

set_attributes: failed to set time on ./fsroot-vs/usr/lib/modules/6.1.0-29-2-amd64/kernel/drivers/infiniband/ulp/srp, because No such file or directory

set_attributes: failed to set time on ./fsroot-vs/usr/lib/modules/6.1.0-29-2-amd64/kernel/drivers/infiniband/ulp/srpt/ib_srpt.ko, because No such file or directory

set_attributes: failed to set time on ./fsroot-vs/usr/lib/modules/6.1.0-29-2-amd64/kernel/drivers/infiniband/ulp/srpt, because No such file or directory

set_attributes: failed to set time on ./fsroot-vs/usr/lib/modules/6.1.0-29-2-amd64/kernel/drivers/infiniband/ulp, because No such file or directory

set_attributes: failed to set time on ./fsroot-vs/usr/lib/modules/6.1.0-29-2-amd64/kernel/drivers/infiniband, because No such file or directory

set_attributes: failed to set time on ./fsroot-vs/usr/lib/modules/6.1.0-29-2-amd64/kernel/drivers/input/joystick/adi.ko, because No such file or directory

set_attributes: failed to set time on ./fsroot-vs/usr/lib/modules/6.1.0-29-2-amd64/kernel/drivers/input/joystick/analog.ko, because No such file or directory

set_attributes: failed to set time on ./fsroot-vs/usr/lib/modules/6.1.0-29-2-amd64/kernel/drivers/input/joystick/cobra.ko, because No such file or directory

set_attributes: failed to set time on ./fsroot-vs/usr/lib/modules/6.1.0-29-2-amd64/kernel/drivers/input/joystick/db9.ko, because No such file or directory

set_attributes: failed to set time on ./fsroot-vs/usr/lib/modules/6.1.0-29-2-amd64/kernel/drivers/input/joystick/gamecon.ko, because No such file or directory

set_attributes: failed to set time on ./fsroot-vs/usr/lib/modules/6.1.0-29-2-amd64/kernel/drivers/input/joystick/gf2k.ko, because No such file or directory

set_attributes: failed to set time on ./fsroot-vs/usr/lib/modules/6.1.0-29-2-amd64/kernel/drivers/input/joystick/grip.ko, because No such file or directory

set_attributes: failed to set time on ./fsroot-vs/usr/lib/modules/6.1.0-29-2-amd64/kernel/drivers/input/joystick/grip_mp.ko, because No such file or directory

set_attributes: failed to set time on ./fsroot-vs/usr/lib/modules/6.1.0-29-2-amd64/kernel/drivers/input/joystick/guillemot.ko, because No such file or directory

set_attributes: failed to set time on ./fsroot-vs/usr/lib/modules/6.1.0-29-2-amd64/kernel/drivers/input/joystick/iforce/iforce-serio.ko, because No such file or directory

set_attributes: failed to set time on ./fsroot-vs/usr/lib/modules/6.1.0-29-2-amd64/kernel/drivers/input/joystick/iforce/iforce-usb.ko, because No such file or directory

set_attributes: failed to set time on ./fsroot-vs/usr/lib/modules/6.1.0-29-2-amd64/kernel/drivers/input/joystick/iforce/iforce.ko, because No such file or directory

set_attributes: failed to set time on ./fsroot-vs/usr/lib/modules/6.1.0-29-2-amd64/kernel/drivers/input/joystick/iforce, because No such file or directory

set_attributes: failed to set time on ./fsroot-vs/usr/lib/modules/6.1.0-29-2-amd64/kernel/drivers/input/joystick/interact.ko, because No such file or directory

set_attributes: failed to set time on ./fsroot-vs/usr/lib/modules/6.1.0-29-2-amd64/kernel/drivers/input/joystick/joydump.ko, because No such file or directory

set_attributes: failed to set time on ./fsroot-vs/usr/lib/modules/6.1.0-29-2-amd64/kernel/drivers/input/joystick/magellan.ko, because No such file or directory

set_attributes: failed to set time on ./fsroot-vs/usr/lib/modules/6.1.0-29-2-amd64/kernel/drivers/input/joystick/pxrc.ko, because No such file or directory

set_attributes: failed to set time on ./fsroot-vs/usr/lib/modules/6.1.0-29-2-amd64/kernel/drivers/input/joystick/sidewinder.ko, because No such file or directory

set_attributes: failed to set time on ./fsroot-vs/usr/lib/modules/6.1.0-29-2-amd64/kernel/drivers/input/joystick/spaceball.ko, because No such file or directory

set_attributes: failed to set time on ./fsroot-vs/usr/lib/modules/6.1.0-29-2-amd64/kernel/drivers/input/joystick/spaceorb.ko, because No such file or directory

set_attributes: failed to set time on ./fsroot-vs/usr/lib/modules/6.1.0-29-2-amd64/kernel/drivers/input/joystick/stinger.ko, because No such file or directory

set_attributes: failed to set time on ./fsroot-vs/usr/lib/modules/6.1.0-29-2-amd64/kernel/drivers/input/joystick/tmdc.ko, because No such file or directory

set_attributes: failed to set time on ./fsroot-vs/usr/lib/modules/6.1.0-29-2-amd64/kernel/drivers/input/joystick/turbografx.ko, because No such file or directory

set_attributes: failed to set time on ./fsroot-vs/usr/lib/modules/6.1.0-29-2-amd64/kernel/drivers/input/joystick/twidjoy.ko, because No such file or directory

set_attributes: failed to set time on ./fsroot-vs/usr/lib/modules/6.1.0-29-2-amd64/kernel/drivers/input/joystick/walkera0701.ko, because No such file or directory

set_attributes: failed to set time on ./fsroot-vs/usr/lib/modules/6.1.0-29-2-amd64/kernel/drivers/input/joystick/warrior.ko, because No such file or directory

set_attributes: failed to set time on ./fsroot-vs/usr/lib/modules/6.1.0-29-2-amd64/kernel/drivers/input/joystick/xpad.ko, because No such file or directory

set_attributes: failed to set time on ./fsroot-vs/usr/lib/modules/6.1.0-29-2-amd64/kernel/drivers/input/joystick/zhenhua.ko, because No such file or directory

set_attributes: failed to set time on ./fsroot-vs/usr/lib/modules/6.1.0-29-2-amd64/kernel/drivers/input/joystick, because No such file or directory

set_attributes: failed to set time on ./fsroot-vs/usr/lib/modules/6.1.0-29-2-amd64/kernel/drivers/input/keyboard/adp5588-keys.ko, because No such file or directory

set_attributes: failed to set time on ./fsroot-vs/usr/lib/modules/6.1.0-29-2-amd64/kernel/drivers/input/keyboard/applespi.ko, because No such file or directory

set_attributes: failed to set time on ./fsroot-vs/usr/lib/modules/6.1.0-29-2-amd64/kernel/drivers/input/keyboard/gpio_keys.ko, because No such file or directory

set_attributes: failed to set time on ./fsroot-vs/usr/lib/modules/6.1.0-29-2-amd64/kernel/drivers/input/keyboard/gpio_keys_polled.ko, because No such file or directory

set_attributes: failed to set time on ./fsroot-vs/usr/lib/modules/6.1.0-29-2-amd64/kernel/drivers/input/keyboard/lkkbd.ko, because No such file or directory

set_attributes: failed to set time on ./fsroot-vs/usr/lib/modules/6.1.0-29-2-amd64/kernel/drivers/input/keyboard/lm8323.ko, because No such file or directory

set_attributes: failed to set time on ./fsroot-vs/usr/lib/modules/6.1.0-29-2-amd64/kernel/drivers/input/keyboard/max7359_keypad.ko, because No such file or directory

set_attributes: failed to set time on ./fsroot-vs/usr/lib/modules/6.1.0-29-2-amd64/kernel/drivers/input/keyboard/newtonkbd.ko, because No such file or directory

set_attributes: failed to set time on ./fsroot-vs/usr/lib/modules/6.1.0-29-2-amd64/kernel/drivers/input/keyboard/opencores-kbd.ko, because No such file or directory

set_attributes: failed to set time on ./fsroot-vs/usr/lib/modules/6.1.0-29-2-amd64/kernel/drivers/input/keyboard/qt2160.ko, because No such file or directory

set_attributes: failed to set time on ./fsroot-vs/usr/lib/modules/6.1.0-29-2-amd64/kernel/drivers/input/keyboard/stowaway.ko, because No such file or directory

set_attributes: failed to set time on ./fsroot-vs/usr/lib/modules/6.1.0-29-2-amd64/kernel/drivers/input/keyboard/sunkbd.ko, because No such file or directory

set_attributes: failed to set time on ./fsroot-vs/usr/lib/modules/6.1.0-29-2-amd64/kernel/drivers/input/keyboard/xtkbd.ko, because No such file or directory

set_attributes: failed to set time on ./fsroot-vs/usr/lib/modules/6.1.0-29-2-amd64/kernel/drivers/input/keyboard, because No such file or directory

set_attributes: failed to set time on ./fsroot-vs/usr/lib/modules/6.1.0-29-2-amd64/kernel/drivers/input/matrix-keymap.ko, because No such file or directory

set_attributes: failed to set time on ./fsroot-vs/usr/lib/modules/6.1.0-29-2-amd64/kernel/drivers/input/misc/apanel.ko, because No such file or directory

set_attributes: failed to set time on ./fsroot-vs/usr/lib/modules/6.1.0-29-2-amd64/kernel/drivers/input/misc/ati_remote2.ko, because No such file or directory

set_attributes: failed to set time on ./fsroot-vs/usr/lib/modules/6.1.0-29-2-amd64/kernel/drivers/input/misc/atlas_btns.ko, because No such file or directory

set_attributes: failed to set time on ./fsroot-vs/usr/lib/modules/6.1.0-29-2-amd64/kernel/drivers/input/misc/axp20x-pek.ko, because No such file or directory

set_attributes: failed to set time on ./fsroot-vs/usr/lib/modules/6.1.0-29-2-amd64/kernel/drivers/input/misc/cm109.ko, because No such file or directory

set_attributes: failed to set time on ./fsroot-vs/usr/lib/modules/6.1.0-29-2-amd64/kernel/drivers/input/misc/ideapad_slidebar.ko, because No such file or directory

set_attributes: failed to set time on ./fsroot-vs/usr/lib/modules/6.1.0-29-2-amd64/kernel/drivers/input/misc/keyspan_remote.ko, because No such file or directory

set_attributes: failed to set time on ./fsroot-vs/usr/lib/modules/6.1.0-29-2-amd64/kernel/drivers/input/misc/pcspkr.ko, because No such file or directory

set_attributes: failed to set time on ./fsroot-vs/usr/lib/modules/6.1.0-29-2-amd64/kernel/drivers/input/misc/powermate.ko, because No such file or directory

set_attributes: failed to set time on ./fsroot-vs/usr/lib/modules/6.1.0-29-2-amd64/kernel/drivers/input/misc/soc_button_array.ko, because No such file or directory

set_attributes: failed to set time on ./fsroot-vs/usr/lib/modules/6.1.0-29-2-amd64/kernel/drivers/input/misc/uinput.ko, because No such file or directory

set_attributes: failed to set time on ./fsroot-vs/usr/lib/modules/6.1.0-29-2-amd64/kernel/drivers/input/misc/yealink.ko, because No such file or directory

set_attributes: failed to set time on ./fsroot-vs/usr/lib/modules/6.1.0-29-2-amd64/kernel/drivers/input/misc, because No such file or directory

set_attributes: failed to set time on ./fsroot-vs/usr/lib/modules/6.1.0-29-2-amd64/kernel/drivers/input/mouse/appletouch.ko, because No such file or directory

set_attributes: failed to set time on ./fsroot-vs/usr/lib/modules/6.1.0-29-2-amd64/kernel/drivers/input/mouse/bcm5974.ko, because No such file or directory

set_attributes: failed to set time on ./fsroot-vs/usr/lib/modules/6.1.0-29-2-amd64/kernel/drivers/input/mouse/cyapatp.ko, because No such file or directory

set_attributes: failed to set time on ./fsroot-vs/usr/lib/modules/6.1.0-29-2-amd64/kernel/drivers/input/mouse/elan_i2c.ko, because No such file or directory

set_attributes: failed to set time on ./fsroot-vs/usr/lib/modules/6.1.0-29-2-amd64/kernel/drivers/input/mouse/psmouse.ko, because No such file or directory

set_attributes: failed to set time on ./fsroot-vs/usr/lib/modules/6.1.0-29-2-amd64/kernel/drivers/input/mouse/sermouse.ko, because No such file or directory

set_attributes: failed to set time on ./fsroot-vs/usr/lib/modules/6.1.0-29-2-amd64/kernel/drivers/input/mouse/synaptics_i2c.ko, because No such file or directory

set_attributes: failed to set time on ./fsroot-vs/usr/lib/modules/6.1.0-29-2-amd64/kernel/drivers/input/mouse/synaptics_usb.ko, because No such file or directory

set_attributes: failed to set time on ./fsroot-vs/usr/lib/modules/6.1.0-29-2-amd64/kernel/drivers/input/mouse/vsxxxaa.ko, because No such file or directory

set_attributes: failed to set time on ./fsroot-vs/usr/lib/modules/6.1.0-29-2-amd64/kernel/drivers/input/mouse, because No such file or directory

set_attributes: failed to set time on ./fsroot-vs/usr/lib/modules/6.1.0-29-2-amd64/kernel/drivers/input/rmi4/rmi_core.ko, because No such file or directory

set_attributes: failed to set time on ./fsroot-vs/usr/lib/modules/6.1.0-29-2-amd64/kernel/drivers/input/rmi4/rmi_smbus.ko, because No such file or directory

set_attributes: failed to set time on ./fsroot-vs/usr/lib/modules/6.1.0-29-2-amd64/kernel/drivers/input/rmi4, because No such file or directory

set_attributes: failed to set time on ./fsroot-vs/usr/lib/modules/6.1.0-29-2-amd64/kernel/drivers/input/serio/altera_ps2.ko, because No such file or directory

set_attributes: failed to set time on ./fsroot-vs/usr/lib/modules/6.1.0-29-2-amd64/kernel/drivers/input/serio/ct82c710.ko, because No such file or directory

set_attributes: failed to set time on ./fsroot-vs/usr/lib/modules/6.1.0-29-2-amd64/kernel/drivers/input/serio/hyperv-keyboard.ko, because No such file or directory

set_attributes: failed to set time on ./fsroot-vs/usr/lib/modules/6.1.0-29-2-amd64/kernel/drivers/input/serio/parkbd.ko, because No such file or directory

set_attributes: failed to set time on ./fsroot-vs/usr/lib/modules/6.1.0-29-2-amd64/kernel/drivers/input/serio/pcips2.ko, because No such file or directory

set_attributes: failed to set time on ./fsroot-vs/usr/lib/modules/6.1.0-29-2-amd64/kernel/drivers/input/serio/serio_raw.ko, because No such file or directory

set_attributes: failed to set time on ./fsroot-vs/usr/lib/modules/6.1.0-29-2-amd64/kernel/drivers/input/serio/serport.ko, because No such file or directory

set_attributes: failed to set time on ./fsroot-vs/usr/lib/modules/6.1.0-29-2-amd64/kernel/drivers/input/serio, because No such file or directory

set_attributes: failed to set time on ./fsroot-vs/usr/lib/modules/6.1.0-29-2-amd64/kernel/drivers/input/sparse-keymap.ko, because No such file or directory

set_attributes: failed to set time on ./fsroot-vs/usr/lib/modules/6.1.0-29-2-amd64/kernel/drivers/input/tablet/acecad.ko, because No such file or directory

set_attributes: failed to set time on ./fsroot-vs/usr/lib/modules/6.1.0-29-2-amd64/kernel/drivers/input/tablet/aiptek.ko, because No such file or directory

set_attributes: failed to set time on ./fsroot-vs/usr/lib/modules/6.1.0-29-2-amd64/kernel/drivers/input/tablet/hanwang.ko, because No such file or directory

set_attributes: failed to set time on ./fsroot-vs/usr/lib/modules/6.1.0-29-2-amd64/kernel/drivers/input/tablet/kbtab.ko, because No such file or directory

set_attributes: failed to set time on ./fsroot-vs/usr/lib/modules/6.1.0-29-2-amd64/kernel/drivers/input/tablet/pegasus_notetaker.ko, because No such file or directory

set_attributes: failed to set time on ./fsroot-vs/usr/lib/modules/6.1.0-29-2-amd64/kernel/drivers/input/tablet/wacom_serial4.ko, because No such file or directory

set_attributes: failed to set time on ./fsroot-vs/usr/lib/modules/6.1.0-29-2-amd64/kernel/drivers/input/tablet, because No such file or directory

set_attributes: failed to set time on ./fsroot-vs/usr/lib/modules/6.1.0-29-2-amd64/kernel/drivers/input/touchscreen/ad7877.ko, because No such file or directory

set_attributes: failed to set time on ./fsroot-vs/usr/lib/modules/6.1.0-29-2-amd64/kernel/drivers/input/touchscreen/ad7879-i2c.ko, because No such file or directory

set_attributes: failed to set time on ./fsroot-vs/usr/lib/modules/6.1.0-29-2-amd64/kernel/drivers/input/touchscreen/ad7879.ko, because No such file or directory

set_attributes: failed to set time on ./fsroot-vs/usr/lib/modules/6.1.0-29-2-amd64/kernel/drivers/input/touchscreen/ads7846.ko, because No such file or directory

set_attributes: failed to set time on ./fsroot-vs/usr/lib/modules/6.1.0-29-2-amd64/kernel/drivers/input/touchscreen/atmel_mxt_ts.ko, because No such file or directory

set_attributes: failed to set time on ./fsroot-vs/usr/lib/modules/6.1.0-29-2-amd64/kernel/drivers/input/touchscreen/dynapro.ko, because No such file or directory

set_attributes: failed to set time on ./fsroot-vs/usr/lib/modules/6.1.0-29-2-amd64/kernel/drivers/input/touchscreen/eeti_ts.ko, because No such file or directory

set_attributes: failed to set time on ./fsroot-vs/usr/lib/modules/6.1.0-29-2-amd64/kernel/drivers/input/touchscreen/elo.ko, because No such file or directory

set_attributes: failed to set time on ./fsroot-vs/usr/lib/modules/6.1.0-29-2-amd64/kernel/drivers/input/touchscreen/fujitsu_ts.ko, because No such file or directory

set_attributes: failed to set time on ./fsroot-vs/usr/lib/modules/6.1.0-29-2-amd64/kernel/drivers/input/touchscreen/goodix_ts.ko, because No such file or directory

set_attributes: failed to set time on ./fsroot-vs/usr/lib/modules/6.1.0-29-2-amd64/kernel/drivers/input/touchscreen/gunze.ko, because No such file or directory

set_attributes: failed to set time on ./fsroot-vs/usr/lib/modules/6.1.0-29-2-amd64/kernel/drivers/input/touchscreen/hampshire.ko, because No such file or directory

set_attributes: failed to set time on ./fsroot-vs/usr/lib/modules/6.1.0-29-2-amd64/kernel/drivers/input/touchscreen/inexio.ko, because No such file or directory

set_attributes: failed to set time on ./fsroot-vs/usr/lib/modules/6.1.0-29-2-amd64/kernel/drivers/input/touchscreen/mcs5000_ts.ko, because No such file or directory

set_attributes: failed to set time on ./fsroot-vs/usr/lib/modules/6.1.0-29-2-amd64/kernel/drivers/input/touchscreen/mk712.ko, because No such file or directory

set_attributes: failed to set time on ./fsroot-vs/usr/lib/modules/6.1.0-29-2-amd64/kernel/drivers/input/touchscreen/mtouch.ko, because No such file or directory

set_attributes: failed to set time on ./fsroot-vs/usr/lib/modules/6.1.0-29-2-amd64/kernel/drivers/input/touchscreen/penmount.ko, because No such file or directory

set_attributes: failed to set time on ./fsroot-vs/usr/lib/modules/6.1.0-29-2-amd64/kernel/drivers/input/touchscreen/silead.ko, because No such file or directory

set_attributes: failed to set time on ./fsroot-vs/usr/lib/modules/6.1.0-29-2-amd64/kernel/drivers/input/touchscreen/surface3_spi.ko, because No such file or directory

set_attributes: failed to set time on ./fsroot-vs/usr/lib/modules/6.1.0-29-2-amd64/kernel/drivers/input/touchscreen/touchit213.ko, because No such file or directory

set_attributes: failed to set time on ./fsroot-vs/usr/lib/modules/6.1.0-29-2-amd64/kernel/drivers/input/touchscreen/touchright.ko, because No such file or directory

set_attributes: failed to set time on ./fsroot-vs/usr/lib/modules/6.1.0-29-2-amd64/kernel/drivers/input/touchscreen/touchwin.ko, because No such file or directory

set_attributes: failed to set time on ./fsroot-vs/usr/lib/modules/6.1.0-29-2-amd64/kernel/drivers/input/touchscreen/tps6507x-ts.ko, because No such file or directory

set_attributes: failed to set time on ./fsroot-vs/usr/lib/modules/6.1.0-29-2-amd64/kernel/drivers/input/touchscreen/tsc2007.ko, because No such file or directory

set_attributes: failed to set time on ./fsroot-vs/usr/lib/modules/6.1.0-29-2-amd64/kernel/drivers/input/touchscreen/tsc40.ko, because No such file or directory

set_attributes: failed to set time on ./fsroot-vs/usr/lib/modules/6.1.0-29-2-amd64/kernel/drivers/input/touchscreen/usbtouchscreen.ko, because No such file or directory

set_attributes: failed to set time on ./fsroot-vs/usr/lib/modules/6.1.0-29-2-amd64/kernel/drivers/input/touchscreen/wacom_w8001.ko, because No such file or directory

set_attributes: failed to set time on ./fsroot-vs/usr/lib/modules/6.1.0-29-2-amd64/kernel/drivers/input/touchscreen/wm97xx-ts.ko, because No such file or directory

set_attributes: failed to set time on ./fsroot-vs/usr/lib/modules/6.1.0-29-2-amd64/kernel/drivers/input/touchscreen, because No such file or directory

set_attributes: failed to set time on ./fsroot-vs/usr/lib/modules/6.1.0-29-2-amd64/kernel/drivers/input, because No such file or directory

set_attributes: failed to set time on ./fsroot-vs/usr/lib/modules/6.1.0-29-2-amd64/kernel/drivers/isdn/capi/kernelcapi.ko, because No such file or directory

set_attributes: failed to set time on ./fsroot-vs/usr/lib/modules/6.1.0-29-2-amd64/kernel/drivers/isdn/capi, because No such file or directory

set_attributes: failed to set time on ./fsroot-vs/usr/lib/modules/6.1.0-29-2-amd64/kernel/drivers/isdn/hardware/mISDN/avmfritz.ko, because No such file or directory

set_attributes: failed to set time on ./fsroot-vs/usr/lib/modules/6.1.0-29-2-amd64/kernel/drivers/isdn/hardware/mISDN/hfcmulti.ko, because No such file or directory

set_attributes: failed to set time on ./fsroot-vs/usr/lib/modules/6.1.0-29-2-amd64/kernel/drivers/isdn/hardware/mISDN/hfcpci.ko, because No such file or directory

set_attributes: failed to set time on ./fsroot-vs/usr/lib/modules/6.1.0-29-2-amd64/kernel/drivers/isdn/hardware/mISDN/hfcsusb.ko, because No such file or directory

set_attributes: failed to set time on ./fsroot-vs/usr/lib/modules/6.1.0-29-2-amd64/kernel/drivers/isdn/hardware/mISDN/mISDNinfineon.ko, because No such file or directory

set_attributes: failed to set time on ./fsroot-vs/usr/lib/modules/6.1.0-29-2-amd64/kernel/drivers/isdn/hardware/mISDN/mISDNipac.ko, because No such file or directory

set_attributes: failed to set time on ./fsroot-vs/usr/lib/modules/6.1.0-29-2-amd64/kernel/drivers/isdn/hardware/mISDN/mISDNisar.ko, because No such file or directory

set_attributes: failed to set time on ./fsroot-vs/usr/lib/modules/6.1.0-29-2-amd64/kernel/drivers/isdn/hardware/mISDN/speedfax.ko, because No such file or directory

set_attributes: failed to set time on ./fsroot-vs/usr/lib/modules/6.1.0-29-2-amd64/kernel/drivers/isdn/hardware/mISDN/w6692.ko, because No such file or directory

set_attributes: failed to set time on ./fsroot-vs/usr/lib/modules/6.1.0-29-2-amd64/kernel/drivers/isdn/hardware/mISDN, because No such file or directory

set_attributes: failed to set time on ./fsroot-vs/usr/lib/modules/6.1.0-29-2-amd64/kernel/drivers/isdn/hardware, because No such file or directory

set_attributes: failed to set time on ./fsroot-vs/usr/lib/modules/6.1.0-29-2-amd64/kernel/drivers/isdn/mISDN/l1oip.ko, because No such file or directory

set_attributes: failed to set time on ./fsroot-vs/usr/lib/modules/6.1.0-29-2-amd64/kernel/drivers/isdn/mISDN/mISDN_core.ko, because No such file or directory

set_attributes: failed to set time on ./fsroot-vs/usr/lib/modules/6.1.0-29-2-amd64/kernel/drivers/isdn/mISDN/mISDN_dsp.ko, because No such file or directory

set_attributes: failed to set time on ./fsroot-vs/usr/lib/modules/6.1.0-29-2-amd64/kernel/drivers/isdn/mISDN, because No such file or directory

set_attributes: failed to set time on ./fsroot-vs/usr/lib/modules/6.1.0-29-2-amd64/kernel/drivers/isdn, because No such file or directory

set_attributes: failed to set time on ./fsroot-vs/usr/lib/modules/6.1.0-29-2-amd64/kernel/drivers/leds/led-class-multicolor.ko, because No such file or directory

set_attributes: failed to set time on ./fsroot-vs/usr/lib/modules/6.1.0-29-2-amd64/kernel/drivers/leds/leds-apu.ko, because No such file or directory

set_attributes: failed to set time on ./fsroot-vs/usr/lib/modules/6.1.0-29-2-amd64/kernel/drivers/leds/leds-bd2802.ko, because No such file or directory

set_attributes: failed to set time on ./fsroot-vs/usr/lib/modules/6.1.0-29-2-amd64/kernel/drivers/leds/leds-dac124s085.ko, because No such file or directory

set_attributes: failed to set time on ./fsroot-vs/usr/lib/modules/6.1.0-29-2-amd64/kernel/drivers/leds/leds-gpio.ko, because No such file or directory

set_attributes: failed to set time on ./fsroot-vs/usr/lib/modules/6.1.0-29-2-amd64/kernel/drivers/leds/leds-lp3944.ko, because No such file or directory

set_attributes: failed to set time on ./fsroot-vs/usr/lib/modules/6.1.0-29-2-amd64/kernel/drivers/leds/leds-lt3593.ko, because No such file or directory

set_attributes: failed to set time on ./fsroot-vs/usr/lib/modules/6.1.0-29-2-amd64/kernel/drivers/leds/leds-menf21bmc.ko, because No such file or directory

set_attributes: failed to set time on ./fsroot-vs/usr/lib/modules/6.1.0-29-2-amd64/kernel/drivers/leds/leds-mlxreg.ko, because No such file or directory

set_attributes: failed to set time on ./fsroot-vs/usr/lib/modules/6.1.0-29-2-amd64/kernel/drivers/leds/leds-pca955x.ko, because No such file or directory

set_attributes: failed to set time on ./fsroot-vs/usr/lib/modules/6.1.0-29-2-amd64/kernel/drivers/leds/leds-regulator.ko, because No such file or directory

set_attributes: failed to set time on ./fsroot-vs/usr/lib/modules/6.1.0-29-2-amd64/kernel/drivers/leds/leds-ss4200.ko, because No such file or directory

set_attributes: failed to set time on ./fsroot-vs/usr/lib/modules/6.1.0-29-2-amd64/kernel/drivers/leds/simple/simatic-ipc-leds-gpio.ko, because No such file or directory

set_attributes: failed to set time on ./fsroot-vs/usr/lib/modules/6.1.0-29-2-amd64/kernel/drivers/leds/simple/simatic-ipc-leds.ko, because No such file or directory

set_attributes: failed to set time on ./fsroot-vs/usr/lib/modules/6.1.0-29-2-amd64/kernel/drivers/leds/simple, because No such file or directory

set_attributes: failed to set time on ./fsroot-vs/usr/lib/modules/6.1.0-29-2-amd64/kernel/drivers/leds/trigger/ledtrig-activity.ko, because No such file or directory

set_attributes: failed to set time on ./fsroot-vs/usr/lib/modules/6.1.0-29-2-amd64/kernel/drivers/leds/trigger/ledtrig-audio.ko, because No such file or directory

set_attributes: failed to set time on ./fsroot-vs/usr/lib/modules/6.1.0-29-2-amd64/kernel/drivers/leds/trigger/ledtrig-backlight.ko, because No such file or directory

set_attributes: failed to set time on ./fsroot-vs/usr/lib/modules/6.1.0-29-2-amd64/kernel/drivers/leds/trigger/ledtrig-camera.ko, because No such file or directory

set_attributes: failed to set time on ./fsroot-vs/usr/lib/modules/6.1.0-29-2-amd64/kernel/drivers/leds/trigger/ledtrig-default-on.ko, because No such file or directory

set_attributes: failed to set time on ./fsroot-vs/usr/lib/modules/6.1.0-29-2-amd64/kernel/drivers/leds/trigger/ledtrig-gpio.ko, because No such file or directory

set_attributes: failed to set time on ./fsroot-vs/usr/lib/modules/6.1.0-29-2-amd64/kernel/drivers/leds/trigger/ledtrig-heartbeat.ko, because No such file or directory

set_attributes: failed to set time on ./fsroot-vs/usr/lib/modules/6.1.0-29-2-amd64/kernel/drivers/leds/trigger/ledtrig-netdev.ko, because No such file or directory

set_attributes: failed to set time on ./fsroot-vs/usr/lib/modules/6.1.0-29-2-amd64/kernel/drivers/leds/trigger/ledtrig-oneshot.ko, because No such file or directory

set_attributes: failed to set time on ./fsroot-vs/usr/lib/modules/6.1.0-29-2-amd64/kernel/drivers/leds/trigger/ledtrig-pattern.ko, because No such file or directory

set_attributes: failed to set time on ./fsroot-vs/usr/lib/modules/6.1.0-29-2-amd64/kernel/drivers/leds/trigger/ledtrig-timer.ko, because No such file or directory

set_attributes: failed to set time on ./fsroot-vs/usr/lib/modules/6.1.0-29-2-amd64/kernel/drivers/leds/trigger/ledtrig-transient.ko, because No such file or directory

set_attributes: failed to set time on ./fsroot-vs/usr/lib/modules/6.1.0-29-2-amd64/kernel/drivers/leds/trigger, because No such file or directory

set_attributes: failed to set time on ./fsroot-vs/usr/lib/modules/6.1.0-29-2-amd64/kernel/drivers/leds, because No such file or directory

set_attributes: failed to set time on ./fsroot-vs/usr/lib/modules/6.1.0-29-2-amd64/kernel/drivers/md/bcache/bcache.ko, because No such file or directory

set_attributes: failed to set time on ./fsroot-vs/usr/lib/modules/6.1.0-29-2-amd64/kernel/drivers/md/bcache, because No such file or directory

set_attributes: failed to set time on ./fsroot-vs/usr/lib/modules/6.1.0-29-2-amd64/kernel/drivers/md/dm-bio-prison.ko, because No such file or directory

set_attributes: failed to set time on ./fsroot-vs/usr/lib/modules/6.1.0-29-2-amd64/kernel/drivers/md/dm-bufio.ko, because No such file or directory

set_attributes: failed to set time on ./fsroot-vs/usr/lib/modules/6.1.0-29-2-amd64/kernel/drivers/md/dm-cache-smq.ko, because No such file or directory

set_attributes: failed to set time on ./fsroot-vs/usr/lib/modules/6.1.0-29-2-amd64/kernel/drivers/md/dm-cache.ko, because No such file or directory

set_attributes: failed to set time on ./fsroot-vs/usr/lib/modules/6.1.0-29-2-amd64/kernel/drivers/md/dm-crypt.ko, because No such file or directory

set_attributes: failed to set time on ./fsroot-vs/usr/lib/modules/6.1.0-29-2-amd64/kernel/drivers/md/dm-delay.ko, because No such file or directory

set_attributes: failed to set time on ./fsroot-vs/usr/lib/modules/6.1.0-29-2-amd64/kernel/drivers/md/dm-era.ko, because No such file or directory

set_attributes: failed to set time on ./fsroot-vs/usr/lib/modules/6.1.0-29-2-amd64/kernel/drivers/md/dm-flakey.ko, because No such file or directory

set_attributes: failed to set time on ./fsroot-vs/usr/lib/modules/6.1.0-29-2-amd64/kernel/drivers/md/dm-integrity.ko, because No such file or directory

set_attributes: failed to set time on ./fsroot-vs/usr/lib/modules/6.1.0-29-2-amd64/kernel/drivers/md/dm-log-userspace.ko, because No such file or directory

set_attributes: failed to set time on ./fsroot-vs/usr/lib/modules/6.1.0-29-2-amd64/kernel/drivers/md/dm-log-writes.ko, because No such file or directory

set_attributes: failed to set time on ./fsroot-vs/usr/lib/modules/6.1.0-29-2-amd64/kernel/drivers/md/dm-log.ko, because No such file or directory

set_attributes: failed to set time on ./fsroot-vs/usr/lib/modules/6.1.0-29-2-amd64/kernel/drivers/md/dm-mirror.ko, because No such file or directory

set_attributes: failed to set time on ./fsroot-vs/usr/lib/modules/6.1.0-29-2-amd64/kernel/drivers/md/dm-mod.ko, because No such file or directory

set_attributes: failed to set time on ./fsroot-vs/usr/lib/modules/6.1.0-29-2-amd64/kernel/drivers/md/dm-multipath.ko, because No such file or directory

set_attributes: failed to set time on ./fsroot-vs/usr/lib/modules/6.1.0-29-2-amd64/kernel/drivers/md/dm-queue-length.ko, because No such file or directory

set_attributes: failed to set time on ./fsroot-vs/usr/lib/modules/6.1.0-29-2-amd64/kernel/drivers/md/dm-raid.ko, because No such file or directory

set_attributes: failed to set time on ./fsroot-vs/usr/lib/modules/6.1.0-29-2-amd64/kernel/drivers/md/dm-region-hash.ko, because No such file or directory

set_attributes: failed to set time on ./fsroot-vs/usr/lib/modules/6.1.0-29-2-amd64/kernel/drivers/md/dm-round-robin.ko, because No such file or directory

set_attributes: failed to set time on ./fsroot-vs/usr/lib/modules/6.1.0-29-2-amd64/kernel/drivers/md/dm-service-time.ko, because No such file or directory

set_attributes: failed to set time on ./fsroot-vs/usr/lib/modules/6.1.0-29-2-amd64/kernel/drivers/md/dm-snapshot.ko, because No such file or directory

set_attributes: failed to set time on ./fsroot-vs/usr/lib/modules/6.1.0-29-2-amd64/kernel/drivers/md/dm-switch.ko, because No such file or directory

set_attributes: failed to set time on ./fsroot-vs/usr/lib/modules/6.1.0-29-2-amd64/kernel/drivers/md/dm-thin-pool.ko, because No such file or directory

set_attributes: failed to set time on ./fsroot-vs/usr/lib/modules/6.1.0-29-2-amd64/kernel/drivers/md/dm-unstripe.ko, because No such file or directory

set_attributes: failed to set time on ./fsroot-vs/usr/lib/modules/6.1.0-29-2-amd64/kernel/drivers/md/dm-verity.ko, because No such file or directory

set_attributes: failed to set time on ./fsroot-vs/usr/lib/modules/6.1.0-29-2-amd64/kernel/drivers/md/dm-writecache.ko, because No such file or directory

set_attributes: failed to set time on ./fsroot-vs/usr/lib/modules/6.1.0-29-2-amd64/kernel/drivers/md/dm-zero.ko, because No such file or directory

set_attributes: failed to set time on ./fsroot-vs/usr/lib/modules/6.1.0-29-2-amd64/kernel/drivers/md/dm-zoned.ko, because No such file or directory

set_attributes: failed to set time on ./fsroot-vs/usr/lib/modules/6.1.0-29-2-amd64/kernel/drivers/md/faulty.ko, because No such file or directory

set_attributes: failed to set time on ./fsroot-vs/usr/lib/modules/6.1.0-29-2-amd64/kernel/drivers/md/linear.ko, because No such file or directory

set_attributes: failed to set time on ./fsroot-vs/usr/lib/modules/6.1.0-29-2-amd64/kernel/drivers/md/md-cluster.ko, because No such file or directory

set_attributes: failed to set time on ./fsroot-vs/usr/lib/modules/6.1.0-29-2-amd64/kernel/drivers/md/md-mod.ko, because No such file or directory

set_attributes: failed to set time on ./fsroot-vs/usr/lib/modules/6.1.0-29-2-amd64/kernel/drivers/md/multipath.ko, because No such file or directory

set_attributes: failed to set time on ./fsroot-vs/usr/lib/modules/6.1.0-29-2-amd64/kernel/drivers/md/persistent-data/dm-persistent-data.ko, because No such file or directory

set_attributes: failed to set time on ./fsroot-vs/usr/lib/modules/6.1.0-29-2-amd64/kernel/drivers/md/persistent-data, because No such file or directory

set_attributes: failed to set time on ./fsroot-vs/usr/lib/modules/6.1.0-29-2-amd64/kernel/drivers/md/raid0.ko, because No such file or directory

set_attributes: failed to set time on ./fsroot-vs/usr/lib/modules/6.1.0-29-2-amd64/kernel/drivers/md/raid1.ko, because No such file or directory

set_attributes: failed to set time on ./fsroot-vs/usr/lib/modules/6.1.0-29-2-amd64/kernel/drivers/md/raid10.ko, because No such file or directory

set_attributes: failed to set time on ./fsroot-vs/usr/lib/modules/6.1.0-29-2-amd64/kernel/drivers/md/raid456.ko, because No such file or directory

set_attributes: failed to set time on ./fsroot-vs/usr/lib/modules/6.1.0-29-2-amd64/kernel/drivers/md, because No such file or directory

set_attributes: failed to set time on ./fsroot-vs/usr/lib/modules/6.1.0-29-2-amd64/kernel/drivers/media/cec/core/cec.ko, because No such file or directory

set_attributes: failed to set time on ./fsroot-vs/usr/lib/modules/6.1.0-29-2-amd64/kernel/drivers/media/cec/core, because No such file or directory

set_attributes: failed to set time on ./fsroot-vs/usr/lib/modules/6.1.0-29-2-amd64/kernel/drivers/media/cec/platform/seco/seco-cec.ko, because No such file or directory

set_attributes: failed to set time on ./fsroot-vs/usr/lib/modules/6.1.0-29-2-amd64/kernel/drivers/media/cec/platform/seco, because No such file or directory

set_attributes: failed to set time on ./fsroot-vs/usr/lib/modules/6.1.0-29-2-amd64/kernel/drivers/media/cec/platform, because No such file or directory

set_attributes: failed to set time on ./fsroot-vs/usr/lib/modules/6.1.0-29-2-amd64/kernel/drivers/media/cec/usb/pulse8/pulse8-cec.ko, because No such file or directory

set_attributes: failed to set time on ./fsroot-vs/usr/lib/modules/6.1.0-29-2-amd64/kernel/drivers/media/cec/usb/pulse8, because No such file or directory

set_attributes: failed to set time on ./fsroot-vs/usr/lib/modules/6.1.0-29-2-amd64/kernel/drivers/media/cec/usb/rainshadow/rainshadow-cec.ko, because No such file or directory

set_attributes: failed to set time on ./fsroot-vs/usr/lib/modules/6.1.0-29-2-amd64/kernel/drivers/media/cec/usb/rainshadow, because No such file or directory

set_attributes: failed to set time on ./fsroot-vs/usr/lib/modules/6.1.0-29-2-amd64/kernel/drivers/media/cec/usb, because No such file or directory

set_attributes: failed to set time on ./fsroot-vs/usr/lib/modules/6.1.0-29-2-amd64/kernel/drivers/media/cec, because No such file or directory

set_attributes: failed to set time on ./fsroot-vs/usr/lib/modules/6.1.0-29-2-amd64/kernel/drivers/media/rc/ati_remote.ko, because No such file or directory

set_attributes: failed to set time on ./fsroot-vs/usr/lib/modules/6.1.0-29-2-amd64/kernel/drivers/media/rc/ene_ir.ko, because No such file or directory

set_attributes: failed to set time on ./fsroot-vs/usr/lib/modules/6.1.0-29-2-amd64/kernel/drivers/media/rc/fintek-cir.ko, because No such file or directory

set_attributes: failed to set time on ./fsroot-vs/usr/lib/modules/6.1.0-29-2-amd64/kernel/drivers/media/rc/igorplugusb.ko, because No such file or directory

set_attributes: failed to set time on ./fsroot-vs/usr/lib/modules/6.1.0-29-2-amd64/kernel/drivers/media/rc/iguanair.ko, because No such file or directory

set_attributes: failed to set time on ./fsroot-vs/usr/lib/modules/6.1.0-29-2-amd64/kernel/drivers/media/rc/imon.ko, because No such file or directory

set_attributes: failed to set time on ./fsroot-vs/usr/lib/modules/6.1.0-29-2-amd64/kernel/drivers/media/rc/imon_raw.ko, because No such file or directory

set_attributes: failed to set time on ./fsroot-vs/usr/lib/modules/6.1.0-29-2-amd64/kernel/drivers/media/rc/ir-imon-decoder.ko, because No such file or directory

set_attributes: failed to set time on ./fsroot-vs/usr/lib/modules/6.1.0-29-2-amd64/kernel/drivers/media/rc/ir-jvc-decoder.ko, because No such file or directory

set_attributes: failed to set time on ./fsroot-vs/usr/lib/modules/6.1.0-29-2-amd64/kernel/drivers/media/rc/ir-mce_kbd-decoder.ko, because No such file or directory

set_attributes: failed to set time on ./fsroot-vs/usr/lib/modules/6.1.0-29-2-amd64/kernel/drivers/media/rc/ir-nec-decoder.ko, because No such file or directory

set_attributes: failed to set time on ./fsroot-vs/usr/lib/modules/6.1.0-29-2-amd64/kernel/drivers/media/rc/ir-rc5-decoder.ko, because No such file or directory

set_attributes: failed to set time on ./fsroot-vs/usr/lib/modules/6.1.0-29-2-amd64/kernel/drivers/media/rc/ir-rc6-decoder.ko, because No such file or directory

set_attributes: failed to set time on ./fsroot-vs/usr/lib/modules/6.1.0-29-2-amd64/kernel/drivers/media/rc/ir-sanyo-decoder.ko, because No such file or directory

set_attributes: failed to set time on ./fsroot-vs/usr/lib/modules/6.1.0-29-2-amd64/kernel/drivers/media/rc/ir-sharp-decoder.ko, because No such file or directory

set_attributes: failed to set time on ./fsroot-vs/usr/lib/modules/6.1.0-29-2-amd64/kernel/drivers/media/rc/ir-sony-decoder.ko, because No such file or directory

set_attributes: failed to set time on ./fsroot-vs/usr/lib/modules/6.1.0-29-2-amd64/kernel/drivers/media/rc/ir-xmp-decoder.ko, because No such file or directory

set_attributes: failed to set time on ./fsroot-vs/usr/lib/modules/6.1.0-29-2-amd64/kernel/drivers/media/rc/ite-cir.ko, because No such file or directory

set_attributes: failed to set time on ./fsroot-vs/usr/lib/modules/6.1.0-29-2-amd64/kernel/drivers/media/rc/keymaps/rc-adstech-dvb-t-pci.ko, because No such file or directory

set_attributes: failed to set time on ./fsroot-vs/usr/lib/modules/6.1.0-29-2-amd64/kernel/drivers/media/rc/keymaps/rc-alink-dtu-m.ko, because No such file or directory

set_attributes: failed to set time on ./fsroot-vs/usr/lib/modules/6.1.0-29-2-amd64/kernel/drivers/media/rc/keymaps/rc-anysee.ko, because No such file or directory

set_attributes: failed to set time on ./fsroot-vs/usr/lib/modules/6.1.0-29-2-amd64/kernel/drivers/media/rc/keymaps/rc-apac-viewcomp.ko, because No such file or directory

set_attributes: failed to set time on ./fsroot-vs/usr/lib/modules/6.1.0-29-2-amd64/kernel/drivers/media/rc/keymaps/rc-astrometa-t2hybrid.ko, because No such file or directory

set_attributes: failed to set time on ./fsroot-vs/usr/lib/modules/6.1.0-29-2-amd64/kernel/drivers/media/rc/keymaps/rc-asus-pc39.ko, because No such file or directory

set_attributes: failed to set time on ./fsroot-vs/usr/lib/modules/6.1.0-29-2-amd64/kernel/drivers/media/rc/keymaps/rc-asus-ps3-100.ko, because No such file or directory

set_attributes: failed to set time on ./fsroot-vs/usr/lib/modules/6.1.0-29-2-amd64/kernel/drivers/media/rc/keymaps/rc-ati-tv-wonder-hd-600.ko, because No such file or directory

set_attributes: failed to set time on ./fsroot-vs/usr/lib/modules/6.1.0-29-2-amd64/kernel/drivers/media/rc/keymaps/rc-ati-x10.ko, because No such file or directory

set_attributes: failed to set time on ./fsroot-vs/usr/lib/modules/6.1.0-29-2-amd64/kernel/drivers/media/rc/keymaps/rc-avermedia-a16d.ko, because No such file or directory

set_attributes: failed to set time on ./fsroot-vs/usr/lib/modules/6.1.0-29-2-amd64/kernel/drivers/media/rc/keymaps/rc-avermedia-cardbus.ko, because No such file or directory

set_attributes: failed to set time on ./fsroot-vs/usr/lib/modules/6.1.0-29-2-amd64/kernel/drivers/media/rc/keymaps/rc-avermedia-dvbt.ko, because No such file or directory

set_attributes: failed to set time on ./fsroot-vs/usr/lib/modules/6.1.0-29-2-amd64/kernel/drivers/media/rc/keymaps/rc-avermedia-m135a.ko, because No such file or directory

set_attributes: failed to set time on ./fsroot-vs/usr/lib/modules/6.1.0-29-2-amd64/kernel/drivers/media/rc/keymaps/rc-avermedia-m733a-rm-k6.ko, because No such file or directory

set_attributes: failed to set time on ./fsroot-vs/usr/lib/modules/6.1.0-29-2-amd64/kernel/drivers/media/rc/keymaps/rc-avermedia-rm-ks.ko, because No such file or directory

set_attributes: failed to set time on ./fsroot-vs/usr/lib/modules/6.1.0-29-2-amd64/kernel/drivers/media/rc/keymaps/rc-avermedia.ko, because No such file or directory

set_attributes: failed to set time on ./fsroot-vs/usr/lib/modules/6.1.0-29-2-amd64/kernel/drivers/media/rc/keymaps/rc-avertv-303.ko, because No such file or directory

set_attributes: failed to set time on ./fsroot-vs/usr/lib/modules/6.1.0-29-2-amd64/kernel/drivers/media/rc/keymaps/rc-azurewave-ad-tu700.ko, because No such file or directory

set_attributes: failed to set time on ./fsroot-vs/usr/lib/modules/6.1.0-29-2-amd64/kernel/drivers/media/rc/keymaps/rc-beelink-gs1.ko, because No such file or directory

set_attributes: failed to set time on ./fsroot-vs/usr/lib/modules/6.1.0-29-2-amd64/kernel/drivers/media/rc/keymaps/rc-behold-columbus.ko, because No such file or directory

set_attributes: failed to set time on ./fsroot-vs/usr/lib/modules/6.1.0-29-2-amd64/kernel/drivers/media/rc/keymaps/rc-behold.ko, because No such file or directory

set_attributes: failed to set time on ./fsroot-vs/usr/lib/modules/6.1.0-29-2-amd64/kernel/drivers/media/rc/keymaps/rc-budget-ci-old.ko, because No such file or directory

set_attributes: failed to set time on ./fsroot-vs/usr/lib/modules/6.1.0-29-2-amd64/kernel/drivers/media/rc/keymaps/rc-cinergy-1400.ko, because No such file or directory

set_attributes: failed to set time on ./fsroot-vs/usr/lib/modules/6.1.0-29-2-amd64/kernel/drivers/media/rc/keymaps/rc-cinergy.ko, because No such file or directory

set_attributes: failed to set time on ./fsroot-vs/usr/lib/modules/6.1.0-29-2-amd64/kernel/drivers/media/rc/keymaps/rc-ct-90405.ko, because No such file or directory

set_attributes: failed to set time on ./fsroot-vs/usr/lib/modules/6.1.0-29-2-amd64/kernel/drivers/media/rc/keymaps/rc-d680-dmb.ko, because No such file or directory

set_attributes: failed to set time on ./fsroot-vs/usr/lib/modules/6.1.0-29-2-amd64/kernel/drivers/media/rc/keymaps/rc-delock-61959.ko, because No such file or directory

set_attributes: failed to set time on ./fsroot-vs/usr/lib/modules/6.1.0-29-2-amd64/kernel/drivers/media/rc/keymaps/rc-dib0700-nec.ko, because No such file or directory

set_attributes: failed to set time on ./fsroot-vs/usr/lib/modules/6.1.0-29-2-amd64/kernel/drivers/media/rc/keymaps/rc-dib0700-rc5.ko, because No such file or directory

set_attributes: failed to set time on ./fsroot-vs/usr/lib/modules/6.1.0-29-2-amd64/kernel/drivers/media/rc/keymaps/rc-digitalnow-tinytwin.ko, because No such file or directory

set_attributes: failed to set time on ./fsroot-vs/usr/lib/modules/6.1.0-29-2-amd64/kernel/drivers/media/rc/keymaps/rc-digittrade.ko, because No such file or directory

set_attributes: failed to set time on ./fsroot-vs/usr/lib/modules/6.1.0-29-2-amd64/kernel/drivers/media/rc/keymaps/rc-dm1105-nec.ko, because No such file or directory

set_attributes: failed to set time on ./fsroot-vs/usr/lib/modules/6.1.0-29-2-amd64/kernel/drivers/media/rc/keymaps/rc-dntv-live-dvb-t.ko, because No such file or directory

set_attributes: failed to set time on ./fsroot-vs/usr/lib/modules/6.1.0-29-2-amd64/kernel/drivers/media/rc/keymaps/rc-dntv-live-dvbt-pro.ko, because No such file or directory

set_attributes: failed to set time on ./fsroot-vs/usr/lib/modules/6.1.0-29-2-amd64/kernel/drivers/media/rc/keymaps/rc-dtt200u.ko, because No such file or directory

set_attributes: failed to set time on ./fsroot-vs/usr/lib/modules/6.1.0-29-2-amd64/kernel/drivers/media/rc/keymaps/rc-dvbsky.ko, because No such file or directory

set_attributes: failed to set time on ./fsroot-vs/usr/lib/modules/6.1.0-29-2-amd64/kernel/drivers/media/rc/keymaps/rc-dvico-mce.ko, because No such file or directory

set_attributes: failed to set time on ./fsroot-vs/usr/lib/modules/6.1.0-29-2-amd64/kernel/drivers/media/rc/keymaps/rc-dvico-portable.ko, because No such file or directory

set_attributes: failed to set time on ./fsroot-vs/usr/lib/modules/6.1.0-29-2-amd64/kernel/drivers/media/rc/keymaps/rc-em-terratec.ko, because No such file or directory

set_attributes: failed to set time on ./fsroot-vs/usr/lib/modules/6.1.0-29-2-amd64/kernel/drivers/media/rc/keymaps/rc-encore-enltv-fm53.ko, because No such file or directory

set_attributes: failed to set time on ./fsroot-vs/usr/lib/modules/6.1.0-29-2-amd64/kernel/drivers/media/rc/keymaps/rc-encore-enltv.ko, because No such file or directory

set_attributes: failed to set time on ./fsroot-vs/usr/lib/modules/6.1.0-29-2-amd64/kernel/drivers/media/rc/keymaps/rc-encore-enltv2.ko, because No such file or directory

set_attributes: failed to set time on ./fsroot-vs/usr/lib/modules/6.1.0-29-2-amd64/kernel/drivers/media/rc/keymaps/rc-evga-indtube.ko, because No such file or directory

set_attributes: failed to set time on ./fsroot-vs/usr/lib/modules/6.1.0-29-2-amd64/kernel/drivers/media/rc/keymaps/rc-eztv.ko, because No such file or directory

set_attributes: failed to set time on ./fsroot-vs/usr/lib/modules/6.1.0-29-2-amd64/kernel/drivers/media/rc/keymaps/rc-flydvb.ko, because No such file or directory

set_attributes: failed to set time on ./fsroot-vs/usr/lib/modules/6.1.0-29-2-amd64/kernel/drivers/media/rc/keymaps/rc-flyvideo.ko, because No such file or directory

set_attributes: failed to set time on ./fsroot-vs/usr/lib/modules/6.1.0-29-2-amd64/kernel/drivers/media/rc/keymaps/rc-fusionhdtv-mce.ko, because No such file or directory

set_attributes: failed to set time on ./fsroot-vs/usr/lib/modules/6.1.0-29-2-amd64/kernel/drivers/media/rc/keymaps/rc-gadmei-rm008z.ko, because No such file or directory

set_attributes: failed to set time on ./fsroot-vs/usr/lib/modules/6.1.0-29-2-amd64/kernel/drivers/media/rc/keymaps/rc-geekbox.ko, because No such file or directory

set_attributes: failed to set time on ./fsroot-vs/usr/lib/modules/6.1.0-29-2-amd64/kernel/drivers/media/rc/keymaps/rc-genius-tvgo-a11mce.ko, because No such file or directory

set_attributes: failed to set time on ./fsroot-vs/usr/lib/modules/6.1.0-29-2-amd64/kernel/drivers/media/rc/keymaps/rc-gotview7135.ko, because No such file or directory

set_attributes: failed to set time on ./fsroot-vs/usr/lib/modules/6.1.0-29-2-amd64/kernel/drivers/media/rc/keymaps/rc-hauppauge.ko, because No such file or directory

set_attributes: failed to set time on ./fsroot-vs/usr/lib/modules/6.1.0-29-2-amd64/kernel/drivers/media/rc/keymaps/rc-hisi-poplar.ko, because No such file or directory

set_attributes: failed to set time on ./fsroot-vs/usr/lib/modules/6.1.0-29-2-amd64/kernel/drivers/media/rc/keymaps/rc-hisi-tv-demo.ko, because No such file or directory

set_attributes: failed to set time on ./fsroot-vs/usr/lib/modules/6.1.0-29-2-amd64/kernel/drivers/media/rc/keymaps/rc-imon-mce.ko, because No such file or directory

set_attributes: failed to set time on ./fsroot-vs/usr/lib/modules/6.1.0-29-2-amd64/kernel/drivers/media/rc/keymaps/rc-imon-pad.ko, because No such file or directory

set_attributes: failed to set time on ./fsroot-vs/usr/lib/modules/6.1.0-29-2-amd64/kernel/drivers/media/rc/keymaps/rc-imon-rsc.ko, because No such file or directory

set_attributes: failed to set time on ./fsroot-vs/usr/lib/modules/6.1.0-29-2-amd64/kernel/drivers/media/rc/keymaps/rc-iodata-bctv7e.ko, because No such file or directory

set_attributes: failed to set time on ./fsroot-vs/usr/lib/modules/6.1.0-29-2-amd64/kernel/drivers/media/rc/keymaps/rc-it913x-v1.ko, because No such file or directory

set_attributes: failed to set time on ./fsroot-vs/usr/lib/modules/6.1.0-29-2-amd64/kernel/drivers/media/rc/keymaps/rc-it913x-v2.ko, because No such file or directory

set_attributes: failed to set time on ./fsroot-vs/usr/lib/modules/6.1.0-29-2-amd64/kernel/drivers/media/rc/keymaps/rc-kaiomy.ko, because No such file or directory

set_attributes: failed to set time on ./fsroot-vs/usr/lib/modules/6.1.0-29-2-amd64/kernel/drivers/media/rc/keymaps/rc-khadas.ko, because No such file or directory

set_attributes: failed to set time on ./fsroot-vs/usr/lib/modules/6.1.0-29-2-amd64/kernel/drivers/media/rc/keymaps/rc-khamsin.ko, because No such file or directory

set_attributes: failed to set time on ./fsroot-vs/usr/lib/modules/6.1.0-29-2-amd64/kernel/drivers/media/rc/keymaps/rc-kworld-315u.ko, because No such file or directory

set_attributes: failed to set time on ./fsroot-vs/usr/lib/modules/6.1.0-29-2-amd64/kernel/drivers/media/rc/keymaps/rc-kworld-pc150u.ko, because No such file or directory

set_attributes: failed to set time on ./fsroot-vs/usr/lib/modules/6.1.0-29-2-amd64/kernel/drivers/media/rc/keymaps/rc-kworld-plus-tv-analog.ko, because No such file or directory

set_attributes: failed to set time on ./fsroot-vs/usr/lib/modules/6.1.0-29-2-amd64/kernel/drivers/media/rc/keymaps/rc-leadtek-y04g0051.ko, because No such file or directory

set_attributes: failed to set time on ./fsroot-vs/usr/lib/modules/6.1.0-29-2-amd64/kernel/drivers/media/rc/keymaps/rc-lme2510.ko, because No such file or directory

set_attributes: failed to set time on ./fsroot-vs/usr/lib/modules/6.1.0-29-2-amd64/kernel/drivers/media/rc/keymaps/rc-manli.ko, because No such file or directory

set_attributes: failed to set time on ./fsroot-vs/usr/lib/modules/6.1.0-29-2-amd64/kernel/drivers/media/rc/keymaps/rc-mecool-kii-pro.ko, because No such file or directory

set_attributes: failed to set time on ./fsroot-vs/usr/lib/modules/6.1.0-29-2-amd64/kernel/drivers/media/rc/keymaps/rc-mecool-kiii-pro.ko, because No such file or directory

set_attributes: failed to set time on ./fsroot-vs/usr/lib/modules/6.1.0-29-2-amd64/kernel/drivers/media/rc/keymaps/rc-medion-x10-digitainer.ko, because No such file or directory

set_attributes: failed to set time on ./fsroot-vs/usr/lib/modules/6.1.0-29-2-amd64/kernel/drivers/media/rc/keymaps/rc-medion-x10-or2x.ko, because No such file or directory

set_attributes: failed to set time on ./fsroot-vs/usr/lib/modules/6.1.0-29-2-amd64/kernel/drivers/media/rc/keymaps/rc-medion-x10.ko, because No such file or directory

set_attributes: failed to set time on ./fsroot-vs/usr/lib/modules/6.1.0-29-2-amd64/kernel/drivers/media/rc/keymaps/rc-minix-neo.ko, because No such file or directory

set_attributes: failed to set time on ./fsroot-vs/usr/lib/modules/6.1.0-29-2-amd64/kernel/drivers/media/rc/keymaps/rc-msi-digivox-ii.ko, because No such file or directory

set_attributes: failed to set time on ./fsroot-vs/usr/lib/modules/6.1.0-29-2-amd64/kernel/drivers/media/rc/keymaps/rc-msi-digivox-iii.ko, because No such file or directory

set_attributes: failed to set time on ./fsroot-vs/usr/lib/modules/6.1.0-29-2-amd64/kernel/drivers/media/rc/keymaps/rc-msi-tvanywhere-plus.ko, because No such file or directory

set_attributes: failed to set time on ./fsroot-vs/usr/lib/modules/6.1.0-29-2-amd64/kernel/drivers/media/rc/keymaps/rc-msi-tvanywhere.ko, because No such file or directory

set_attributes: failed to set time on ./fsroot-vs/usr/lib/modules/6.1.0-29-2-amd64/kernel/drivers/media/rc/keymaps/rc-nebula.ko, because No such file or directory

set_attributes: failed to set time on ./fsroot-vs/usr/lib/modules/6.1.0-29-2-amd64/kernel/drivers/media/rc/keymaps/rc-nec-terratec-cinergy-xs.ko, because No such file or directory

set_attributes: failed to set time on ./fsroot-vs/usr/lib/modules/6.1.0-29-2-amd64/kernel/drivers/media/rc/keymaps/rc-norwood.ko, because No such file or directory

set_attributes: failed to set time on ./fsroot-vs/usr/lib/modules/6.1.0-29-2-amd64/kernel/drivers/media/rc/keymaps/rc-npgtech.ko, because No such file or directory

set_attributes: failed to set time on ./fsroot-vs/usr/lib/modules/6.1.0-29-2-amd64/kernel/drivers/media/rc/keymaps/rc-odroid.ko, because No such file or directory

set_attributes: failed to set time on ./fsroot-vs/usr/lib/modules/6.1.0-29-2-amd64/kernel/drivers/media/rc/keymaps/rc-pctv-sedna.ko, because No such file or directory

set_attributes: failed to set time on ./fsroot-vs/usr/lib/modules/6.1.0-29-2-amd64/kernel/drivers/media/rc/keymaps/rc-pine64.ko, because No such file or directory

set_attributes: failed to set time on ./fsroot-vs/usr/lib/modules/6.1.0-29-2-amd64/kernel/drivers/media/rc/keymaps/rc-pinnacle-color.ko, because No such file or directory

set_attributes: failed to set time on ./fsroot-vs/usr/lib/modules/6.1.0-29-2-amd64/kernel/drivers/media/rc/keymaps/rc-pinnacle-grey.ko, because No such file or directory

set_attributes: failed to set time on ./fsroot-vs/usr/lib/modules/6.1.0-29-2-amd64/kernel/drivers/media/rc/keymaps/rc-pinnacle-pctv-hd.ko, because No such file or directory

set_attributes: failed to set time on ./fsroot-vs/usr/lib/modules/6.1.0-29-2-amd64/kernel/drivers/media/rc/keymaps/rc-pixelview-002t.ko, because No such file or directory

set_attributes: failed to set time on ./fsroot-vs/usr/lib/modules/6.1.0-29-2-amd64/kernel/drivers/media/rc/keymaps/rc-pixelview-mk12.ko, because No such file or directory

set_attributes: failed to set time on ./fsroot-vs/usr/lib/modules/6.1.0-29-2-amd64/kernel/drivers/media/rc/keymaps/rc-pixelview-new.ko, because No such file or directory

set_attributes: failed to set time on ./fsroot-vs/usr/lib/modules/6.1.0-29-2-amd64/kernel/drivers/media/rc/keymaps/rc-pixelview.ko, because No such file or directory

set_attributes: failed to set time on ./fsroot-vs/usr/lib/modules/6.1.0-29-2-amd64/kernel/drivers/media/rc/keymaps/rc-powercolor-real-angel.ko, because No such file or directory

set_attributes: failed to set time on ./fsroot-vs/usr/lib/modules/6.1.0-29-2-amd64/kernel/drivers/media/rc/keymaps/rc-proteus-2309.ko, because No such file or directory

set_attributes: failed to set time on ./fsroot-vs/usr/lib/modules/6.1.0-29-2-amd64/kernel/drivers/media/rc/keymaps/rc-purpletv.ko, because No such file or directory

set_attributes: failed to set time on ./fsroot-vs/usr/lib/modules/6.1.0-29-2-amd64/kernel/drivers/media/rc/keymaps/rc-pv951.ko, because No such file or directory

set_attributes: failed to set time on ./fsroot-vs/usr/lib/modules/6.1.0-29-2-amd64/kernel/drivers/media/rc/keymaps/rc-rc6-mce.ko, because No such file or directory

set_attributes: failed to set time on ./fsroot-vs/usr/lib/modules/6.1.0-29-2-amd64/kernel/drivers/media/rc/keymaps/rc-real-audio-220-32-keys.ko, because No such file or directory

set_attributes: failed to set time on ./fsroot-vs/usr/lib/modules/6.1.0-29-2-amd64/kernel/drivers/media/rc/keymaps/rc-reddo.ko, because No such file or directory

set_attributes: failed to set time on ./fsroot-vs/usr/lib/modules/6.1.0-29-2-amd64/kernel/drivers/media/rc/keymaps/rc-snapstream-firefly.ko, because No such file or directory

set_attributes: failed to set time on ./fsroot-vs/usr/lib/modules/6.1.0-29-2-amd64/kernel/drivers/media/rc/keymaps/rc-streamzap.ko, because No such file or directory

set_attributes: failed to set time on ./fsroot-vs/usr/lib/modules/6.1.0-29-2-amd64/kernel/drivers/media/rc/keymaps/rc-su3000.ko, because No such file or directory

set_attributes: failed to set time on ./fsroot-vs/usr/lib/modules/6.1.0-29-2-amd64/kernel/drivers/media/rc/keymaps/rc-tanix-tx3mini.ko, because No such file or directory

set_attributes: failed to set time on ./fsroot-vs/usr/lib/modules/6.1.0-29-2-amd64/kernel/drivers/media/rc/keymaps/rc-tanix-tx5max.ko, because No such file or directory

set_attributes: failed to set time on ./fsroot-vs/usr/lib/modules/6.1.0-29-2-amd64/kernel/drivers/media/rc/keymaps/rc-tbs-nec.ko, because No such file or directory

set_attributes: failed to set time on ./fsroot-vs/usr/lib/modules/6.1.0-29-2-amd64/kernel/drivers/media/rc/keymaps/rc-technisat-ts35.ko, because No such file or directory

set_attributes: failed to set time on ./fsroot-vs/usr/lib/modules/6.1.0-29-2-amd64/kernel/drivers/media/rc/keymaps/rc-technisat-usb2.ko, because No such file or directory

set_attributes: failed to set time on ./fsroot-vs/usr/lib/modules/6.1.0-29-2-amd64/kernel/drivers/media/rc/keymaps/rc-terratec-cinergy-c-pci.ko, because No such file or directory

set_attributes: failed to set time on ./fsroot-vs/usr/lib/modules/6.1.0-29-2-amd64/kernel/drivers/media/rc/keymaps/rc-terratec-cinergy-s2-hd.ko, because No such file or directory

set_attributes: failed to set time on ./fsroot-vs/usr/lib/modules/6.1.0-29-2-amd64/kernel/drivers/media/rc/keymaps/rc-terratec-cinergy-xs.ko, because No such file or directory

set_attributes: failed to set time on ./fsroot-vs/usr/lib/modules/6.1.0-29-2-amd64/kernel/drivers/media/rc/keymaps/rc-terratec-slim-2.ko, because No such file or directory

set_attributes: failed to set time on ./fsroot-vs/usr/lib/modules/6.1.0-29-2-amd64/kernel/drivers/media/rc/keymaps/rc-terratec-slim.ko, because No such file or directory

set_attributes: failed to set time on ./fsroot-vs/usr/lib/modules/6.1.0-29-2-amd64/kernel/drivers/media/rc/keymaps/rc-tevii-nec.ko, because No such file or directory

set_attributes: failed to set time on ./fsroot-vs/usr/lib/modules/6.1.0-29-2-amd64/kernel/drivers/media/rc/keymaps/rc-tivo.ko, because No such file or directory

set_attributes: failed to set time on ./fsroot-vs/usr/lib/modules/6.1.0-29-2-amd64/kernel/drivers/media/rc/keymaps/rc-total-media-in-hand-02.ko, because No such file or directory

set_attributes: failed to set time on ./fsroot-vs/usr/lib/modules/6.1.0-29-2-amd64/kernel/drivers/media/rc/keymaps/rc-total-media-in-hand.ko, because No such file or directory

set_attributes: failed to set time on ./fsroot-vs/usr/lib/modules/6.1.0-29-2-amd64/kernel/drivers/media/rc/keymaps/rc-trekstor.ko, because No such file or directory

set_attributes: failed to set time on ./fsroot-vs/usr/lib/modules/6.1.0-29-2-amd64/kernel/drivers/media/rc/keymaps/rc-tt-1500.ko, because No such file or directory

set_attributes: failed to set time on ./fsroot-vs/usr/lib/modules/6.1.0-29-2-amd64/kernel/drivers/media/rc/keymaps/rc-twinhan-dtv-cab-ci.ko, because No such file or directory

set_attributes: failed to set time on ./fsroot-vs/usr/lib/modules/6.1.0-29-2-amd64/kernel/drivers/media/rc/keymaps/rc-twinhan1027.ko, because No such file or directory

set_attributes: failed to set time on ./fsroot-vs/usr/lib/modules/6.1.0-29-2-amd64/kernel/drivers/media/rc/keymaps/rc-vega-s9x.ko, because No such file or directory

set_attributes: failed to set time on ./fsroot-vs/usr/lib/modules/6.1.0-29-2-amd64/kernel/drivers/media/rc/keymaps/rc-videomate-m1f.ko, because No such file or directory

set_attributes: failed to set time on ./fsroot-vs/usr/lib/modules/6.1.0-29-2-amd64/kernel/drivers/media/rc/keymaps/rc-videomate-s350.ko, because No such file or directory

set_attributes: failed to set time on ./fsroot-vs/usr/lib/modules/6.1.0-29-2-amd64/kernel/drivers/media/rc/keymaps/rc-videomate-tv-pvr.ko, because No such file or directory

set_attributes: failed to set time on ./fsroot-vs/usr/lib/modules/6.1.0-29-2-amd64/kernel/drivers/media/rc/keymaps/rc-videostrong-kii-pro.ko, because No such file or directory

set_attributes: failed to set time on ./fsroot-vs/usr/lib/modules/6.1.0-29-2-amd64/kernel/drivers/media/rc/keymaps/rc-wetek-hub.ko, because No such file or directory

set_attributes: failed to set time on ./fsroot-vs/usr/lib/modules/6.1.0-29-2-amd64/kernel/drivers/media/rc/keymaps/rc-wetek-play2.ko, because No such file or directory

set_attributes: failed to set time on ./fsroot-vs/usr/lib/modules/6.1.0-29-2-amd64/kernel/drivers/media/rc/keymaps/rc-winfast-usbii-deluxe.ko, because No such file or directory

set_attributes: failed to set time on ./fsroot-vs/usr/lib/modules/6.1.0-29-2-amd64/kernel/drivers/media/rc/keymaps/rc-winfast.ko, because No such file or directory

set_attributes: failed to set time on ./fsroot-vs/usr/lib/modules/6.1.0-29-2-amd64/kernel/drivers/media/rc/keymaps/rc-x96max.ko, because No such file or directory

set_attributes: failed to set time on ./fsroot-vs/usr/lib/modules/6.1.0-29-2-amd64/kernel/drivers/media/rc/keymaps/rc-xbox-360.ko, because No such file or directory

set_attributes: failed to set time on ./fsroot-vs/usr/lib/modules/6.1.0-29-2-amd64/kernel/drivers/media/rc/keymaps/rc-xbox-dvd.ko, because No such file or directory

set_attributes: failed to set time on ./fsroot-vs/usr/lib/modules/6.1.0-29-2-amd64/kernel/drivers/media/rc/keymaps/rc-zx-irdec.ko, because No such file or directory

set_attributes: failed to set time on ./fsroot-vs/usr/lib/modules/6.1.0-29-2-amd64/kernel/drivers/media/rc/keymaps, because No such file or directory

set_attributes: failed to set time on ./fsroot-vs/usr/lib/modules/6.1.0-29-2-amd64/kernel/drivers/media/rc/mceusb.ko, because No such file or directory

set_attributes: failed to set time on ./fsroot-vs/usr/lib/modules/6.1.0-29-2-amd64/kernel/drivers/media/rc/nuvoton-cir.ko, because No such file or directory

set_attributes: failed to set time on ./fsroot-vs/usr/lib/modules/6.1.0-29-2-amd64/kernel/drivers/media/rc/rc-core.ko, because No such file or directory

set_attributes: failed to set time on ./fsroot-vs/usr/lib/modules/6.1.0-29-2-amd64/kernel/drivers/media/rc/rc-loopback.ko, because No such file or directory

set_attributes: failed to set time on ./fsroot-vs/usr/lib/modules/6.1.0-29-2-amd64/kernel/drivers/media/rc/redrat3.ko, because No such file or directory

set_attributes: failed to set time on ./fsroot-vs/usr/lib/modules/6.1.0-29-2-amd64/kernel/drivers/media/rc/serial_ir.ko, because No such file or directory

set_attributes: failed to set time on ./fsroot-vs/usr/lib/modules/6.1.0-29-2-amd64/kernel/drivers/media/rc/streamzap.ko, because No such file or directory

set_attributes: failed to set time on ./fsroot-vs/usr/lib/modules/6.1.0-29-2-amd64/kernel/drivers/media/rc/ttusbir.ko, because No such file or directory

set_attributes: failed to set time on ./fsroot-vs/usr/lib/modules/6.1.0-29-2-amd64/kernel/drivers/media/rc/winbond-cir.ko, because No such file or directory

set_attributes: failed to set time on ./fsroot-vs/usr/lib/modules/6.1.0-29-2-amd64/kernel/drivers/media/rc, because No such file or directory

set_attributes: failed to set time on ./fsroot-vs/usr/lib/modules/6.1.0-29-2-amd64/kernel/drivers/media, because No such file or directory

set_attributes: failed to set time on ./fsroot-vs/usr/lib/modules/6.1.0-29-2-amd64/kernel/drivers/memstick/core/memstick.ko, because No such file or directory

set_attributes: failed to set time on ./fsroot-vs/usr/lib/modules/6.1.0-29-2-amd64/kernel/drivers/memstick/core/mspro_block.ko, because No such file or directory

set_attributes: failed to set time on ./fsroot-vs/usr/lib/modules/6.1.0-29-2-amd64/kernel/drivers/memstick/core, because No such file or directory

set_attributes: failed to set time on ./fsroot-vs/usr/lib/modules/6.1.0-29-2-amd64/kernel/drivers/memstick/host/jmb38x_ms.ko, because No such file or directory

set_attributes: failed to set time on ./fsroot-vs/usr/lib/modules/6.1.0-29-2-amd64/kernel/drivers/memstick/host/r592.ko, because No such file or directory

set_attributes: failed to set time on ./fsroot-vs/usr/lib/modules/6.1.0-29-2-amd64/kernel/drivers/memstick/host/rtsx_pci_ms.ko, because No such file or directory

set_attributes: failed to set time on ./fsroot-vs/usr/lib/modules/6.1.0-29-2-amd64/kernel/drivers/memstick/host/rtsx_usb_ms.ko, because No such file or directory

set_attributes: failed to set time on ./fsroot-vs/usr/lib/modules/6.1.0-29-2-amd64/kernel/drivers/memstick/host/tifm_ms.ko, because No such file or directory

set_attributes: failed to set time on ./fsroot-vs/usr/lib/modules/6.1.0-29-2-amd64/kernel/drivers/memstick/host, because No such file or directory

set_attributes: failed to set time on ./fsroot-vs/usr/lib/modules/6.1.0-29-2-amd64/kernel/drivers/memstick, because No such file or directory

set_attributes: failed to set time on ./fsroot-vs/usr/lib/modules/6.1.0-29-2-amd64/kernel/drivers/message/fusion/mptbase.ko, because No such file or directory

set_attributes: failed to set time on ./fsroot-vs/usr/lib/modules/6.1.0-29-2-amd64/kernel/drivers/message/fusion/mptctl.ko, because No such file or directory

set_attributes: failed to set time on ./fsroot-vs/usr/lib/modules/6.1.0-29-2-amd64/kernel/drivers/message/fusion/mptfc.ko, because No such file or directory

set_attributes: failed to set time on ./fsroot-vs/usr/lib/modules/6.1.0-29-2-amd64/kernel/drivers/message/fusion/mptlan.ko, because No such file or directory

set_attributes: failed to set time on ./fsroot-vs/usr/lib/modules/6.1.0-29-2-amd64/kernel/drivers/message/fusion/mptsas.ko, because No such file or directory

set_attributes: failed to set time on ./fsroot-vs/usr/lib/modules/6.1.0-29-2-amd64/kernel/drivers/message/fusion/mptscsih.ko, because No such file or directory

set_attributes: failed to set time on ./fsroot-vs/usr/lib/modules/6.1.0-29-2-amd64/kernel/drivers/message/fusion/mptspi.ko, because No such file or directory

set_attributes: failed to set time on ./fsroot-vs/usr/lib/modules/6.1.0-29-2-amd64/kernel/drivers/message/fusion, because No such file or directory

set_attributes: failed to set time on ./fsroot-vs/usr/lib/modules/6.1.0-29-2-amd64/kernel/drivers/message, because No such file or directory

set_attributes: failed to set time on ./fsroot-vs/usr/lib/modules/6.1.0-29-2-amd64/kernel/drivers/mfd/axp20x-i2c.ko, because No such file or directory

set_attributes: failed to set time on ./fsroot-vs/usr/lib/modules/6.1.0-29-2-amd64/kernel/drivers/mfd/axp20x.ko, because No such file or directory

set_attributes: failed to set time on ./fsroot-vs/usr/lib/modules/6.1.0-29-2-amd64/kernel/drivers/mfd/cros_ec_dev.ko, because No such file or directory

set_attributes: failed to set time on ./fsroot-vs/usr/lib/modules/6.1.0-29-2-amd64/kernel/drivers/mfd/intel-lpss-acpi.ko, because No such file or directory

set_attributes: failed to set time on ./fsroot-vs/usr/lib/modules/6.1.0-29-2-amd64/kernel/drivers/mfd/intel_pmc_bxt.ko, because No such file or directory

set_attributes: failed to set time on ./fsroot-vs/usr/lib/modules/6.1.0-29-2-amd64/kernel/drivers/mfd/intel_soc_pmic_bxtwc.ko, because No such file or directory

set_attributes: failed to set time on ./fsroot-vs/usr/lib/modules/6.1.0-29-2-amd64/kernel/drivers/mfd/kempld-core.ko, because No such file or directory

set_attributes: failed to set time on ./fsroot-vs/usr/lib/modules/6.1.0-29-2-amd64/kernel/drivers/mfd/lpc_ich.ko, because No such file or directory

set_attributes: failed to set time on ./fsroot-vs/usr/lib/modules/6.1.0-29-2-amd64/kernel/drivers/mfd/lpc_sch.ko, because No such file or directory

set_attributes: failed to set time on ./fsroot-vs/usr/lib/modules/6.1.0-29-2-amd64/kernel/drivers/mfd/menf21bmc.ko, because No such file or directory

set_attributes: failed to set time on ./fsroot-vs/usr/lib/modules/6.1.0-29-2-amd64/kernel/drivers/mfd/viperboard.ko, because No such file or directory

set_attributes: failed to set time on ./fsroot-vs/usr/lib/modules/6.1.0-29-2-amd64/kernel/drivers/mfd, because No such file or directory

set_attributes: failed to set time on ./fsroot-vs/usr/lib/modules/6.1.0-29-2-amd64/kernel/drivers/misc/ad525x_dpot-i2c.ko, because No such file or directory

set_attributes: failed to set time on ./fsroot-vs/usr/lib/modules/6.1.0-29-2-amd64/kernel/drivers/misc/ad525x_dpot-spi.ko, because No such file or directory

set_attributes: failed to set time on ./fsroot-vs/usr/lib/modules/6.1.0-29-2-amd64/kernel/drivers/misc/ad525x_dpot.ko, because No such file or directory

set_attributes: failed to set time on ./fsroot-vs/usr/lib/modules/6.1.0-29-2-amd64/kernel/drivers/misc/altera-stapl/altera-stapl.ko, because No such file or directory

set_attributes: failed to set time on ./fsroot-vs/usr/lib/modules/6.1.0-29-2-amd64/kernel/drivers/misc/altera-stapl, because No such file or directory

set_attributes: failed to set time on ./fsroot-vs/usr/lib/modules/6.1.0-29-2-amd64/kernel/drivers/misc/apds9802als.ko, because No such file or directory

set_attributes: failed to set time on ./fsroot-vs/usr/lib/modules/6.1.0-29-2-amd64/kernel/drivers/misc/apds990x.ko, because No such file or directory

set_attributes: failed to set time on ./fsroot-vs/usr/lib/modules/6.1.0-29-2-amd64/kernel/drivers/misc/bh1770glc.ko, because No such file or directory

set_attributes: failed to set time on ./fsroot-vs/usr/lib/modules/6.1.0-29-2-amd64/kernel/drivers/misc/c2port/c2port-duramar2150.ko, because No such file or directory

set_attributes: failed to set time on ./fsroot-vs/usr/lib/modules/6.1.0-29-2-amd64/kernel/drivers/misc/c2port/core.ko, because No such file or directory

set_attributes: failed to set time on ./fsroot-vs/usr/lib/modules/6.1.0-29-2-amd64/kernel/drivers/misc/c2port, because No such file or directory

set_attributes: failed to set time on ./fsroot-vs/usr/lib/modules/6.1.0-29-2-amd64/kernel/drivers/misc/cardreader/rtsx_pci.ko, because No such file or directory

set_attributes: failed to set time on ./fsroot-vs/usr/lib/modules/6.1.0-29-2-amd64/kernel/drivers/misc/cardreader/rtsx_usb.ko, because No such file or directory

set_attributes: failed to set time on ./fsroot-vs/usr/lib/modules/6.1.0-29-2-amd64/kernel/drivers/misc/cardreader, because No such file or directory

set_attributes: failed to set time on ./fsroot-vs/usr/lib/modules/6.1.0-29-2-amd64/kernel/drivers/misc/cb710/cb710.ko, because No such file or directory

set_attributes: failed to set time on ./fsroot-vs/usr/lib/modules/6.1.0-29-2-amd64/kernel/drivers/misc/cb710, because No such file or directory

set_attributes: failed to set time on ./fsroot-vs/usr/lib/modules/6.1.0-29-2-amd64/kernel/drivers/misc/ds1682.ko, because No such file or directory

set_attributes: failed to set time on ./fsroot-vs/usr/lib/modules/6.1.0-29-2-amd64/kernel/drivers/misc/eeprom/at24.ko, because No such file or directory

set_attributes: failed to set time on ./fsroot-vs/usr/lib/modules/6.1.0-29-2-amd64/kernel/drivers/misc/eeprom/at25.ko, because No such file or directory

set_attributes: failed to set time on ./fsroot-vs/usr/lib/modules/6.1.0-29-2-amd64/kernel/drivers/misc/eeprom/ee1004.ko, because No such file or directory

set_attributes: failed to set time on ./fsroot-vs/usr/lib/modules/6.1.0-29-2-amd64/kernel/drivers/misc/eeprom/eeprom.ko, because No such file or directory

set_attributes: failed to set time on ./fsroot-vs/usr/lib/modules/6.1.0-29-2-amd64/kernel/drivers/misc/eeprom/eeprom_93cx6.ko, because No such file or directory

set_attributes: failed to set time on ./fsroot-vs/usr/lib/modules/6.1.0-29-2-amd64/kernel/drivers/misc/eeprom/max6875.ko, because No such file or directory

set_attributes: failed to set time on ./fsroot-vs/usr/lib/modules/6.1.0-29-2-amd64/kernel/drivers/misc/eeprom/optoe.ko, because No such file or directory

set_attributes: failed to set time on ./fsroot-vs/usr/lib/modules/6.1.0-29-2-amd64/kernel/drivers/misc/eeprom/sff_8436_eeprom.ko, because No such file or directory

set_attributes: failed to set time on ./fsroot-vs/usr/lib/modules/6.1.0-29-2-amd64/kernel/drivers/misc/eeprom, because No such file or directory

set_attributes: failed to set time on ./fsroot-vs/usr/lib/modules/6.1.0-29-2-amd64/kernel/drivers/misc/enclosure.ko, because No such file or directory

set_attributes: failed to set time on ./fsroot-vs/usr/lib/modules/6.1.0-29-2-amd64/kernel/drivers/misc/hmc6352.ko, because No such file or directory

set_attributes: failed to set time on ./fsroot-vs/usr/lib/modules/6.1.0-29-2-amd64/kernel/drivers/misc/hpilo.ko, because No such file or directory

set_attributes: failed to set time on ./fsroot-vs/usr/lib/modules/6.1.0-29-2-amd64/kernel/drivers/misc/ibmasm/ibmasm.ko, because No such file or directory

set_attributes: failed to set time on ./fsroot-vs/usr/lib/modules/6.1.0-29-2-amd64/kernel/drivers/misc/ibmasm, because No such file or directory

set_attributes: failed to set time on ./fsroot-vs/usr/lib/modules/6.1.0-29-2-amd64/kernel/drivers/misc/ics932s401.ko, because No such file or directory

set_attributes: failed to set time on ./fsroot-vs/usr/lib/modules/6.1.0-29-2-amd64/kernel/drivers/misc/isl29003.ko, because No such file or directory

set_attributes: failed to set time on ./fsroot-vs/usr/lib/modules/6.1.0-29-2-amd64/kernel/drivers/misc/isl29020.ko, because No such file or directory

set_attributes: failed to set time on ./fsroot-vs/usr/lib/modules/6.1.0-29-2-amd64/kernel/drivers/misc/lis3lv02d/lis3lv02d.ko, because No such file or directory

set_attributes: failed to set time on ./fsroot-vs/usr/lib/modules/6.1.0-29-2-amd64/kernel/drivers/misc/lis3lv02d/lis3lv02d_i2c.ko, because No such file or directory

set_attributes: failed to set time on ./fsroot-vs/usr/lib/modules/6.1.0-29-2-amd64/kernel/drivers/misc/lis3lv02d, because No such file or directory

set_attributes: failed to set time on ./fsroot-vs/usr/lib/modules/6.1.0-29-2-amd64/kernel/drivers/misc/mei/mei-me.ko, because No such file or directory

set_attributes: failed to set time on ./fsroot-vs/usr/lib/modules/6.1.0-29-2-amd64/kernel/drivers/misc/mei/mei-txe.ko, because No such file or directory

set_attributes: failed to set time on ./fsroot-vs/usr/lib/modules/6.1.0-29-2-amd64/kernel/drivers/misc/mei/mei.ko, because No such file or directory

set_attributes: failed to set time on ./fsroot-vs/usr/lib/modules/6.1.0-29-2-amd64/kernel/drivers/misc/mei, because No such file or directory

set_attributes: failed to set time on ./fsroot-vs/usr/lib/modules/6.1.0-29-2-amd64/kernel/drivers/misc/phantom.ko, because No such file or directory

set_attributes: failed to set time on ./fsroot-vs/usr/lib/modules/6.1.0-29-2-amd64/kernel/drivers/misc/pvpanic/pvpanic-mmio.ko, because No such file or directory

set_attributes: failed to set time on ./fsroot-vs/usr/lib/modules/6.1.0-29-2-amd64/kernel/drivers/misc/pvpanic/pvpanic-pci.ko, because No such file or directory

set_attributes: failed to set time on ./fsroot-vs/usr/lib/modules/6.1.0-29-2-amd64/kernel/drivers/misc/pvpanic/pvpanic.ko, because No such file or directory

set_attributes: failed to set time on ./fsroot-vs/usr/lib/modules/6.1.0-29-2-amd64/kernel/drivers/misc/pvpanic, because No such file or directory

set_attributes: failed to set time on ./fsroot-vs/usr/lib/modules/6.1.0-29-2-amd64/kernel/drivers/misc/tifm_7xx1.ko, because No such file or directory

set_attributes: failed to set time on ./fsroot-vs/usr/lib/modules/6.1.0-29-2-amd64/kernel/drivers/misc/tifm_core.ko, because No such file or directory

set_attributes: failed to set time on ./fsroot-vs/usr/lib/modules/6.1.0-29-2-amd64/kernel/drivers/misc/tsl2550.ko, because No such file or directory

set_attributes: failed to set time on ./fsroot-vs/usr/lib/modules/6.1.0-29-2-amd64/kernel/drivers/misc/vmw_balloon.ko, because No such file or directory

set_attributes: failed to set time on ./fsroot-vs/usr/lib/modules/6.1.0-29-2-amd64/kernel/drivers/misc/vmw_vmci/vmw_vmci.ko, because No such file or directory

set_attributes: failed to set time on ./fsroot-vs/usr/lib/modules/6.1.0-29-2-amd64/kernel/drivers/misc/vmw_vmci, because No such file or directory

set_attributes: failed to set time on ./fsroot-vs/usr/lib/modules/6.1.0-29-2-amd64/kernel/drivers/misc, because No such file or directory

set_attributes: failed to set time on ./fsroot-vs/usr/lib/modules/6.1.0-29-2-amd64/kernel/drivers/mmc/core/mmc_block.ko, because No such file or directory

set_attributes: failed to set time on ./fsroot-vs/usr/lib/modules/6.1.0-29-2-amd64/kernel/drivers/mmc/core/mmc_core.ko, because No such file or directory

set_attributes: failed to set time on ./fsroot-vs/usr/lib/modules/6.1.0-29-2-amd64/kernel/drivers/mmc/core/pwrseq_emmc.ko, because No such file or directory

set_attributes: failed to set time on ./fsroot-vs/usr/lib/modules/6.1.0-29-2-amd64/kernel/drivers/mmc/core/pwrseq_simple.ko, because No such file or directory

set_attributes: failed to set time on ./fsroot-vs/usr/lib/modules/6.1.0-29-2-amd64/kernel/drivers/mmc/core/sdio_uart.ko, because No such file or directory

set_attributes: failed to set time on ./fsroot-vs/usr/lib/modules/6.1.0-29-2-amd64/kernel/drivers/mmc/core, because No such file or directory

set_attributes: failed to set time on ./fsroot-vs/usr/lib/modules/6.1.0-29-2-amd64/kernel/drivers/mmc/host/cb710-mmc.ko, because No such file or directory

set_attributes: failed to set time on ./fsroot-vs/usr/lib/modules/6.1.0-29-2-amd64/kernel/drivers/mmc/host/cqhci.ko, because No such file or directory

set_attributes: failed to set time on ./fsroot-vs/usr/lib/modules/6.1.0-29-2-amd64/kernel/drivers/mmc/host/rtsx_pci_sdmmc.ko, because No such file or directory

set_attributes: failed to set time on ./fsroot-vs/usr/lib/modules/6.1.0-29-2-amd64/kernel/drivers/mmc/host/rtsx_usb_sdmmc.ko, because No such file or directory

set_attributes: failed to set time on ./fsroot-vs/usr/lib/modules/6.1.0-29-2-amd64/kernel/drivers/mmc/host/sdhci-acpi.ko, because No such file or directory

set_attributes: failed to set time on ./fsroot-vs/usr/lib/modules/6.1.0-29-2-amd64/kernel/drivers/mmc/host/sdhci-pci.ko, because No such file or directory

set_attributes: failed to set time on ./fsroot-vs/usr/lib/modules/6.1.0-29-2-amd64/kernel/drivers/mmc/host/sdhci.ko, because No such file or directory

set_attributes: failed to set time on ./fsroot-vs/usr/lib/modules/6.1.0-29-2-amd64/kernel/drivers/mmc/host/sdricoh_cs.ko, because No such file or directory

set_attributes: failed to set time on ./fsroot-vs/usr/lib/modules/6.1.0-29-2-amd64/kernel/drivers/mmc/host/tifm_sd.ko, because No such file or directory

set_attributes: failed to set time on ./fsroot-vs/usr/lib/modules/6.1.0-29-2-amd64/kernel/drivers/mmc/host/toshsd.ko, because No such file or directory

set_attributes: failed to set time on ./fsroot-vs/usr/lib/modules/6.1.0-29-2-amd64/kernel/drivers/mmc/host/ushc.ko, because No such file or directory

set_attributes: failed to set time on ./fsroot-vs/usr/lib/modules/6.1.0-29-2-amd64/kernel/drivers/mmc/host/via-sdmmc.ko, because No such file or directory

set_attributes: failed to set time on ./fsroot-vs/usr/lib/modules/6.1.0-29-2-amd64/kernel/drivers/mmc/host/vub300.ko, because No such file or directory

set_attributes: failed to set time on ./fsroot-vs/usr/lib/modules/6.1.0-29-2-amd64/kernel/drivers/mmc/host/wbsd.ko, because No such file or directory

set_attributes: failed to set time on ./fsroot-vs/usr/lib/modules/6.1.0-29-2-amd64/kernel/drivers/mmc/host, because No such file or directory

set_attributes: failed to set time on ./fsroot-vs/usr/lib/modules/6.1.0-29-2-amd64/kernel/drivers/mmc, because No such file or directory

set_attributes: failed to set time on ./fsroot-vs/usr/lib/modules/6.1.0-29-2-amd64/kernel/drivers/mtd/chips/cfi_cmdset_0001.ko, because No such file or directory

set_attributes: failed to set time on ./fsroot-vs/usr/lib/modules/6.1.0-29-2-amd64/kernel/drivers/mtd/chips/cfi_cmdset_0002.ko, because No such file or directory

set_attributes: failed to set time on ./fsroot-vs/usr/lib/modules/6.1.0-29-2-amd64/kernel/drivers/mtd/chips/cfi_cmdset_0020.ko, because No such file or directory

set_attributes: failed to set time on ./fsroot-vs/usr/lib/modules/6.1.0-29-2-amd64/kernel/drivers/mtd/chips/cfi_probe.ko, because No such file or directory

set_attributes: failed to set time on ./fsroot-vs/usr/lib/modules/6.1.0-29-2-amd64/kernel/drivers/mtd/chips/cfi_util.ko, because No such file or directory

set_attributes: failed to set time on ./fsroot-vs/usr/lib/modules/6.1.0-29-2-amd64/kernel/drivers/mtd/chips/chipreg.ko, because No such file or directory

set_attributes: failed to set time on ./fsroot-vs/usr/lib/modules/6.1.0-29-2-amd64/kernel/drivers/mtd/chips/gen_probe.ko, because No such file or directory

set_attributes: failed to set time on ./fsroot-vs/usr/lib/modules/6.1.0-29-2-amd64/kernel/drivers/mtd/chips/jedec_probe.ko, because No such file or directory

set_attributes: failed to set time on ./fsroot-vs/usr/lib/modules/6.1.0-29-2-amd64/kernel/drivers/mtd/chips/map_absent.ko, because No such file or directory

set_attributes: failed to set time on ./fsroot-vs/usr/lib/modules/6.1.0-29-2-amd64/kernel/drivers/mtd/chips/map_ram.ko, because No such file or directory

set_attributes: failed to set time on ./fsroot-vs/usr/lib/modules/6.1.0-29-2-amd64/kernel/drivers/mtd/chips/map_rom.ko, because No such file or directory

set_attributes: failed to set time on ./fsroot-vs/usr/lib/modules/6.1.0-29-2-amd64/kernel/drivers/mtd/chips, because No such file or directory

set_attributes: failed to set time on ./fsroot-vs/usr/lib/modules/6.1.0-29-2-amd64/kernel/drivers/mtd/devices/block2mtd.ko, because No such file or directory

set_attributes: failed to set time on ./fsroot-vs/usr/lib/modules/6.1.0-29-2-amd64/kernel/drivers/mtd/devices/mtd_dataflash.ko, because No such file or directory

set_attributes: failed to set time on ./fsroot-vs/usr/lib/modules/6.1.0-29-2-amd64/kernel/drivers/mtd/devices/mtdram.ko, because No such file or directory

set_attributes: failed to set time on ./fsroot-vs/usr/lib/modules/6.1.0-29-2-amd64/kernel/drivers/mtd/devices/phram.ko, because No such file or directory

set_attributes: failed to set time on ./fsroot-vs/usr/lib/modules/6.1.0-29-2-amd64/kernel/drivers/mtd/devices/slram.ko, because No such file or directory

set_attributes: failed to set time on ./fsroot-vs/usr/lib/modules/6.1.0-29-2-amd64/kernel/drivers/mtd/devices/sst25l.ko, because No such file or directory

set_attributes: failed to set time on ./fsroot-vs/usr/lib/modules/6.1.0-29-2-amd64/kernel/drivers/mtd/devices, because No such file or directory

set_attributes: failed to set time on ./fsroot-vs/usr/lib/modules/6.1.0-29-2-amd64/kernel/drivers/mtd/ftl.ko, because No such file or directory

set_attributes: failed to set time on ./fsroot-vs/usr/lib/modules/6.1.0-29-2-amd64/kernel/drivers/mtd/inftl.ko, because No such file or directory

set_attributes: failed to set time on ./fsroot-vs/usr/lib/modules/6.1.0-29-2-amd64/kernel/drivers/mtd/lpddr/lpddr_cmds.ko, because No such file or directory

set_attributes: failed to set time on ./fsroot-vs/usr/lib/modules/6.1.0-29-2-amd64/kernel/drivers/mtd/lpddr/qinfo_probe.ko, because No such file or directory

set_attributes: failed to set time on ./fsroot-vs/usr/lib/modules/6.1.0-29-2-amd64/kernel/drivers/mtd/lpddr, because No such file or directory

set_attributes: failed to set time on ./fsroot-vs/usr/lib/modules/6.1.0-29-2-amd64/kernel/drivers/mtd/maps/intel_vr_nor.ko, because No such file or directory

set_attributes: failed to set time on ./fsroot-vs/usr/lib/modules/6.1.0-29-2-amd64/kernel/drivers/mtd/maps/map_funcs.ko, because No such file or directory

set_attributes: failed to set time on ./fsroot-vs/usr/lib/modules/6.1.0-29-2-amd64/kernel/drivers/mtd/maps/nettel.ko, because No such file or directory

set_attributes: failed to set time on ./fsroot-vs/usr/lib/modules/6.1.0-29-2-amd64/kernel/drivers/mtd/maps/pci.ko, because No such file or directory

set_attributes: failed to set time on ./fsroot-vs/usr/lib/modules/6.1.0-29-2-amd64/kernel/drivers/mtd/maps/pcmciamtd.ko, because No such file or directory

set_attributes: failed to set time on ./fsroot-vs/usr/lib/modules/6.1.0-29-2-amd64/kernel/drivers/mtd/maps/physmap.ko, because No such file or directory

set_attributes: failed to set time on ./fsroot-vs/usr/lib/modules/6.1.0-29-2-amd64/kernel/drivers/mtd/maps/plat-ram.ko, because No such file or directory

set_attributes: failed to set time on ./fsroot-vs/usr/lib/modules/6.1.0-29-2-amd64/kernel/drivers/mtd/maps/sbc_gxx.ko, because No such file or directory

set_attributes: failed to set time on ./fsroot-vs/usr/lib/modules/6.1.0-29-2-amd64/kernel/drivers/mtd/maps, because No such file or directory

set_attributes: failed to set time on ./fsroot-vs/usr/lib/modules/6.1.0-29-2-amd64/kernel/drivers/mtd/mtd.ko, because No such file or directory

set_attributes: failed to set time on ./fsroot-vs/usr/lib/modules/6.1.0-29-2-amd64/kernel/drivers/mtd/mtd_blkdevs.ko, because No such file or directory

set_attributes: failed to set time on ./fsroot-vs/usr/lib/modules/6.1.0-29-2-amd64/kernel/drivers/mtd/mtdblock.ko, because No such file or directory

set_attributes: failed to set time on ./fsroot-vs/usr/lib/modules/6.1.0-29-2-amd64/kernel/drivers/mtd/mtdblock_ro.ko, because No such file or directory

set_attributes: failed to set time on ./fsroot-vs/usr/lib/modules/6.1.0-29-2-amd64/kernel/drivers/mtd/mtdoops.ko, because No such file or directory

set_attributes: failed to set time on ./fsroot-vs/usr/lib/modules/6.1.0-29-2-amd64/kernel/drivers/mtd/mtdswap.ko, because No such file or directory

set_attributes: failed to set time on ./fsroot-vs/usr/lib/modules/6.1.0-29-2-amd64/kernel/drivers/mtd/nand/nandcore.ko, because No such file or directory

set_attributes: failed to set time on ./fsroot-vs/usr/lib/modules/6.1.0-29-2-amd64/kernel/drivers/mtd/nand/onenand/onenand.ko, because No such file or directory

set_attributes: failed to set time on ./fsroot-vs/usr/lib/modules/6.1.0-29-2-amd64/kernel/drivers/mtd/nand/onenand, because No such file or directory

set_attributes: failed to set time on ./fsroot-vs/usr/lib/modules/6.1.0-29-2-amd64/kernel/drivers/mtd/nand/raw/cafe_nand.ko, because No such file or directory

set_attributes: failed to set time on ./fsroot-vs/usr/lib/modules/6.1.0-29-2-amd64/kernel/drivers/mtd/nand/raw/diskonchip.ko, because No such file or directory

set_attributes: failed to set time on ./fsroot-vs/usr/lib/modules/6.1.0-29-2-amd64/kernel/drivers/mtd/nand/raw/nand.ko, because No such file or directory

set_attributes: failed to set time on ./fsroot-vs/usr/lib/modules/6.1.0-29-2-amd64/kernel/drivers/mtd/nand/raw/nandsim.ko, because No such file or directory

set_attributes: failed to set time on ./fsroot-vs/usr/lib/modules/6.1.0-29-2-amd64/kernel/drivers/mtd/nand/raw/r852.ko, because No such file or directory

set_attributes: failed to set time on ./fsroot-vs/usr/lib/modules/6.1.0-29-2-amd64/kernel/drivers/mtd/nand/raw/sm_common.ko, because No such file or directory

set_attributes: failed to set time on ./fsroot-vs/usr/lib/modules/6.1.0-29-2-amd64/kernel/drivers/mtd/nand/raw, because No such file or directory

set_attributes: failed to set time on ./fsroot-vs/usr/lib/modules/6.1.0-29-2-amd64/kernel/drivers/mtd/nand, because No such file or directory

set_attributes: failed to set time on ./fsroot-vs/usr/lib/modules/6.1.0-29-2-amd64/kernel/drivers/mtd/nftl.ko, because No such file or directory

set_attributes: failed to set time on ./fsroot-vs/usr/lib/modules/6.1.0-29-2-amd64/kernel/drivers/mtd/parsers/ar7part.ko, because No such file or directory

set_attributes: failed to set time on ./fsroot-vs/usr/lib/modules/6.1.0-29-2-amd64/kernel/drivers/mtd/parsers/ofpart.ko, because No such file or directory

set_attributes: failed to set time on ./fsroot-vs/usr/lib/modules/6.1.0-29-2-amd64/kernel/drivers/mtd/parsers/redboot.ko, because No such file or directory

set_attributes: failed to set time on ./fsroot-vs/usr/lib/modules/6.1.0-29-2-amd64/kernel/drivers/mtd/parsers, because No such file or directory

set_attributes: failed to set time on ./fsroot-vs/usr/lib/modules/6.1.0-29-2-amd64/kernel/drivers/mtd/rfd_ftl.ko, because No such file or directory

set_attributes: failed to set time on ./fsroot-vs/usr/lib/modules/6.1.0-29-2-amd64/kernel/drivers/mtd/spi-nor/spi-nor.ko, because No such file or directory

set_attributes: failed to set time on ./fsroot-vs/usr/lib/modules/6.1.0-29-2-amd64/kernel/drivers/mtd/spi-nor, because No such file or directory

set_attributes: failed to set time on ./fsroot-vs/usr/lib/modules/6.1.0-29-2-amd64/kernel/drivers/mtd/ssfdc.ko, because No such file or directory

set_attributes: failed to set time on ./fsroot-vs/usr/lib/modules/6.1.0-29-2-amd64/kernel/drivers/mtd/ubi/ubi.ko, because No such file or directory

set_attributes: failed to set time on ./fsroot-vs/usr/lib/modules/6.1.0-29-2-amd64/kernel/drivers/mtd/ubi, because No such file or directory

set_attributes: failed to set time on ./fsroot-vs/usr/lib/modules/6.1.0-29-2-amd64/kernel/drivers/mtd, because No such file or directory

set_attributes: failed to set time on ./fsroot-vs/usr/lib/modules/6.1.0-29-2-amd64/kernel/drivers/net/appletalk/ipddp.ko, because No such file or directory

set_attributes: failed to set time on ./fsroot-vs/usr/lib/modules/6.1.0-29-2-amd64/kernel/drivers/net/appletalk, because No such file or directory

set_attributes: failed to set time on ./fsroot-vs/usr/lib/modules/6.1.0-29-2-amd64/kernel/drivers/net/arcnet/arc-rawmode.ko, because No such file or directory

set_attributes: failed to set time on ./fsroot-vs/usr/lib/modules/6.1.0-29-2-amd64/kernel/drivers/net/arcnet/arc-rimi.ko, because No such file or directory

set_attributes: failed to set time on ./fsroot-vs/usr/lib/modules/6.1.0-29-2-amd64/kernel/drivers/net/arcnet/arcnet.ko, because No such file or directory

set_attributes: failed to set time on ./fsroot-vs/usr/lib/modules/6.1.0-29-2-amd64/kernel/drivers/net/arcnet/capmode.ko, because No such file or directory

set_attributes: failed to set time on ./fsroot-vs/usr/lib/modules/6.1.0-29-2-amd64/kernel/drivers/net/arcnet/com20020-pci.ko, because No such file or directory

set_attributes: failed to set time on ./fsroot-vs/usr/lib/modules/6.1.0-29-2-amd64/kernel/drivers/net/arcnet/com20020.ko, because No such file or directory

set_attributes: failed to set time on ./fsroot-vs/usr/lib/modules/6.1.0-29-2-amd64/kernel/drivers/net/arcnet/com20020_cs.ko, because No such file or directory

set_attributes: failed to set time on ./fsroot-vs/usr/lib/modules/6.1.0-29-2-amd64/kernel/drivers/net/arcnet/com90io.ko, because No such file or directory

set_attributes: failed to set time on ./fsroot-vs/usr/lib/modules/6.1.0-29-2-amd64/kernel/drivers/net/arcnet/com90xx.ko, because No such file or directory

set_attributes: failed to set time on ./fsroot-vs/usr/lib/modules/6.1.0-29-2-amd64/kernel/drivers/net/arcnet/rfc1051.ko, because No such file or directory

set_attributes: failed to set time on ./fsroot-vs/usr/lib/modules/6.1.0-29-2-amd64/kernel/drivers/net/arcnet/rfc1201.ko, because No such file or directory

set_attributes: failed to set time on ./fsroot-vs/usr/lib/modules/6.1.0-29-2-amd64/kernel/drivers/net/arcnet, because No such file or directory

set_attributes: failed to set time on ./fsroot-vs/usr/lib/modules/6.1.0-29-2-amd64/kernel/drivers/net/bonding/bonding.ko, because No such file or directory

set_attributes: failed to set time on ./fsroot-vs/usr/lib/modules/6.1.0-29-2-amd64/kernel/drivers/net/bonding, because No such file or directory

set_attributes: failed to set time on ./fsroot-vs/usr/lib/modules/6.1.0-29-2-amd64/kernel/drivers/net/can/dev/can-dev.ko, because No such file or directory

set_attributes: failed to set time on ./fsroot-vs/usr/lib/modules/6.1.0-29-2-amd64/kernel/drivers/net/can/dev, because No such file or directory

set_attributes: failed to set time on ./fsroot-vs/usr/lib/modules/6.1.0-29-2-amd64/kernel/drivers/net/can/peak_canfd/peak_pciefd.ko, because No such file or directory

set_attributes: failed to set time on ./fsroot-vs/usr/lib/modules/6.1.0-29-2-amd64/kernel/drivers/net/can/peak_canfd, because No such file or directory

set_attributes: failed to set time on ./fsroot-vs/usr/lib/modules/6.1.0-29-2-amd64/kernel/drivers/net/can/sja1000/ems_pci.ko, because No such file or directory

set_attributes: failed to set time on ./fsroot-vs/usr/lib/modules/6.1.0-29-2-amd64/kernel/drivers/net/can/sja1000/ems_pcmcia.ko, because No such file or directory

set_attributes: failed to set time on ./fsroot-vs/usr/lib/modules/6.1.0-29-2-amd64/kernel/drivers/net/can/sja1000/kvaser_pci.ko, because No such file or directory

set_attributes: failed to set time on ./fsroot-vs/usr/lib/modules/6.1.0-29-2-amd64/kernel/drivers/net/can/sja1000/peak_pci.ko, because No such file or directory

set_attributes: failed to set time on ./fsroot-vs/usr/lib/modules/6.1.0-29-2-amd64/kernel/drivers/net/can/sja1000/peak_pcmcia.ko, because No such file or directory

set_attributes: failed to set time on ./fsroot-vs/usr/lib/modules/6.1.0-29-2-amd64/kernel/drivers/net/can/sja1000/plx_pci.ko, because No such file or directory

set_attributes: failed to set time on ./fsroot-vs/usr/lib/modules/6.1.0-29-2-amd64/kernel/drivers/net/can/sja1000/sja1000.ko, because No such file or directory

set_attributes: failed to set time on ./fsroot-vs/usr/lib/modules/6.1.0-29-2-amd64/kernel/drivers/net/can/sja1000/sja1000_isa.ko, because No such file or directory

set_attributes: failed to set time on ./fsroot-vs/usr/lib/modules/6.1.0-29-2-amd64/kernel/drivers/net/can/sja1000, because No such file or directory

set_attributes: failed to set time on ./fsroot-vs/usr/lib/modules/6.1.0-29-2-amd64/kernel/drivers/net/can/slcan/slcan.ko, because No such file or directory

set_attributes: failed to set time on ./fsroot-vs/usr/lib/modules/6.1.0-29-2-amd64/kernel/drivers/net/can/slcan, because No such file or directory

set_attributes: failed to set time on ./fsroot-vs/usr/lib/modules/6.1.0-29-2-amd64/kernel/drivers/net/can/softing/softing.ko, because No such file or directory

set_attributes: failed to set time on ./fsroot-vs/usr/lib/modules/6.1.0-29-2-amd64/kernel/drivers/net/can/softing/softing_cs.ko, because No such file or directory

set_attributes: failed to set time on ./fsroot-vs/usr/lib/modules/6.1.0-29-2-amd64/kernel/drivers/net/can/softing, because No such file or directory

set_attributes: failed to set time on ./fsroot-vs/usr/lib/modules/6.1.0-29-2-amd64/kernel/drivers/net/can/spi/hi311x.ko, because No such file or directory

set_attributes: failed to set time on ./fsroot-vs/usr/lib/modules/6.1.0-29-2-amd64/kernel/drivers/net/can/spi/mcp251x.ko, because No such file or directory

set_attributes: failed to set time on ./fsroot-vs/usr/lib/modules/6.1.0-29-2-amd64/kernel/drivers/net/can/spi/mcp251xfd/mcp251xfd.ko, because No such file or directory

set_attributes: failed to set time on ./fsroot-vs/usr/lib/modules/6.1.0-29-2-amd64/kernel/drivers/net/can/spi/mcp251xfd, because No such file or directory

set_attributes: failed to set time on ./fsroot-vs/usr/lib/modules/6.1.0-29-2-amd64/kernel/drivers/net/can/spi, because No such file or directory

set_attributes: failed to set time on ./fsroot-vs/usr/lib/modules/6.1.0-29-2-amd64/kernel/drivers/net/can/usb/ems_usb.ko, because No such file or directory

set_attributes: failed to set time on ./fsroot-vs/usr/lib/modules/6.1.0-29-2-amd64/kernel/drivers/net/can/usb/esd_usb.ko, because No such file or directory

set_attributes: failed to set time on ./fsroot-vs/usr/lib/modules/6.1.0-29-2-amd64/kernel/drivers/net/can/usb/gs_usb.ko, because No such file or directory

set_attributes: failed to set time on ./fsroot-vs/usr/lib/modules/6.1.0-29-2-amd64/kernel/drivers/net/can/usb/kvaser_usb/kvaser_usb.ko, because No such file or directory

set_attributes: failed to set time on ./fsroot-vs/usr/lib/modules/6.1.0-29-2-amd64/kernel/drivers/net/can/usb/kvaser_usb, because No such file or directory

set_attributes: failed to set time on ./fsroot-vs/usr/lib/modules/6.1.0-29-2-amd64/kernel/drivers/net/can/usb/mcba_usb.ko, because No such file or directory

set_attributes: failed to set time on ./fsroot-vs/usr/lib/modules/6.1.0-29-2-amd64/kernel/drivers/net/can/usb/peak_usb/peak_usb.ko, because No such file or directory

set_attributes: failed to set time on ./fsroot-vs/usr/lib/modules/6.1.0-29-2-amd64/kernel/drivers/net/can/usb/peak_usb, because No such file or directory

set_attributes: failed to set time on ./fsroot-vs/usr/lib/modules/6.1.0-29-2-amd64/kernel/drivers/net/can/usb/ucan.ko, because No such file or directory

set_attributes: failed to set time on ./fsroot-vs/usr/lib/modules/6.1.0-29-2-amd64/kernel/drivers/net/can/usb/usb_8dev.ko, because No such file or directory

set_attributes: failed to set time on ./fsroot-vs/usr/lib/modules/6.1.0-29-2-amd64/kernel/drivers/net/can/usb, because No such file or directory

set_attributes: failed to set time on ./fsroot-vs/usr/lib/modules/6.1.0-29-2-amd64/kernel/drivers/net/can/vcan.ko, because No such file or directory

set_attributes: failed to set time on ./fsroot-vs/usr/lib/modules/6.1.0-29-2-amd64/kernel/drivers/net/can/vxcan.ko, because No such file or directory

set_attributes: failed to set time on ./fsroot-vs/usr/lib/modules/6.1.0-29-2-amd64/kernel/drivers/net/can, because No such file or directory

set_attributes: failed to set time on ./fsroot-vs/usr/lib/modules/6.1.0-29-2-amd64/kernel/drivers/net/dummy.ko, because No such file or directory

set_attributes: failed to set time on ./fsroot-vs/usr/lib/modules/6.1.0-29-2-amd64/kernel/drivers/net/eql.ko, because No such file or directory

set_attributes: failed to set time on ./fsroot-vs/usr/lib/modules/6.1.0-29-2-amd64/kernel/drivers/net/ethernet/3com/3c574_cs.ko, because No such file or directory

set_attributes: failed to set time on ./fsroot-vs/usr/lib/modules/6.1.0-29-2-amd64/kernel/drivers/net/ethernet/3com/3c589_cs.ko, because No such file or directory

set_attributes: failed to set time on ./fsroot-vs/usr/lib/modules/6.1.0-29-2-amd64/kernel/drivers/net/ethernet/3com/3c59x.ko, because No such file or directory

set_attributes: failed to set time on ./fsroot-vs/usr/lib/modules/6.1.0-29-2-amd64/kernel/drivers/net/ethernet/3com/typhoon.ko, because No such file or directory

set_attributes: failed to set time on ./fsroot-vs/usr/lib/modules/6.1.0-29-2-amd64/kernel/drivers/net/ethernet/3com, because No such file or directory

set_attributes: failed to set time on ./fsroot-vs/usr/lib/modules/6.1.0-29-2-amd64/kernel/drivers/net/ethernet/8390/8390.ko, because No such file or directory

set_attributes: failed to set time on ./fsroot-vs/usr/lib/modules/6.1.0-29-2-amd64/kernel/drivers/net/ethernet/8390/axnet_cs.ko, because No such file or directory

set_attributes: failed to set time on ./fsroot-vs/usr/lib/modules/6.1.0-29-2-amd64/kernel/drivers/net/ethernet/8390/ne2k-pci.ko, because No such file or directory

set_attributes: failed to set time on ./fsroot-vs/usr/lib/modules/6.1.0-29-2-amd64/kernel/drivers/net/ethernet/8390/pcnet_cs.ko, because No such file or directory

set_attributes: failed to set time on ./fsroot-vs/usr/lib/modules/6.1.0-29-2-amd64/kernel/drivers/net/ethernet/8390, because No such file or directory

set_attributes: failed to set time on ./fsroot-vs/usr/lib/modules/6.1.0-29-2-amd64/kernel/drivers/net/ethernet/adaptec/starfire.ko, because No such file or directory

set_attributes: failed to set time on ./fsroot-vs/usr/lib/modules/6.1.0-29-2-amd64/kernel/drivers/net/ethernet/adaptec, because No such file or directory

set_attributes: failed to set time on ./fsroot-vs/usr/lib/modules/6.1.0-29-2-amd64/kernel/drivers/net/ethernet/agere/et131x.ko, because No such file or directory

set_attributes: failed to set time on ./fsroot-vs/usr/lib/modules/6.1.0-29-2-amd64/kernel/drivers/net/ethernet/agere, because No such file or directory

set_attributes: failed to set time on ./fsroot-vs/usr/lib/modules/6.1.0-29-2-amd64/kernel/drivers/net/ethernet/alteon/acenic.ko, because No such file or directory

set_attributes: failed to set time on ./fsroot-vs/usr/lib/modules/6.1.0-29-2-amd64/kernel/drivers/net/ethernet/alteon, because No such file or directory

set_attributes: failed to set time on ./fsroot-vs/usr/lib/modules/6.1.0-29-2-amd64/kernel/drivers/net/ethernet/amazon/ena/ena.ko, because No such file or directory

set_attributes: failed to set time on ./fsroot-vs/usr/lib/modules/6.1.0-29-2-amd64/kernel/drivers/net/ethernet/amazon/ena, because No such file or directory

set_attributes: failed to set time on ./fsroot-vs/usr/lib/modules/6.1.0-29-2-amd64/kernel/drivers/net/ethernet/amazon, because No such file or directory

set_attributes: failed to set time on ./fsroot-vs/usr/lib/modules/6.1.0-29-2-amd64/kernel/drivers/net/ethernet/amd/amd8111e.ko, because No such file or directory

set_attributes: failed to set time on ./fsroot-vs/usr/lib/modules/6.1.0-29-2-amd64/kernel/drivers/net/ethernet/amd/nmclan_cs.ko, because No such file or directory

set_attributes: failed to set time on ./fsroot-vs/usr/lib/modules/6.1.0-29-2-amd64/kernel/drivers/net/ethernet/amd/pcnet32.ko, because No such file or directory

set_attributes: failed to set time on ./fsroot-vs/usr/lib/modules/6.1.0-29-2-amd64/kernel/drivers/net/ethernet/amd/xgbe/amd-xgbe.ko, because No such file or directory

set_attributes: failed to set time on ./fsroot-vs/usr/lib/modules/6.1.0-29-2-amd64/kernel/drivers/net/ethernet/amd/xgbe, because No such file or directory

set_attributes: failed to set time on ./fsroot-vs/usr/lib/modules/6.1.0-29-2-amd64/kernel/drivers/net/ethernet/amd, because No such file or directory

set_attributes: failed to set time on ./fsroot-vs/usr/lib/modules/6.1.0-29-2-amd64/kernel/drivers/net/ethernet/aquantia/atlantic/atlantic.ko, because No such file or directory

set_attributes: failed to set time on ./fsroot-vs/usr/lib/modules/6.1.0-29-2-amd64/kernel/drivers/net/ethernet/aquantia/atlantic, because No such file or directory

set_attributes: failed to set time on ./fsroot-vs/usr/lib/modules/6.1.0-29-2-amd64/kernel/drivers/net/ethernet/aquantia, because No such file or directory

set_attributes: failed to set time on ./fsroot-vs/usr/lib/modules/6.1.0-29-2-amd64/kernel/drivers/net/ethernet/atheros/alx/alx.ko, because No such file or directory

set_attributes: failed to set time on ./fsroot-vs/usr/lib/modules/6.1.0-29-2-amd64/kernel/drivers/net/ethernet/atheros/alx, because No such file or directory

set_attributes: failed to set time on ./fsroot-vs/usr/lib/modules/6.1.0-29-2-amd64/kernel/drivers/net/ethernet/atheros/atl1c/atl1c.ko, because No such file or directory

set_attributes: failed to set time on ./fsroot-vs/usr/lib/modules/6.1.0-29-2-amd64/kernel/drivers/net/ethernet/atheros/atl1c, because No such file or directory

set_attributes: failed to set time on ./fsroot-vs/usr/lib/modules/6.1.0-29-2-amd64/kernel/drivers/net/ethernet/atheros/atl1e/atl1e.ko, because No such file or directory

set_attributes: failed to set time on ./fsroot-vs/usr/lib/modules/6.1.0-29-2-amd64/kernel/drivers/net/ethernet/atheros/atl1e, because No such file or directory

set_attributes: failed to set time on ./fsroot-vs/usr/lib/modules/6.1.0-29-2-amd64/kernel/drivers/net/ethernet/atheros/atlx/atl1.ko, because No such file or directory

set_attributes: failed to set time on ./fsroot-vs/usr/lib/modules/6.1.0-29-2-amd64/kernel/drivers/net/ethernet/atheros/atlx/atl2.ko, because No such file or directory

set_attributes: failed to set time on ./fsroot-vs/usr/lib/modules/6.1.0-29-2-amd64/kernel/drivers/net/ethernet/atheros/atlx, because No such file or directory

set_attributes: failed to set time on ./fsroot-vs/usr/lib/modules/6.1.0-29-2-amd64/kernel/drivers/net/ethernet/atheros, because No such file or directory

set_attributes: failed to set time on ./fsroot-vs/usr/lib/modules/6.1.0-29-2-amd64/kernel/drivers/net/ethernet/broadcom/b44.ko, because No such file or directory

set_attributes: failed to set time on ./fsroot-vs/usr/lib/modules/6.1.0-29-2-amd64/kernel/drivers/net/ethernet/broadcom/bnx2.ko, because No such file or directory

set_attributes: failed to set time on ./fsroot-vs/usr/lib/modules/6.1.0-29-2-amd64/kernel/drivers/net/ethernet/broadcom/bnx2x/bnx2x.ko, because No such file or directory

set_attributes: failed to set time on ./fsroot-vs/usr/lib/modules/6.1.0-29-2-amd64/kernel/drivers/net/ethernet/broadcom/bnx2x, because No such file or directory

set_attributes: failed to set time on ./fsroot-vs/usr/lib/modules/6.1.0-29-2-amd64/kernel/drivers/net/ethernet/broadcom/bnxt/bnxt_en.ko, because No such file or directory

set_attributes: failed to set time on ./fsroot-vs/usr/lib/modules/6.1.0-29-2-amd64/kernel/drivers/net/ethernet/broadcom/bnxt, because No such file or directory

set_attributes: failed to set time on ./fsroot-vs/usr/lib/modules/6.1.0-29-2-amd64/kernel/drivers/net/ethernet/broadcom/cnic.ko, because No such file or directory

set_attributes: failed to set time on ./fsroot-vs/usr/lib/modules/6.1.0-29-2-amd64/kernel/drivers/net/ethernet/broadcom/tg3.ko, because No such file or directory

set_attributes: failed to set time on ./fsroot-vs/usr/lib/modules/6.1.0-29-2-amd64/kernel/drivers/net/ethernet/broadcom, because No such file or directory

set_attributes: failed to set time on ./fsroot-vs/usr/lib/modules/6.1.0-29-2-amd64/kernel/drivers/net/ethernet/brocade/bna/bna.ko, because No such file or directory

set_attributes: failed to set time on ./fsroot-vs/usr/lib/modules/6.1.0-29-2-amd64/kernel/drivers/net/ethernet/brocade/bna, because No such file or directory

set_attributes: failed to set time on ./fsroot-vs/usr/lib/modules/6.1.0-29-2-amd64/kernel/drivers/net/ethernet/brocade, because No such file or directory

set_attributes: failed to set time on ./fsroot-vs/usr/lib/modules/6.1.0-29-2-amd64/kernel/drivers/net/ethernet/cavium/common/cavium_ptp.ko, because No such file or directory

set_attributes: failed to set time on ./fsroot-vs/usr/lib/modules/6.1.0-29-2-amd64/kernel/drivers/net/ethernet/cavium/common, because No such file or directory

set_attributes: failed to set time on ./fsroot-vs/usr/lib/modules/6.1.0-29-2-amd64/kernel/drivers/net/ethernet/cavium/liquidio/liquidio.ko, because No such file or directory

set_attributes: failed to set time on ./fsroot-vs/usr/lib/modules/6.1.0-29-2-amd64/kernel/drivers/net/ethernet/cavium/liquidio/liquidio_vf.ko, because No such file or directory

set_attributes: failed to set time on ./fsroot-vs/usr/lib/modules/6.1.0-29-2-amd64/kernel/drivers/net/ethernet/cavium/liquidio, because No such file or directory

set_attributes: failed to set time on ./fsroot-vs/usr/lib/modules/6.1.0-29-2-amd64/kernel/drivers/net/ethernet/cavium, because No such file or directory

set_attributes: failed to set time on ./fsroot-vs/usr/lib/modules/6.1.0-29-2-amd64/kernel/drivers/net/ethernet/chelsio/cxgb/cxgb.ko, because No such file or directory

set_attributes: failed to set time on ./fsroot-vs/usr/lib/modules/6.1.0-29-2-amd64/kernel/drivers/net/ethernet/chelsio/cxgb, because No such file or directory

set_attributes: failed to set time on ./fsroot-vs/usr/lib/modules/6.1.0-29-2-amd64/kernel/drivers/net/ethernet/chelsio/cxgb3/cxgb3.ko, because No such file or directory

set_attributes: failed to set time on ./fsroot-vs/usr/lib/modules/6.1.0-29-2-amd64/kernel/drivers/net/ethernet/chelsio/cxgb3, because No such file or directory

set_attributes: failed to set time on ./fsroot-vs/usr/lib/modules/6.1.0-29-2-amd64/kernel/drivers/net/ethernet/chelsio/cxgb4/cxgb4.ko, because No such file or directory

set_attributes: failed to set time on ./fsroot-vs/usr/lib/modules/6.1.0-29-2-amd64/kernel/drivers/net/ethernet/chelsio/cxgb4, because No such file or directory

set_attributes: failed to set time on ./fsroot-vs/usr/lib/modules/6.1.0-29-2-amd64/kernel/drivers/net/ethernet/chelsio/cxgb4vf/cxgb4vf.ko, because No such file or directory

set_attributes: failed to set time on ./fsroot-vs/usr/lib/modules/6.1.0-29-2-amd64/kernel/drivers/net/ethernet/chelsio/cxgb4vf, because No such file or directory

set_attributes: failed to set time on ./fsroot-vs/usr/lib/modules/6.1.0-29-2-amd64/kernel/drivers/net/ethernet/chelsio/libcxgb/libcxgb.ko, because No such file or directory

set_attributes: failed to set time on ./fsroot-vs/usr/lib/modules/6.1.0-29-2-amd64/kernel/drivers/net/ethernet/chelsio/libcxgb, because No such file or directory

set_attributes: failed to set time on ./fsroot-vs/usr/lib/modules/6.1.0-29-2-amd64/kernel/drivers/net/ethernet/chelsio, because No such file or directory

set_attributes: failed to set time on ./fsroot-vs/usr/lib/modules/6.1.0-29-2-amd64/kernel/drivers/net/ethernet/cisco/enic/enic.ko, because No such file or directory

set_attributes: failed to set time on ./fsroot-vs/usr/lib/modules/6.1.0-29-2-amd64/kernel/drivers/net/ethernet/cisco/enic, because No such file or directory

set_attributes: failed to set time on ./fsroot-vs/usr/lib/modules/6.1.0-29-2-amd64/kernel/drivers/net/ethernet/cisco, because No such file or directory

set_attributes: failed to set time on ./fsroot-vs/usr/lib/modules/6.1.0-29-2-amd64/kernel/drivers/net/ethernet/dec/tulip/de2104x.ko, because No such file or directory

set_attributes: failed to set time on ./fsroot-vs/usr/lib/modules/6.1.0-29-2-amd64/kernel/drivers/net/ethernet/dec/tulip/dmfe.ko, because No such file or directory

set_attributes: failed to set time on ./fsroot-vs/usr/lib/modules/6.1.0-29-2-amd64/kernel/drivers/net/ethernet/dec/tulip/tulip.ko, because No such file or directory

set_attributes: failed to set time on ./fsroot-vs/usr/lib/modules/6.1.0-29-2-amd64/kernel/drivers/net/ethernet/dec/tulip/uli526x.ko, because No such file or directory

set_attributes: failed to set time on ./fsroot-vs/usr/lib/modules/6.1.0-29-2-amd64/kernel/drivers/net/ethernet/dec/tulip/winbond-840.ko, because No such file or directory

[==================\                                         ] 20788/67775  30%
set_attributes: failed to set time on ./fsroot-vs/usr/lib/modules/6.1.0-29-2-amd64/kernel/drivers/net/ethernet/dec/tulip/xircom_cb.ko, because No such file or directory

set_attributes: failed to set time on ./fsroot-vs/usr/lib/modules/6.1.0-29-2-amd64/kernel/drivers/net/ethernet/dec/tulip, because No such file or directory

set_attributes: failed to set time on ./fsroot-vs/usr/lib/modules/6.1.0-29-2-amd64/kernel/drivers/net/ethernet/dec, because No such file or directory

set_attributes: failed to set time on ./fsroot-vs/usr/lib/modules/6.1.0-29-2-amd64/kernel/drivers/net/ethernet/dlink/dl2k.ko, because No such file or directory

set_attributes: failed to set time on ./fsroot-vs/usr/lib/modules/6.1.0-29-2-amd64/kernel/drivers/net/ethernet/dlink/sundance.ko, because No such file or directory

set_attributes: failed to set time on ./fsroot-vs/usr/lib/modules/6.1.0-29-2-amd64/kernel/drivers/net/ethernet/dlink, because No such file or directory

set_attributes: failed to set time on ./fsroot-vs/usr/lib/modules/6.1.0-29-2-amd64/kernel/drivers/net/ethernet/emulex/benet/be2net.ko, because No such file or directory

set_attributes: failed to set time on ./fsroot-vs/usr/lib/modules/6.1.0-29-2-amd64/kernel/drivers/net/ethernet/emulex/benet, because No such file or directory

set_attributes: failed to set time on ./fsroot-vs/usr/lib/modules/6.1.0-29-2-amd64/kernel/drivers/net/ethernet/emulex, because No such file or directory

set_attributes: failed to set time on ./fsroot-vs/usr/lib/modules/6.1.0-29-2-amd64/kernel/drivers/net/ethernet/fealnx.ko, because No such file or directory

set_attributes: failed to set time on ./fsroot-vs/usr/lib/modules/6.1.0-29-2-amd64/kernel/drivers/net/ethernet/fujitsu/fmvj18x_cs.ko, because No such file or directory

set_attributes: failed to set time on ./fsroot-vs/usr/lib/modules/6.1.0-29-2-amd64/kernel/drivers/net/ethernet/fujitsu, because No such file or directory

set_attributes: failed to set time on ./fsroot-vs/usr/lib/modules/6.1.0-29-2-amd64/kernel/drivers/net/ethernet/google/gve/gve.ko, because No such file or directory

set_attributes: failed to set time on ./fsroot-vs/usr/lib/modules/6.1.0-29-2-amd64/kernel/drivers/net/ethernet/google/gve, because No such file or directory

set_attributes: failed to set time on ./fsroot-vs/usr/lib/modules/6.1.0-29-2-amd64/kernel/drivers/net/ethernet/google, because No such file or directory

set_attributes: failed to set time on ./fsroot-vs/usr/lib/modules/6.1.0-29-2-amd64/kernel/drivers/net/ethernet/huawei/hinic/hinic.ko, because No such file or directory

set_attributes: failed to set time on ./fsroot-vs/usr/lib/modules/6.1.0-29-2-amd64/kernel/drivers/net/ethernet/huawei/hinic, because No such file or directory

set_attributes: failed to set time on ./fsroot-vs/usr/lib/modules/6.1.0-29-2-amd64/kernel/drivers/net/ethernet/huawei, because No such file or directory

set_attributes: failed to set time on ./fsroot-vs/usr/lib/modules/6.1.0-29-2-amd64/kernel/drivers/net/ethernet/intel/e100.ko, because No such file or directory

set_attributes: failed to set time on ./fsroot-vs/usr/lib/modules/6.1.0-29-2-amd64/kernel/drivers/net/ethernet/intel/e1000/e1000.ko, because No such file or directory

set_attributes: failed to set time on ./fsroot-vs/usr/lib/modules/6.1.0-29-2-amd64/kernel/drivers/net/ethernet/intel/e1000, because No such file or directory

set_attributes: failed to set time on ./fsroot-vs/usr/lib/modules/6.1.0-29-2-amd64/kernel/drivers/net/ethernet/intel/e1000e/e1000e.ko, because No such file or directory

set_attributes: failed to set time on ./fsroot-vs/usr/lib/modules/6.1.0-29-2-amd64/kernel/drivers/net/ethernet/intel/e1000e, because No such file or directory

set_attributes: failed to set time on ./fsroot-vs/usr/lib/modules/6.1.0-29-2-amd64/kernel/drivers/net/ethernet/intel/i40e/i40e.ko, because No such file or directory

set_attributes: failed to set time on ./fsroot-vs/usr/lib/modules/6.1.0-29-2-amd64/kernel/drivers/net/ethernet/intel/i40e, because No such file or directory

set_attributes: failed to set time on ./fsroot-vs/usr/lib/modules/6.1.0-29-2-amd64/kernel/drivers/net/ethernet/intel/iavf/iavf.ko, because No such file or directory

set_attributes: failed to set time on ./fsroot-vs/usr/lib/modules/6.1.0-29-2-amd64/kernel/drivers/net/ethernet/intel/iavf, because No such file or directory

set_attributes: failed to set time on ./fsroot-vs/usr/lib/modules/6.1.0-29-2-amd64/kernel/drivers/net/ethernet/intel/ice/ice.ko, because No such file or directory

set_attributes: failed to set time on ./fsroot-vs/usr/lib/modules/6.1.0-29-2-amd64/kernel/drivers/net/ethernet/intel/ice, because No such file or directory

set_attributes: failed to set time on ./fsroot-vs/usr/lib/modules/6.1.0-29-2-amd64/kernel/drivers/net/ethernet/intel/igb/igb.ko, because No such file or directory

set_attributes: failed to set time on ./fsroot-vs/usr/lib/modules/6.1.0-29-2-amd64/kernel/drivers/net/ethernet/intel/igb, because No such file or directory

set_attributes: failed to set time on ./fsroot-vs/usr/lib/modules/6.1.0-29-2-amd64/kernel/drivers/net/ethernet/intel/igbvf/igbvf.ko, because No such file or directory

set_attributes: failed to set time on ./fsroot-vs/usr/lib/modules/6.1.0-29-2-amd64/kernel/drivers/net/ethernet/intel/igbvf, because No such file or directory

set_attributes: failed to set time on ./fsroot-vs/usr/lib/modules/6.1.0-29-2-amd64/kernel/drivers/net/ethernet/intel/igc/igc.ko, because No such file or directory

set_attributes: failed to set time on ./fsroot-vs/usr/lib/modules/6.1.0-29-2-amd64/kernel/drivers/net/ethernet/intel/igc, because No such file or directory

set_attributes: failed to set time on ./fsroot-vs/usr/lib/modules/6.1.0-29-2-amd64/kernel/drivers/net/ethernet/intel/ixgb/ixgb.ko, because No such file or directory

set_attributes: failed to set time on ./fsroot-vs/usr/lib/modules/6.1.0-29-2-amd64/kernel/drivers/net/ethernet/intel/ixgb, because No such file or directory

set_attributes: failed to set time on ./fsroot-vs/usr/lib/modules/6.1.0-29-2-amd64/kernel/drivers/net/ethernet/intel/ixgbe/ixgbe.ko, because No such file or directory

set_attributes: failed to set time on ./fsroot-vs/usr/lib/modules/6.1.0-29-2-amd64/kernel/drivers/net/ethernet/intel/ixgbe, because No such file or directory

set_attributes: failed to set time on ./fsroot-vs/usr/lib/modules/6.1.0-29-2-amd64/kernel/drivers/net/ethernet/intel/ixgbevf/ixgbevf.ko, because No such file or directory

set_attributes: failed to set time on ./fsroot-vs/usr/lib/modules/6.1.0-29-2-amd64/kernel/drivers/net/ethernet/intel/ixgbevf, because No such file or directory

set_attributes: failed to set time on ./fsroot-vs/usr/lib/modules/6.1.0-29-2-amd64/kernel/drivers/net/ethernet/intel, because No such file or directory

set_attributes: failed to set time on ./fsroot-vs/usr/lib/modules/6.1.0-29-2-amd64/kernel/drivers/net/ethernet/jme.ko, because No such file or directory

set_attributes: failed to set time on ./fsroot-vs/usr/lib/modules/6.1.0-29-2-amd64/kernel/drivers/net/ethernet/marvell/skge.ko, because No such file or directory

set_attributes: failed to set time on ./fsroot-vs/usr/lib/modules/6.1.0-29-2-amd64/kernel/drivers/net/ethernet/marvell/sky2.ko, because No such file or directory

set_attributes: failed to set time on ./fsroot-vs/usr/lib/modules/6.1.0-29-2-amd64/kernel/drivers/net/ethernet/marvell, because No such file or directory

set_attributes: failed to set time on ./fsroot-vs/usr/lib/modules/6.1.0-29-2-amd64/kernel/drivers/net/ethernet/mellanox/mlx4/mlx4_core.ko, because No such file or directory

set_attributes: failed to set time on ./fsroot-vs/usr/lib/modules/6.1.0-29-2-amd64/kernel/drivers/net/ethernet/mellanox/mlx4/mlx4_en.ko, because No such file or directory

set_attributes: failed to set time on ./fsroot-vs/usr/lib/modules/6.1.0-29-2-amd64/kernel/drivers/net/ethernet/mellanox/mlx4, because No such file or directory

set_attributes: failed to set time on ./fsroot-vs/usr/lib/modules/6.1.0-29-2-amd64/kernel/drivers/net/ethernet/mellanox/mlx5/core/mlx5_core.ko, because No such file or directory

set_attributes: failed to set time on ./fsroot-vs/usr/lib/modules/6.1.0-29-2-amd64/kernel/drivers/net/ethernet/mellanox/mlx5/core, because No such file or directory

set_attributes: failed to set time on ./fsroot-vs/usr/lib/modules/6.1.0-29-2-amd64/kernel/drivers/net/ethernet/mellanox/mlx5, because No such file or directory

set_attributes: failed to set time on ./fsroot-vs/usr/lib/modules/6.1.0-29-2-amd64/kernel/drivers/net/ethernet/mellanox/mlxfw/mlxfw.ko, because No such file or directory

set_attributes: failed to set time on ./fsroot-vs/usr/lib/modules/6.1.0-29-2-amd64/kernel/drivers/net/ethernet/mellanox/mlxfw, because No such file or directory

set_attributes: failed to set time on ./fsroot-vs/usr/lib/modules/6.1.0-29-2-amd64/kernel/drivers/net/ethernet/mellanox/mlxsw/mlxsw_core.ko, because No such file or directory

set_attributes: failed to set time on ./fsroot-vs/usr/lib/modules/6.1.0-29-2-amd64/kernel/drivers/net/ethernet/mellanox/mlxsw/mlxsw_i2c.ko, because No such file or directory

set_attributes: failed to set time on ./fsroot-vs/usr/lib/modules/6.1.0-29-2-amd64/kernel/drivers/net/ethernet/mellanox/mlxsw/mlxsw_minimal.ko, because No such file or directory

set_attributes: failed to set time on ./fsroot-vs/usr/lib/modules/6.1.0-29-2-amd64/kernel/drivers/net/ethernet/mellanox/mlxsw, because No such file or directory

set_attributes: failed to set time on ./fsroot-vs/usr/lib/modules/6.1.0-29-2-amd64/kernel/drivers/net/ethernet/mellanox, because No such file or directory

set_attributes: failed to set time on ./fsroot-vs/usr/lib/modules/6.1.0-29-2-amd64/kernel/drivers/net/ethernet/micrel/ksz884x.ko, because No such file or directory

set_attributes: failed to set time on ./fsroot-vs/usr/lib/modules/6.1.0-29-2-amd64/kernel/drivers/net/ethernet/micrel, because No such file or directory

set_attributes: failed to set time on ./fsroot-vs/usr/lib/modules/6.1.0-29-2-amd64/kernel/drivers/net/ethernet/microchip/lan743x.ko, because No such file or directory

set_attributes: failed to set time on ./fsroot-vs/usr/lib/modules/6.1.0-29-2-amd64/kernel/drivers/net/ethernet/microchip, because No such file or directory

set_attributes: failed to set time on ./fsroot-vs/usr/lib/modules/6.1.0-29-2-amd64/kernel/drivers/net/ethernet/microsoft/mana/mana.ko, because No such file or directory

set_attributes: failed to set time on ./fsroot-vs/usr/lib/modules/6.1.0-29-2-amd64/kernel/drivers/net/ethernet/microsoft/mana, because No such file or directory

set_attributes: failed to set time on ./fsroot-vs/usr/lib/modules/6.1.0-29-2-amd64/kernel/drivers/net/ethernet/microsoft, because No such file or directory

set_attributes: failed to set time on ./fsroot-vs/usr/lib/modules/6.1.0-29-2-amd64/kernel/drivers/net/ethernet/myricom/myri10ge/myri10ge.ko, because No such file or directory

set_attributes: failed to set time on ./fsroot-vs/usr/lib/modules/6.1.0-29-2-amd64/kernel/drivers/net/ethernet/myricom/myri10ge, because No such file or directory

set_attributes: failed to set time on ./fsroot-vs/usr/lib/modules/6.1.0-29-2-amd64/kernel/drivers/net/ethernet/myricom, because No such file or directory

set_attributes: failed to set time on ./fsroot-vs/usr/lib/modules/6.1.0-29-2-amd64/kernel/drivers/net/ethernet/natsemi/natsemi.ko, because No such file or directory

set_attributes: failed to set time on ./fsroot-vs/usr/lib/modules/6.1.0-29-2-amd64/kernel/drivers/net/ethernet/natsemi/ns83820.ko, because No such file or directory

set_attributes: failed to set time on ./fsroot-vs/usr/lib/modules/6.1.0-29-2-amd64/kernel/drivers/net/ethernet/natsemi, because No such file or directory

set_attributes: failed to set time on ./fsroot-vs/usr/lib/modules/6.1.0-29-2-amd64/kernel/drivers/net/ethernet/neterion/s2io.ko, because No such file or directory

set_attributes: failed to set time on ./fsroot-vs/usr/lib/modules/6.1.0-29-2-amd64/kernel/drivers/net/ethernet/neterion, because No such file or directory

set_attributes: failed to set time on ./fsroot-vs/usr/lib/modules/6.1.0-29-2-amd64/kernel/drivers/net/ethernet/netronome/nfp/nfp.ko, because No such file or directory

set_attributes: failed to set time on ./fsroot-vs/usr/lib/modules/6.1.0-29-2-amd64/kernel/drivers/net/ethernet/netronome/nfp, because No such file or directory

set_attributes: failed to set time on ./fsroot-vs/usr/lib/modules/6.1.0-29-2-amd64/kernel/drivers/net/ethernet/netronome, because No such file or directory

set_attributes: failed to set time on ./fsroot-vs/usr/lib/modules/6.1.0-29-2-amd64/kernel/drivers/net/ethernet/nvidia/forcedeth.ko, because No such file or directory

set_attributes: failed to set time on ./fsroot-vs/usr/lib/modules/6.1.0-29-2-amd64/kernel/drivers/net/ethernet/nvidia, because No such file or directory

set_attributes: failed to set time on ./fsroot-vs/usr/lib/modules/6.1.0-29-2-amd64/kernel/drivers/net/ethernet/packetengines/hamachi.ko, because No such file or directory

set_attributes: failed to set time on ./fsroot-vs/usr/lib/modules/6.1.0-29-2-amd64/kernel/drivers/net/ethernet/packetengines/yellowfin.ko, because No such file or directory

set_attributes: failed to set time on ./fsroot-vs/usr/lib/modules/6.1.0-29-2-amd64/kernel/drivers/net/ethernet/packetengines, because No such file or directory

set_attributes: failed to set time on ./fsroot-vs/usr/lib/modules/6.1.0-29-2-amd64/kernel/drivers/net/ethernet/pensando/ionic/ionic.ko, because No such file or directory

set_attributes: failed to set time on ./fsroot-vs/usr/lib/modules/6.1.0-29-2-amd64/kernel/drivers/net/ethernet/pensando/ionic, because No such file or directory

set_attributes: failed to set time on ./fsroot-vs/usr/lib/modules/6.1.0-29-2-amd64/kernel/drivers/net/ethernet/pensando, because No such file or directory

set_attributes: failed to set time on ./fsroot-vs/usr/lib/modules/6.1.0-29-2-amd64/kernel/drivers/net/ethernet/qlogic/netxen/netxen_nic.ko, because No such file or directory

set_attributes: failed to set time on ./fsroot-vs/usr/lib/modules/6.1.0-29-2-amd64/kernel/drivers/net/ethernet/qlogic/netxen, because No such file or directory

set_attributes: failed to set time on ./fsroot-vs/usr/lib/modules/6.1.0-29-2-amd64/kernel/drivers/net/ethernet/qlogic/qed/qed.ko, because No such file or directory

set_attributes: failed to set time on ./fsroot-vs/usr/lib/modules/6.1.0-29-2-amd64/kernel/drivers/net/ethernet/qlogic/qed, because No such file or directory

set_attributes: failed to set time on ./fsroot-vs/usr/lib/modules/6.1.0-29-2-amd64/kernel/drivers/net/ethernet/qlogic/qede/qede.ko, because No such file or directory

set_attributes: failed to set time on ./fsroot-vs/usr/lib/modules/6.1.0-29-2-amd64/kernel/drivers/net/ethernet/qlogic/qede, because No such file or directory

set_attributes: failed to set time on ./fsroot-vs/usr/lib/modules/6.1.0-29-2-amd64/kernel/drivers/net/ethernet/qlogic/qla3xxx.ko, because No such file or directory

set_attributes: failed to set time on ./fsroot-vs/usr/lib/modules/6.1.0-29-2-amd64/kernel/drivers/net/ethernet/qlogic/qlcnic/qlcnic.ko, because No such file or directory

set_attributes: failed to set time on ./fsroot-vs/usr/lib/modules/6.1.0-29-2-amd64/kernel/drivers/net/ethernet/qlogic/qlcnic, because No such file or directory

set_attributes: failed to set time on ./fsroot-vs/usr/lib/modules/6.1.0-29-2-amd64/kernel/drivers/net/ethernet/qlogic, because No such file or directory

set_attributes: failed to set time on ./fsroot-vs/usr/lib/modules/6.1.0-29-2-amd64/kernel/drivers/net/ethernet/rdc/r6040.ko, because No such file or directory

set_attributes: failed to set time on ./fsroot-vs/usr/lib/modules/6.1.0-29-2-amd64/kernel/drivers/net/ethernet/rdc, because No such file or directory

set_attributes: failed to set time on ./fsroot-vs/usr/lib/modules/6.1.0-29-2-amd64/kernel/drivers/net/ethernet/realtek/8139cp.ko, because No such file or directory

set_attributes: failed to set time on ./fsroot-vs/usr/lib/modules/6.1.0-29-2-amd64/kernel/drivers/net/ethernet/realtek/8139too.ko, because No such file or directory

set_attributes: failed to set time on ./fsroot-vs/usr/lib/modules/6.1.0-29-2-amd64/kernel/drivers/net/ethernet/realtek/r8169.ko, because No such file or directory

set_attributes: failed to set time on ./fsroot-vs/usr/lib/modules/6.1.0-29-2-amd64/kernel/drivers/net/ethernet/realtek, because No such file or directory

set_attributes: failed to set time on ./fsroot-vs/usr/lib/modules/6.1.0-29-2-amd64/kernel/drivers/net/ethernet/sfc/falcon/sfc-falcon.ko, because No such file or directory

set_attributes: failed to set time on ./fsroot-vs/usr/lib/modules/6.1.0-29-2-amd64/kernel/drivers/net/ethernet/sfc/falcon, because No such file or directory

set_attributes: failed to set time on ./fsroot-vs/usr/lib/modules/6.1.0-29-2-amd64/kernel/drivers/net/ethernet/sfc/sfc.ko, because No such file or directory

set_attributes: failed to set time on ./fsroot-vs/usr/lib/modules/6.1.0-29-2-amd64/kernel/drivers/net/ethernet/sfc/siena/sfc-siena.ko, because No such file or directory

set_attributes: failed to set time on ./fsroot-vs/usr/lib/modules/6.1.0-29-2-amd64/kernel/drivers/net/ethernet/sfc/siena, because No such file or directory

set_attributes: failed to set time on ./fsroot-vs/usr/lib/modules/6.1.0-29-2-amd64/kernel/drivers/net/ethernet/sfc, because No such file or directory

set_attributes: failed to set time on ./fsroot-vs/usr/lib/modules/6.1.0-29-2-amd64/kernel/drivers/net/ethernet/silan/sc92031.ko, because No such file or directory

set_attributes: failed to set time on ./fsroot-vs/usr/lib/modules/6.1.0-29-2-amd64/kernel/drivers/net/ethernet/silan, because No such file or directory

set_attributes: failed to set time on ./fsroot-vs/usr/lib/modules/6.1.0-29-2-amd64/kernel/drivers/net/ethernet/sis/sis190.ko, because No such file or directory

set_attributes: failed to set time on ./fsroot-vs/usr/lib/modules/6.1.0-29-2-amd64/kernel/drivers/net/ethernet/sis/sis900.ko, because No such file or directory

set_attributes: failed to set time on ./fsroot-vs/usr/lib/modules/6.1.0-29-2-amd64/kernel/drivers/net/ethernet/sis, because No such file or directory

set_attributes: failed to set time on ./fsroot-vs/usr/lib/modules/6.1.0-29-2-amd64/kernel/drivers/net/ethernet/smsc/epic100.ko, because No such file or directory

set_attributes: failed to set time on ./fsroot-vs/usr/lib/modules/6.1.0-29-2-amd64/kernel/drivers/net/ethernet/smsc/smc91c92_cs.ko, because No such file or directory

set_attributes: failed to set time on ./fsroot-vs/usr/lib/modules/6.1.0-29-2-amd64/kernel/drivers/net/ethernet/smsc/smsc9420.ko, because No such file or directory

set_attributes: failed to set time on ./fsroot-vs/usr/lib/modules/6.1.0-29-2-amd64/kernel/drivers/net/ethernet/smsc, because No such file or directory

set_attributes: failed to set time on ./fsroot-vs/usr/lib/modules/6.1.0-29-2-amd64/kernel/drivers/net/ethernet/stmicro/stmmac/dwmac-generic.ko, because No such file or directory

set_attributes: failed to set time on ./fsroot-vs/usr/lib/modules/6.1.0-29-2-amd64/kernel/drivers/net/ethernet/stmicro/stmmac/dwmac-intel.ko, because No such file or directory

set_attributes: failed to set time on ./fsroot-vs/usr/lib/modules/6.1.0-29-2-amd64/kernel/drivers/net/ethernet/stmicro/stmmac/stmmac-platform.ko, because No such file or directory

set_attributes: failed to set time on ./fsroot-vs/usr/lib/modules/6.1.0-29-2-amd64/kernel/drivers/net/ethernet/stmicro/stmmac/stmmac.ko, because No such file or directory

set_attributes: failed to set time on ./fsroot-vs/usr/lib/modules/6.1.0-29-2-amd64/kernel/drivers/net/ethernet/stmicro/stmmac, because No such file or directory

set_attributes: failed to set time on ./fsroot-vs/usr/lib/modules/6.1.0-29-2-amd64/kernel/drivers/net/ethernet/stmicro, because No such file or directory

set_attributes: failed to set time on ./fsroot-vs/usr/lib/modules/6.1.0-29-2-amd64/kernel/drivers/net/ethernet/sun/cassini.ko, because No such file or directory

set_attributes: failed to set time on ./fsroot-vs/usr/lib/modules/6.1.0-29-2-amd64/kernel/drivers/net/ethernet/sun/niu.ko, because No such file or directory

set_attributes: failed to set time on ./fsroot-vs/usr/lib/modules/6.1.0-29-2-amd64/kernel/drivers/net/ethernet/sun/sungem.ko, because No such file or directory

set_attributes: failed to set time on ./fsroot-vs/usr/lib/modules/6.1.0-29-2-amd64/kernel/drivers/net/ethernet/sun/sunhme.ko, because No such file or directory

set_attributes: failed to set time on ./fsroot-vs/usr/lib/modules/6.1.0-29-2-amd64/kernel/drivers/net/ethernet/sun, because No such file or directory

set_attributes: failed to set time on ./fsroot-vs/usr/lib/modules/6.1.0-29-2-amd64/kernel/drivers/net/ethernet/tehuti/tehuti.ko, because No such file or directory

set_attributes: failed to set time on ./fsroot-vs/usr/lib/modules/6.1.0-29-2-amd64/kernel/drivers/net/ethernet/tehuti, because No such file or directory

set_attributes: failed to set time on ./fsroot-vs/usr/lib/modules/6.1.0-29-2-amd64/kernel/drivers/net/ethernet/ti/tlan.ko, because No such file or directory

set_attributes: failed to set time on ./fsroot-vs/usr/lib/modules/6.1.0-29-2-amd64/kernel/drivers/net/ethernet/ti, because No such file or directory

set_attributes: failed to set time on ./fsroot-vs/usr/lib/modules/6.1.0-29-2-amd64/kernel/drivers/net/ethernet/via/via-rhine.ko, because No such file or directory

set_attributes: failed to set time on ./fsroot-vs/usr/lib/modules/6.1.0-29-2-amd64/kernel/drivers/net/ethernet/via/via-velocity.ko, because No such file or directory

set_attributes: failed to set time on ./fsroot-vs/usr/lib/modules/6.1.0-29-2-amd64/kernel/drivers/net/ethernet/via, because No such file or directory

set_attributes: failed to set time on ./fsroot-vs/usr/lib/modules/6.1.0-29-2-amd64/kernel/drivers/net/ethernet/xircom/xirc2ps_cs.ko, because No such file or directory

set_attributes: failed to set time on ./fsroot-vs/usr/lib/modules/6.1.0-29-2-amd64/kernel/drivers/net/ethernet/xircom, because No such file or directory

set_attributes: failed to set time on ./fsroot-vs/usr/lib/modules/6.1.0-29-2-amd64/kernel/drivers/net/ethernet, because No such file or directory

set_attributes: failed to set time on ./fsroot-vs/usr/lib/modules/6.1.0-29-2-amd64/kernel/drivers/net/fddi/defxx.ko, because No such file or directory

set_attributes: failed to set time on ./fsroot-vs/usr/lib/modules/6.1.0-29-2-amd64/kernel/drivers/net/fddi/skfp/skfp.ko, because No such file or directory

set_attributes: failed to set time on ./fsroot-vs/usr/lib/modules/6.1.0-29-2-amd64/kernel/drivers/net/fddi/skfp, because No such file or directory

set_attributes: failed to set time on ./fsroot-vs/usr/lib/modules/6.1.0-29-2-amd64/kernel/drivers/net/fddi, because No such file or directory

set_attributes: failed to set time on ./fsroot-vs/usr/lib/modules/6.1.0-29-2-amd64/kernel/drivers/net/fjes/fjes.ko, because No such file or directory

set_attributes: failed to set time on ./fsroot-vs/usr/lib/modules/6.1.0-29-2-amd64/kernel/drivers/net/fjes, because No such file or directory

set_attributes: failed to set time on ./fsroot-vs/usr/lib/modules/6.1.0-29-2-amd64/kernel/drivers/net/geneve.ko, because No such file or directory

set_attributes: failed to set time on ./fsroot-vs/usr/lib/modules/6.1.0-29-2-amd64/kernel/drivers/net/gtp.ko, because No such file or directory

set_attributes: failed to set time on ./fsroot-vs/usr/lib/modules/6.1.0-29-2-amd64/kernel/drivers/net/hamradio/6pack.ko, because No such file or directory

set_attributes: failed to set time on ./fsroot-vs/usr/lib/modules/6.1.0-29-2-amd64/kernel/drivers/net/hamradio/baycom_par.ko, because No such file or directory

set_attributes: failed to set time on ./fsroot-vs/usr/lib/modules/6.1.0-29-2-amd64/kernel/drivers/net/hamradio/baycom_ser_fdx.ko, because No such file or directory

set_attributes: failed to set time on ./fsroot-vs/usr/lib/modules/6.1.0-29-2-amd64/kernel/drivers/net/hamradio/baycom_ser_hdx.ko, because No such file or directory

set_attributes: failed to set time on ./fsroot-vs/usr/lib/modules/6.1.0-29-2-amd64/kernel/drivers/net/hamradio/bpqether.ko, because No such file or directory

set_attributes: failed to set time on ./fsroot-vs/usr/lib/modules/6.1.0-29-2-amd64/kernel/drivers/net/hamradio/hdlcdrv.ko, because No such file or directory

set_attributes: failed to set time on ./fsroot-vs/usr/lib/modules/6.1.0-29-2-amd64/kernel/drivers/net/hamradio/mkiss.ko, because No such file or directory

set_attributes: failed to set time on ./fsroot-vs/usr/lib/modules/6.1.0-29-2-amd64/kernel/drivers/net/hamradio/yam.ko, because No such file or directory

set_attributes: failed to set time on ./fsroot-vs/usr/lib/modules/6.1.0-29-2-amd64/kernel/drivers/net/hamradio, because No such file or directory

set_attributes: failed to set time on ./fsroot-vs/usr/lib/modules/6.1.0-29-2-amd64/kernel/drivers/net/hippi/rrunner.ko, because No such file or directory

set_attributes: failed to set time on ./fsroot-vs/usr/lib/modules/6.1.0-29-2-amd64/kernel/drivers/net/hippi, because No such file or directory

set_attributes: failed to set time on ./fsroot-vs/usr/lib/modules/6.1.0-29-2-amd64/kernel/drivers/net/hyperv/hv_netvsc.ko, because No such file or directory

set_attributes: failed to set time on ./fsroot-vs/usr/lib/modules/6.1.0-29-2-amd64/kernel/drivers/net/hyperv, because No such file or directory

set_attributes: failed to set time on ./fsroot-vs/usr/lib/modules/6.1.0-29-2-amd64/kernel/drivers/net/ieee802154/adf7242.ko, because No such file or directory

set_attributes: failed to set time on ./fsroot-vs/usr/lib/modules/6.1.0-29-2-amd64/kernel/drivers/net/ieee802154/at86rf230.ko, because No such file or directory

set_attributes: failed to set time on ./fsroot-vs/usr/lib/modules/6.1.0-29-2-amd64/kernel/drivers/net/ieee802154/atusb.ko, because No such file or directory

set_attributes: failed to set time on ./fsroot-vs/usr/lib/modules/6.1.0-29-2-amd64/kernel/drivers/net/ieee802154/cc2520.ko, because No such file or directory

set_attributes: failed to set time on ./fsroot-vs/usr/lib/modules/6.1.0-29-2-amd64/kernel/drivers/net/ieee802154/fakelb.ko, because No such file or directory

set_attributes: failed to set time on ./fsroot-vs/usr/lib/modules/6.1.0-29-2-amd64/kernel/drivers/net/ieee802154/mac802154_hwsim.ko, because No such file or directory

set_attributes: failed to set time on ./fsroot-vs/usr/lib/modules/6.1.0-29-2-amd64/kernel/drivers/net/ieee802154/mrf24j40.ko, because No such file or directory

set_attributes: failed to set time on ./fsroot-vs/usr/lib/modules/6.1.0-29-2-amd64/kernel/drivers/net/ieee802154, because No such file or directory

set_attributes: failed to set time on ./fsroot-vs/usr/lib/modules/6.1.0-29-2-amd64/kernel/drivers/net/ifb.ko, because No such file or directory

set_attributes: failed to set time on ./fsroot-vs/usr/lib/modules/6.1.0-29-2-amd64/kernel/drivers/net/ipvlan/ipvlan.ko, because No such file or directory

set_attributes: failed to set time on ./fsroot-vs/usr/lib/modules/6.1.0-29-2-amd64/kernel/drivers/net/ipvlan/ipvtap.ko, because No such file or directory

set_attributes: failed to set time on ./fsroot-vs/usr/lib/modules/6.1.0-29-2-amd64/kernel/drivers/net/ipvlan, because No such file or directory

set_attributes: failed to set time on ./fsroot-vs/usr/lib/modules/6.1.0-29-2-amd64/kernel/drivers/net/macsec.ko, because No such file or directory

set_attributes: failed to set time on ./fsroot-vs/usr/lib/modules/6.1.0-29-2-amd64/kernel/drivers/net/macvlan.ko, because No such file or directory

set_attributes: failed to set time on ./fsroot-vs/usr/lib/modules/6.1.0-29-2-amd64/kernel/drivers/net/macvtap.ko, because No such file or directory

set_attributes: failed to set time on ./fsroot-vs/usr/lib/modules/6.1.0-29-2-amd64/kernel/drivers/net/mctp/mctp-i2c.ko, because No such file or directory

set_attributes: failed to set time on ./fsroot-vs/usr/lib/modules/6.1.0-29-2-amd64/kernel/drivers/net/mctp, because No such file or directory

set_attributes: failed to set time on ./fsroot-vs/usr/lib/modules/6.1.0-29-2-amd64/kernel/drivers/net/mdio/acpi_mdio.ko, because No such file or directory

set_attributes: failed to set time on ./fsroot-vs/usr/lib/modules/6.1.0-29-2-amd64/kernel/drivers/net/mdio/fwnode_mdio.ko, because No such file or directory

set_attributes: failed to set time on ./fsroot-vs/usr/lib/modules/6.1.0-29-2-amd64/kernel/drivers/net/mdio/mdio-bitbang.ko, because No such file or directory

set_attributes: failed to set time on ./fsroot-vs/usr/lib/modules/6.1.0-29-2-amd64/kernel/drivers/net/mdio/mdio-gpio.ko, because No such file or directory

set_attributes: failed to set time on ./fsroot-vs/usr/lib/modules/6.1.0-29-2-amd64/kernel/drivers/net/mdio/mdio-i2c.ko, because No such file or directory

set_attributes: failed to set time on ./fsroot-vs/usr/lib/modules/6.1.0-29-2-amd64/kernel/drivers/net/mdio/mdio-mux-gpio.ko, because No such file or directory

set_attributes: failed to set time on ./fsroot-vs/usr/lib/modules/6.1.0-29-2-amd64/kernel/drivers/net/mdio/mdio-mux.ko, because No such file or directory

set_attributes: failed to set time on ./fsroot-vs/usr/lib/modules/6.1.0-29-2-amd64/kernel/drivers/net/mdio/of_mdio.ko, because No such file or directory

set_attributes: failed to set time on ./fsroot-vs/usr/lib/modules/6.1.0-29-2-amd64/kernel/drivers/net/mdio, because No such file or directory

set_attributes: failed to set time on ./fsroot-vs/usr/lib/modules/6.1.0-29-2-amd64/kernel/drivers/net/mdio.ko, because No such file or directory

set_attributes: failed to set time on ./fsroot-vs/usr/lib/modules/6.1.0-29-2-amd64/kernel/drivers/net/mhi_net.ko, because No such file or directory

set_attributes: failed to set time on ./fsroot-vs/usr/lib/modules/6.1.0-29-2-amd64/kernel/drivers/net/mii.ko, because No such file or directory

set_attributes: failed to set time on ./fsroot-vs/usr/lib/modules/6.1.0-29-2-amd64/kernel/drivers/net/net_failover.ko, because No such file or directory

set_attributes: failed to set time on ./fsroot-vs/usr/lib/modules/6.1.0-29-2-amd64/kernel/drivers/net/netconsole.ko, because No such file or directory

set_attributes: failed to set time on ./fsroot-vs/usr/lib/modules/6.1.0-29-2-amd64/kernel/drivers/net/nlmon.ko, because No such file or directory

set_attributes: failed to set time on ./fsroot-vs/usr/lib/modules/6.1.0-29-2-amd64/kernel/drivers/net/pcs/pcs_xpcs.ko, because No such file or directory

set_attributes: failed to set time on ./fsroot-vs/usr/lib/modules/6.1.0-29-2-amd64/kernel/drivers/net/pcs, because No such file or directory

set_attributes: failed to set time on ./fsroot-vs/usr/lib/modules/6.1.0-29-2-amd64/kernel/drivers/net/phy/amd.ko, because No such file or directory

set_attributes: failed to set time on ./fsroot-vs/usr/lib/modules/6.1.0-29-2-amd64/kernel/drivers/net/phy/aquantia.ko, because No such file or directory

set_attributes: failed to set time on ./fsroot-vs/usr/lib/modules/6.1.0-29-2-amd64/kernel/drivers/net/phy/at803x.ko, because No such file or directory

set_attributes: failed to set time on ./fsroot-vs/usr/lib/modules/6.1.0-29-2-amd64/kernel/drivers/net/phy/ax88796b.ko, because No such file or directory

set_attributes: failed to set time on ./fsroot-vs/usr/lib/modules/6.1.0-29-2-amd64/kernel/drivers/net/phy/bcm-phy-lib.ko, because No such file or directory

set_attributes: failed to set time on ./fsroot-vs/usr/lib/modules/6.1.0-29-2-amd64/kernel/drivers/net/phy/bcm-phy-ptp.ko, because No such file or directory

set_attributes: failed to set time on ./fsroot-vs/usr/lib/modules/6.1.0-29-2-amd64/kernel/drivers/net/phy/bcm87xx.ko, because No such file or directory

set_attributes: failed to set time on ./fsroot-vs/usr/lib/modules/6.1.0-29-2-amd64/kernel/drivers/net/phy/broadcom.ko, because No such file or directory

set_attributes: failed to set time on ./fsroot-vs/usr/lib/modules/6.1.0-29-2-amd64/kernel/drivers/net/phy/cicada.ko, because No such file or directory

set_attributes: failed to set time on ./fsroot-vs/usr/lib/modules/6.1.0-29-2-amd64/kernel/drivers/net/phy/cortina.ko, because No such file or directory

set_attributes: failed to set time on ./fsroot-vs/usr/lib/modules/6.1.0-29-2-amd64/kernel/drivers/net/phy/davicom.ko, because No such file or directory

set_attributes: failed to set time on ./fsroot-vs/usr/lib/modules/6.1.0-29-2-amd64/kernel/drivers/net/phy/dp83640.ko, because No such file or directory

set_attributes: failed to set time on ./fsroot-vs/usr/lib/modules/6.1.0-29-2-amd64/kernel/drivers/net/phy/dp83822.ko, because No such file or directory

set_attributes: failed to set time on ./fsroot-vs/usr/lib/modules/6.1.0-29-2-amd64/kernel/drivers/net/phy/dp83848.ko, because No such file or directory

set_attributes: failed to set time on ./fsroot-vs/usr/lib/modules/6.1.0-29-2-amd64/kernel/drivers/net/phy/dp83867.ko, because No such file or directory

set_attributes: failed to set time on ./fsroot-vs/usr/lib/modules/6.1.0-29-2-amd64/kernel/drivers/net/phy/dp83tc811.ko, because No such file or directory

set_attributes: failed to set time on ./fsroot-vs/usr/lib/modules/6.1.0-29-2-amd64/kernel/drivers/net/phy/et1011c.ko, because No such file or directory

set_attributes: failed to set time on ./fsroot-vs/usr/lib/modules/6.1.0-29-2-amd64/kernel/drivers/net/phy/fixed_phy.ko, because No such file or directory

set_attributes: failed to set time on ./fsroot-vs/usr/lib/modules/6.1.0-29-2-amd64/kernel/drivers/net/phy/icplus.ko, because No such file or directory

set_attributes: failed to set time on ./fsroot-vs/usr/lib/modules/6.1.0-29-2-amd64/kernel/drivers/net/phy/libphy.ko, because No such file or directory

set_attributes: failed to set time on ./fsroot-vs/usr/lib/modules/6.1.0-29-2-amd64/kernel/drivers/net/phy/lxt.ko, because No such file or directory

set_attributes: failed to set time on ./fsroot-vs/usr/lib/modules/6.1.0-29-2-amd64/kernel/drivers/net/phy/marvell.ko, because No such file or directory

set_attributes: failed to set time on ./fsroot-vs/usr/lib/modules/6.1.0-29-2-amd64/kernel/drivers/net/phy/marvell10g.ko, because No such file or directory

set_attributes: failed to set time on ./fsroot-vs/usr/lib/modules/6.1.0-29-2-amd64/kernel/drivers/net/phy/mdio_devres.ko, because No such file or directory

set_attributes: failed to set time on ./fsroot-vs/usr/lib/modules/6.1.0-29-2-amd64/kernel/drivers/net/phy/micrel.ko, because No such file or directory

set_attributes: failed to set time on ./fsroot-vs/usr/lib/modules/6.1.0-29-2-amd64/kernel/drivers/net/phy/microchip.ko, because No such file or directory

set_attributes: failed to set time on ./fsroot-vs/usr/lib/modules/6.1.0-29-2-amd64/kernel/drivers/net/phy/microchip_t1.ko, because No such file or directory

set_attributes: failed to set time on ./fsroot-vs/usr/lib/modules/6.1.0-29-2-amd64/kernel/drivers/net/phy/mscc/mscc.ko, because No such file or directory

set_attributes: failed to set time on ./fsroot-vs/usr/lib/modules/6.1.0-29-2-amd64/kernel/drivers/net/phy/mscc, because No such file or directory

set_attributes: failed to set time on ./fsroot-vs/usr/lib/modules/6.1.0-29-2-amd64/kernel/drivers/net/phy/national.ko, because No such file or directory

set_attributes: failed to set time on ./fsroot-vs/usr/lib/modules/6.1.0-29-2-amd64/kernel/drivers/net/phy/phylink.ko, because No such file or directory

set_attributes: failed to set time on ./fsroot-vs/usr/lib/modules/6.1.0-29-2-amd64/kernel/drivers/net/phy/qsemi.ko, because No such file or directory

set_attributes: failed to set time on ./fsroot-vs/usr/lib/modules/6.1.0-29-2-amd64/kernel/drivers/net/phy/realtek.ko, because No such file or directory

set_attributes: failed to set time on ./fsroot-vs/usr/lib/modules/6.1.0-29-2-amd64/kernel/drivers/net/phy/rockchip.ko, because No such file or directory

set_attributes: failed to set time on ./fsroot-vs/usr/lib/modules/6.1.0-29-2-amd64/kernel/drivers/net/phy/sfp.ko, because No such file or directory

set_attributes: failed to set time on ./fsroot-vs/usr/lib/modules/6.1.0-29-2-amd64/kernel/drivers/net/phy/smsc.ko, because No such file or directory

set_attributes: failed to set time on ./fsroot-vs/usr/lib/modules/6.1.0-29-2-amd64/kernel/drivers/net/phy/ste10Xp.ko, because No such file or directory

set_attributes: failed to set time on ./fsroot-vs/usr/lib/modules/6.1.0-29-2-amd64/kernel/drivers/net/phy/teranetics.ko, because No such file or directory

set_attributes: failed to set time on ./fsroot-vs/usr/lib/modules/6.1.0-29-2-amd64/kernel/drivers/net/phy/uPD60620.ko, because No such file or directory

set_attributes: failed to set time on ./fsroot-vs/usr/lib/modules/6.1.0-29-2-amd64/kernel/drivers/net/phy/vitesse.ko, because No such file or directory

set_attributes: failed to set time on ./fsroot-vs/usr/lib/modules/6.1.0-29-2-amd64/kernel/drivers/net/phy, because No such file or directory

set_attributes: failed to set time on ./fsroot-vs/usr/lib/modules/6.1.0-29-2-amd64/kernel/drivers/net/plip/plip.ko, because No such file or directory

set_attributes: failed to set time on ./fsroot-vs/usr/lib/modules/6.1.0-29-2-amd64/kernel/drivers/net/plip, because No such file or directory

set_attributes: failed to set time on ./fsroot-vs/usr/lib/modules/6.1.0-29-2-amd64/kernel/drivers/net/ppp/bsd_comp.ko, because No such file or directory

set_attributes: failed to set time on ./fsroot-vs/usr/lib/modules/6.1.0-29-2-amd64/kernel/drivers/net/ppp/ppp_async.ko, because No such file or directory

set_attributes: failed to set time on ./fsroot-vs/usr/lib/modules/6.1.0-29-2-amd64/kernel/drivers/net/ppp/ppp_deflate.ko, because No such file or directory

set_attributes: failed to set time on ./fsroot-vs/usr/lib/modules/6.1.0-29-2-amd64/kernel/drivers/net/ppp/ppp_generic.ko, because No such file or directory

set_attributes: failed to set time on ./fsroot-vs/usr/lib/modules/6.1.0-29-2-amd64/kernel/drivers/net/ppp/ppp_mppe.ko, because No such file or directory

set_attributes: failed to set time on ./fsroot-vs/usr/lib/modules/6.1.0-29-2-amd64/kernel/drivers/net/ppp/ppp_synctty.ko, because No such file or directory

set_attributes: failed to set time on ./fsroot-vs/usr/lib/modules/6.1.0-29-2-amd64/kernel/drivers/net/ppp/pppoe.ko, because No such file or directory

set_attributes: failed to set time on ./fsroot-vs/usr/lib/modules/6.1.0-29-2-amd64/kernel/drivers/net/ppp/pppox.ko, because No such file or directory

set_attributes: failed to set time on ./fsroot-vs/usr/lib/modules/6.1.0-29-2-amd64/kernel/drivers/net/ppp/pptp.ko, because No such file or directory

set_attributes: failed to set time on ./fsroot-vs/usr/lib/modules/6.1.0-29-2-amd64/kernel/drivers/net/ppp, because No such file or directory

set_attributes: failed to set time on ./fsroot-vs/usr/lib/modules/6.1.0-29-2-amd64/kernel/drivers/net/sb1000.ko, because No such file or directory

set_attributes: failed to set time on ./fsroot-vs/usr/lib/modules/6.1.0-29-2-amd64/kernel/drivers/net/slip/slhc.ko, because No such file or directory

set_attributes: failed to set time on ./fsroot-vs/usr/lib/modules/6.1.0-29-2-amd64/kernel/drivers/net/slip/slip.ko, because No such file or directory

set_attributes: failed to set time on ./fsroot-vs/usr/lib/modules/6.1.0-29-2-amd64/kernel/drivers/net/slip, because No such file or directory

set_attributes: failed to set time on ./fsroot-vs/usr/lib/modules/6.1.0-29-2-amd64/kernel/drivers/net/sungem_phy.ko, because No such file or directory

set_attributes: failed to set time on ./fsroot-vs/usr/lib/modules/6.1.0-29-2-amd64/kernel/drivers/net/tap.ko, because No such file or directory

set_attributes: failed to set time on ./fsroot-vs/usr/lib/modules/6.1.0-29-2-amd64/kernel/drivers/net/team/team.ko, because No such file or directory

set_attributes: failed to set time on ./fsroot-vs/usr/lib/modules/6.1.0-29-2-amd64/kernel/drivers/net/team/team_mode_activebackup.ko, because No such file or directory

set_attributes: failed to set time on ./fsroot-vs/usr/lib/modules/6.1.0-29-2-amd64/kernel/drivers/net/team/team_mode_broadcast.ko, because No such file or directory

set_attributes: failed to set time on ./fsroot-vs/usr/lib/modules/6.1.0-29-2-amd64/kernel/drivers/net/team/team_mode_loadbalance.ko, because No such file or directory

set_attributes: failed to set time on ./fsroot-vs/usr/lib/modules/6.1.0-29-2-amd64/kernel/drivers/net/team/team_mode_random.ko, because No such file or directory

set_attributes: failed to set time on ./fsroot-vs/usr/lib/modules/6.1.0-29-2-amd64/kernel/drivers/net/team/team_mode_roundrobin.ko, because No such file or directory

set_attributes: failed to set time on ./fsroot-vs/usr/lib/modules/6.1.0-29-2-amd64/kernel/drivers/net/team, because No such file or directory

set_attributes: failed to set time on ./fsroot-vs/usr/lib/modules/6.1.0-29-2-amd64/kernel/drivers/net/thunderbolt-net.ko, because No such file or directory

set_attributes: failed to set time on ./fsroot-vs/usr/lib/modules/6.1.0-29-2-amd64/kernel/drivers/net/tun.ko, because No such file or directory

set_attributes: failed to set time on ./fsroot-vs/usr/lib/modules/6.1.0-29-2-amd64/kernel/drivers/net/usb/aqc111.ko, because No such file or directory

set_attributes: failed to set time on ./fsroot-vs/usr/lib/modules/6.1.0-29-2-amd64/kernel/drivers/net/usb/asix.ko, because No such file or directory

set_attributes: failed to set time on ./fsroot-vs/usr/lib/modules/6.1.0-29-2-amd64/kernel/drivers/net/usb/ax88179_178a.ko, because No such file or directory

set_attributes: failed to set time on ./fsroot-vs/usr/lib/modules/6.1.0-29-2-amd64/kernel/drivers/net/usb/catc.ko, because No such file or directory

set_attributes: failed to set time on ./fsroot-vs/usr/lib/modules/6.1.0-29-2-amd64/kernel/drivers/net/usb/cdc-phonet.ko, because No such file or directory

set_attributes: failed to set time on ./fsroot-vs/usr/lib/modules/6.1.0-29-2-amd64/kernel/drivers/net/usb/cdc_eem.ko, because No such file or directory

set_attributes: failed to set time on ./fsroot-vs/usr/lib/modules/6.1.0-29-2-amd64/kernel/drivers/net/usb/cdc_ether.ko, because No such file or directory

set_attributes: failed to set time on ./fsroot-vs/usr/lib/modules/6.1.0-29-2-amd64/kernel/drivers/net/usb/cdc_mbim.ko, because No such file or directory

set_attributes: failed to set time on ./fsroot-vs/usr/lib/modules/6.1.0-29-2-amd64/kernel/drivers/net/usb/cdc_ncm.ko, because No such file or directory

set_attributes: failed to set time on ./fsroot-vs/usr/lib/modules/6.1.0-29-2-amd64/kernel/drivers/net/usb/cdc_subset.ko, because No such file or directory

set_attributes: failed to set time on ./fsroot-vs/usr/lib/modules/6.1.0-29-2-amd64/kernel/drivers/net/usb/ch9200.ko, because No such file or directory

set_attributes: failed to set time on ./fsroot-vs/usr/lib/modules/6.1.0-29-2-amd64/kernel/drivers/net/usb/cx82310_eth.ko, because No such file or directory

set_attributes: failed to set time on ./fsroot-vs/usr/lib/modules/6.1.0-29-2-amd64/kernel/drivers/net/usb/dm9601.ko, because No such file or directory

set_attributes: failed to set time on ./fsroot-vs/usr/lib/modules/6.1.0-29-2-amd64/kernel/drivers/net/usb/gl620a.ko, because No such file or directory

set_attributes: failed to set time on ./fsroot-vs/usr/lib/modules/6.1.0-29-2-amd64/kernel/drivers/net/usb/hso.ko, because No such file or directory

set_attributes: failed to set time on ./fsroot-vs/usr/lib/modules/6.1.0-29-2-amd64/kernel/drivers/net/usb/huawei_cdc_ncm.ko, because No such file or directory

set_attributes: failed to set time on ./fsroot-vs/usr/lib/modules/6.1.0-29-2-amd64/kernel/drivers/net/usb/int51x1.ko, because No such file or directory

set_attributes: failed to set time on ./fsroot-vs/usr/lib/modules/6.1.0-29-2-amd64/kernel/drivers/net/usb/ipheth.ko, because No such file or directory

set_attributes: failed to set time on ./fsroot-vs/usr/lib/modules/6.1.0-29-2-amd64/kernel/drivers/net/usb/kalmia.ko, because No such file or directory

set_attributes: failed to set time on ./fsroot-vs/usr/lib/modules/6.1.0-29-2-amd64/kernel/drivers/net/usb/kaweth.ko, because No such file or directory

set_attributes: failed to set time on ./fsroot-vs/usr/lib/modules/6.1.0-29-2-amd64/kernel/drivers/net/usb/lan78xx.ko, because No such file or directory

set_attributes: failed to set time on ./fsroot-vs/usr/lib/modules/6.1.0-29-2-amd64/kernel/drivers/net/usb/lg-vl600.ko, because No such file or directory

set_attributes: failed to set time on ./fsroot-vs/usr/lib/modules/6.1.0-29-2-amd64/kernel/drivers/net/usb/mcs7830.ko, because No such file or directory

set_attributes: failed to set time on ./fsroot-vs/usr/lib/modules/6.1.0-29-2-amd64/kernel/drivers/net/usb/net1080.ko, because No such file or directory

set_attributes: failed to set time on ./fsroot-vs/usr/lib/modules/6.1.0-29-2-amd64/kernel/drivers/net/usb/pegasus.ko, because No such file or directory

set_attributes: failed to set time on ./fsroot-vs/usr/lib/modules/6.1.0-29-2-amd64/kernel/drivers/net/usb/plusb.ko, because No such file or directory

set_attributes: failed to set time on ./fsroot-vs/usr/lib/modules/6.1.0-29-2-amd64/kernel/drivers/net/usb/qmi_wwan.ko, because No such file or directory

set_attributes: failed to set time on ./fsroot-vs/usr/lib/modules/6.1.0-29-2-amd64/kernel/drivers/net/usb/r8152.ko, because No such file or directory

set_attributes: failed to set time on ./fsroot-vs/usr/lib/modules/6.1.0-29-2-amd64/kernel/drivers/net/usb/r8153_ecm.ko, because No such file or directory

set_attributes: failed to set time on ./fsroot-vs/usr/lib/modules/6.1.0-29-2-amd64/kernel/drivers/net/usb/rndis_host.ko, because No such file or directory

set_attributes: failed to set time on ./fsroot-vs/usr/lib/modules/6.1.0-29-2-amd64/kernel/drivers/net/usb/rtl8150.ko, because No such file or directory

set_attributes: failed to set time on ./fsroot-vs/usr/lib/modules/6.1.0-29-2-amd64/kernel/drivers/net/usb/sierra_net.ko, because No such file or directory

set_attributes: failed to set time on ./fsroot-vs/usr/lib/modules/6.1.0-29-2-amd64/kernel/drivers/net/usb/smsc75xx.ko, because No such file or directory

set_attributes: failed to set time on ./fsroot-vs/usr/lib/modules/6.1.0-29-2-amd64/kernel/drivers/net/usb/smsc95xx.ko, because No such file or directory

set_attributes: failed to set time on ./fsroot-vs/usr/lib/modules/6.1.0-29-2-amd64/kernel/drivers/net/usb/sr9700.ko, because No such file or directory

set_attributes: failed to set time on ./fsroot-vs/usr/lib/modules/6.1.0-29-2-amd64/kernel/drivers/net/usb/sr9800.ko, because No such file or directory

set_attributes: failed to set time on ./fsroot-vs/usr/lib/modules/6.1.0-29-2-amd64/kernel/drivers/net/usb/usbnet.ko, because No such file or directory

set_attributes: failed to set time on ./fsroot-vs/usr/lib/modules/6.1.0-29-2-amd64/kernel/drivers/net/usb/zaurus.ko, because No such file or directory

set_attributes: failed to set time on ./fsroot-vs/usr/lib/modules/6.1.0-29-2-amd64/kernel/drivers/net/usb, because No such file or directory

set_attributes: failed to set time on ./fsroot-vs/usr/lib/modules/6.1.0-29-2-amd64/kernel/drivers/net/veth.ko, because No such file or directory

set_attributes: failed to set time on ./fsroot-vs/usr/lib/modules/6.1.0-29-2-amd64/kernel/drivers/net/virtio_net.ko, because No such file or directory

set_attributes: failed to set time on ./fsroot-vs/usr/lib/modules/6.1.0-29-2-amd64/kernel/drivers/net/vmxnet3/vmxnet3.ko, because No such file or directory

set_attributes: failed to set time on ./fsroot-vs/usr/lib/modules/6.1.0-29-2-amd64/kernel/drivers/net/vmxnet3, because No such file or directory

set_attributes: failed to set time on ./fsroot-vs/usr/lib/modules/6.1.0-29-2-amd64/kernel/drivers/net/vrf.ko, because No such file or directory

set_attributes: failed to set time on ./fsroot-vs/usr/lib/modules/6.1.0-29-2-amd64/kernel/drivers/net/vsockmon.ko, because No such file or directory

set_attributes: failed to set time on ./fsroot-vs/usr/lib/modules/6.1.0-29-2-amd64/kernel/drivers/net/vxlan/vxlan.ko, because No such file or directory

set_attributes: failed to set time on ./fsroot-vs/usr/lib/modules/6.1.0-29-2-amd64/kernel/drivers/net/vxlan, because No such file or directory

set_attributes: failed to set time on ./fsroot-vs/usr/lib/modules/6.1.0-29-2-amd64/kernel/drivers/net/wan/farsync.ko, because No such file or directory

set_attributes: failed to set time on ./fsroot-vs/usr/lib/modules/6.1.0-29-2-amd64/kernel/drivers/net/wan/hdlc.ko, because No such file or directory

set_attributes: failed to set time on ./fsroot-vs/usr/lib/modules/6.1.0-29-2-amd64/kernel/drivers/net/wan/hdlc_cisco.ko, because No such file or directory

set_attributes: failed to set time on ./fsroot-vs/usr/lib/modules/6.1.0-29-2-amd64/kernel/drivers/net/wan/hdlc_fr.ko, because No such file or directory

set_attributes: failed to set time on ./fsroot-vs/usr/lib/modules/6.1.0-29-2-amd64/kernel/drivers/net/wan/hdlc_ppp.ko, because No such file or directory

set_attributes: failed to set time on ./fsroot-vs/usr/lib/modules/6.1.0-29-2-amd64/kernel/drivers/net/wan/hdlc_raw.ko, because No such file or directory

set_attributes: failed to set time on ./fsroot-vs/usr/lib/modules/6.1.0-29-2-amd64/kernel/drivers/net/wan/hdlc_raw_eth.ko, because No such file or directory

set_attributes: failed to set time on ./fsroot-vs/usr/lib/modules/6.1.0-29-2-amd64/kernel/drivers/net/wan/pci200syn.ko, because No such file or directory

set_attributes: failed to set time on ./fsroot-vs/usr/lib/modules/6.1.0-29-2-amd64/kernel/drivers/net/wan/wanxl.ko, because No such file or directory

set_attributes: failed to set time on ./fsroot-vs/usr/lib/modules/6.1.0-29-2-amd64/kernel/drivers/net/wan, because No such file or directory

set_attributes: failed to set time on ./fsroot-vs/usr/lib/modules/6.1.0-29-2-amd64/kernel/drivers/net/wireguard/wireguard.ko, because No such file or directory

set_attributes: failed to set time on ./fsroot-vs/usr/lib/modules/6.1.0-29-2-amd64/kernel/drivers/net/wireguard, because No such file or directory

set_attributes: failed to set time on ./fsroot-vs/usr/lib/modules/6.1.0-29-2-amd64/kernel/drivers/net/wireless/admtek/adm8211.ko, because No such file or directory

set_attributes: failed to set time on ./fsroot-vs/usr/lib/modules/6.1.0-29-2-amd64/kernel/drivers/net/wireless/admtek, because No such file or directory

set_attributes: failed to set time on ./fsroot-vs/usr/lib/modules/6.1.0-29-2-amd64/kernel/drivers/net/wireless/ath/ar5523/ar5523.ko, because No such file or directory

set_attributes: failed to set time on ./fsroot-vs/usr/lib/modules/6.1.0-29-2-amd64/kernel/drivers/net/wireless/ath/ar5523, because No such file or directory

set_attributes: failed to set time on ./fsroot-vs/usr/lib/modules/6.1.0-29-2-amd64/kernel/drivers/net/wireless/ath/ath.ko, because No such file or directory

set_attributes: failed to set time on ./fsroot-vs/usr/lib/modules/6.1.0-29-2-amd64/kernel/drivers/net/wireless/ath/ath10k/ath10k_core.ko, because No such file or directory

set_attributes: failed to set time on ./fsroot-vs/usr/lib/modules/6.1.0-29-2-amd64/kernel/drivers/net/wireless/ath/ath10k/ath10k_pci.ko, because No such file or directory

set_attributes: failed to set time on ./fsroot-vs/usr/lib/modules/6.1.0-29-2-amd64/kernel/drivers/net/wireless/ath/ath10k/ath10k_usb.ko, because No such file or directory

set_attributes: failed to set time on ./fsroot-vs/usr/lib/modules/6.1.0-29-2-amd64/kernel/drivers/net/wireless/ath/ath10k, because No such file or directory

set_attributes: failed to set time on ./fsroot-vs/usr/lib/modules/6.1.0-29-2-amd64/kernel/drivers/net/wireless/ath/ath11k/ath11k.ko, because No such file or directory

set_attributes: failed to set time on ./fsroot-vs/usr/lib/modules/6.1.0-29-2-amd64/kernel/drivers/net/wireless/ath/ath11k/ath11k_pci.ko, because No such file or directory

set_attributes: failed to set time on ./fsroot-vs/usr/lib/modules/6.1.0-29-2-amd64/kernel/drivers/net/wireless/ath/ath11k, because No such file or directory

set_attributes: failed to set time on ./fsroot-vs/usr/lib/modules/6.1.0-29-2-amd64/kernel/drivers/net/wireless/ath/ath5k/ath5k.ko, because No such file or directory

set_attributes: failed to set time on ./fsroot-vs/usr/lib/modules/6.1.0-29-2-amd64/kernel/drivers/net/wireless/ath/ath5k, because No such file or directory

set_attributes: failed to set time on ./fsroot-vs/usr/lib/modules/6.1.0-29-2-amd64/kernel/drivers/net/wireless/ath/ath6kl/ath6kl_core.ko, because No such file or directory

set_attributes: failed to set time on ./fsroot-vs/usr/lib/modules/6.1.0-29-2-amd64/kernel/drivers/net/wireless/ath/ath6kl/ath6kl_sdio.ko, because No such file or directory

set_attributes: failed to set time on ./fsroot-vs/usr/lib/modules/6.1.0-29-2-amd64/kernel/drivers/net/wireless/ath/ath6kl/ath6kl_usb.ko, because No such file or directory

set_attributes: failed to set time on ./fsroot-vs/usr/lib/modules/6.1.0-29-2-amd64/kernel/drivers/net/wireless/ath/ath6kl, because No such file or directory

set_attributes: failed to set time on ./fsroot-vs/usr/lib/modules/6.1.0-29-2-amd64/kernel/drivers/net/wireless/ath/ath9k/ath9k.ko, because No such file or directory

set_attributes: failed to set time on ./fsroot-vs/usr/lib/modules/6.1.0-29-2-amd64/kernel/drivers/net/wireless/ath/ath9k/ath9k_common.ko, because No such file or directory

set_attributes: failed to set time on ./fsroot-vs/usr/lib/modules/6.1.0-29-2-amd64/kernel/drivers/net/wireless/ath/ath9k/ath9k_htc.ko, because No such file or directory

set_attributes: failed to set time on ./fsroot-vs/usr/lib/modules/6.1.0-29-2-amd64/kernel/drivers/net/wireless/ath/ath9k/ath9k_hw.ko, because No such file or directory

set_attributes: failed to set time on ./fsroot-vs/usr/lib/modules/6.1.0-29-2-amd64/kernel/drivers/net/wireless/ath/ath9k, because No such file or directory

set_attributes: failed to set time on ./fsroot-vs/usr/lib/modules/6.1.0-29-2-amd64/kernel/drivers/net/wireless/ath/carl9170/carl9170.ko, because No such file or directory

set_attributes: failed to set time on ./fsroot-vs/usr/lib/modules/6.1.0-29-2-amd64/kernel/drivers/net/wireless/ath/carl9170, because No such file or directory

set_attributes: failed to set time on ./fsroot-vs/usr/lib/modules/6.1.0-29-2-amd64/kernel/drivers/net/wireless/ath/wil6210/wil6210.ko, because No such file or directory

set_attributes: failed to set time on ./fsroot-vs/usr/lib/modules/6.1.0-29-2-amd64/kernel/drivers/net/wireless/ath/wil6210, because No such file or directory

set_attributes: failed to set time on ./fsroot-vs/usr/lib/modules/6.1.0-29-2-amd64/kernel/drivers/net/wireless/ath, because No such file or directory

set_attributes: failed to set time on ./fsroot-vs/usr/lib/modules/6.1.0-29-2-amd64/kernel/drivers/net/wireless/atmel/at76c50x-usb.ko, because No such file or directory

set_attributes: failed to set time on ./fsroot-vs/usr/lib/modules/6.1.0-29-2-amd64/kernel/drivers/net/wireless/atmel/atmel.ko, because No such file or directory

set_attributes: failed to set time on ./fsroot-vs/usr/lib/modules/6.1.0-29-2-amd64/kernel/drivers/net/wireless/atmel/atmel_cs.ko, because No such file or directory

set_attributes: failed to set time on ./fsroot-vs/usr/lib/modules/6.1.0-29-2-amd64/kernel/drivers/net/wireless/atmel/atmel_pci.ko, because No such file or directory

set_attributes: failed to set time on ./fsroot-vs/usr/lib/modules/6.1.0-29-2-amd64/kernel/drivers/net/wireless/atmel, because No such file or directory

set_attributes: failed to set time on ./fsroot-vs/usr/lib/modules/6.1.0-29-2-amd64/kernel/drivers/net/wireless/broadcom/b43/b43.ko, because No such file or directory

set_attributes: failed to set time on ./fsroot-vs/usr/lib/modules/6.1.0-29-2-amd64/kernel/drivers/net/wireless/broadcom/b43, because No such file or directory

set_attributes: failed to set time on ./fsroot-vs/usr/lib/modules/6.1.0-29-2-amd64/kernel/drivers/net/wireless/broadcom/b43legacy/b43legacy.ko, because No such file or directory

set_attributes: failed to set time on ./fsroot-vs/usr/lib/modules/6.1.0-29-2-amd64/kernel/drivers/net/wireless/broadcom/b43legacy, because No such file or directory

set_attributes: failed to set time on ./fsroot-vs/usr/lib/modules/6.1.0-29-2-amd64/kernel/drivers/net/wireless/broadcom/brcm80211/brcmfmac/brcmfmac.ko, because No such file or directory

set_attributes: failed to set time on ./fsroot-vs/usr/lib/modules/6.1.0-29-2-amd64/kernel/drivers/net/wireless/broadcom/brcm80211/brcmfmac, because No such file or directory

set_attributes: failed to set time on ./fsroot-vs/usr/lib/modules/6.1.0-29-2-amd64/kernel/drivers/net/wireless/broadcom/brcm80211/brcmsmac/brcmsmac.ko, because No such file or directory

set_attributes: failed to set time on ./fsroot-vs/usr/lib/modules/6.1.0-29-2-amd64/kernel/drivers/net/wireless/broadcom/brcm80211/brcmsmac, because No such file or directory

set_attributes: failed to set time on ./fsroot-vs/usr/lib/modules/6.1.0-29-2-amd64/kernel/drivers/net/wireless/broadcom/brcm80211/brcmutil/brcmutil.ko, because No such file or directory

set_attributes: failed to set time on ./fsroot-vs/usr/lib/modules/6.1.0-29-2-amd64/kernel/drivers/net/wireless/broadcom/brcm80211/brcmutil, because No such file or directory

set_attributes: failed to set time on ./fsroot-vs/usr/lib/modules/6.1.0-29-2-amd64/kernel/drivers/net/wireless/broadcom/brcm80211, because No such file or directory

set_attributes: failed to set time on ./fsroot-vs/usr/lib/modules/6.1.0-29-2-amd64/kernel/drivers/net/wireless/broadcom, because No such file or directory

set_attributes: failed to set time on ./fsroot-vs/usr/lib/modules/6.1.0-29-2-amd64/kernel/drivers/net/wireless/cisco/airo.ko, because No such file or directory

set_attributes: failed to set time on ./fsroot-vs/usr/lib/modules/6.1.0-29-2-amd64/kernel/drivers/net/wireless/cisco/airo_cs.ko, because No such file or directory

set_attributes: failed to set time on ./fsroot-vs/usr/lib/modules/6.1.0-29-2-amd64/kernel/drivers/net/wireless/cisco, because No such file or directory

set_attributes: failed to set time on ./fsroot-vs/usr/lib/modules/6.1.0-29-2-amd64/kernel/drivers/net/wireless/intel/ipw2x00/ipw2200.ko, because No such file or directory

set_attributes: failed to set time on ./fsroot-vs/usr/lib/modules/6.1.0-29-2-amd64/kernel/drivers/net/wireless/intel/ipw2x00/libipw.ko, because No such file or directory

set_attributes: failed to set time on ./fsroot-vs/usr/lib/modules/6.1.0-29-2-amd64/kernel/drivers/net/wireless/intel/ipw2x00, because No such file or directory

set_attributes: failed to set time on ./fsroot-vs/usr/lib/modules/6.1.0-29-2-amd64/kernel/drivers/net/wireless/intel/iwlegacy/iwl3945.ko, because No such file or directory

set_attributes: failed to set time on ./fsroot-vs/usr/lib/modules/6.1.0-29-2-amd64/kernel/drivers/net/wireless/intel/iwlegacy/iwl4965.ko, because No such file or directory

set_attributes: failed to set time on ./fsroot-vs/usr/lib/modules/6.1.0-29-2-amd64/kernel/drivers/net/wireless/intel/iwlegacy/iwlegacy.ko, because No such file or directory

set_attributes: failed to set time on ./fsroot-vs/usr/lib/modules/6.1.0-29-2-amd64/kernel/drivers/net/wireless/intel/iwlegacy, because No such file or directory

set_attributes: failed to set time on ./fsroot-vs/usr/lib/modules/6.1.0-29-2-amd64/kernel/drivers/net/wireless/intel/iwlwifi/dvm/iwldvm.ko, because No such file or directory

set_attributes: failed to set time on ./fsroot-vs/usr/lib/modules/6.1.0-29-2-amd64/kernel/drivers/net/wireless/intel/iwlwifi/dvm, because No such file or directory

set_attributes: failed to set time on ./fsroot-vs/usr/lib/modules/6.1.0-29-2-amd64/kernel/drivers/net/wireless/intel/iwlwifi/iwlwifi.ko, because No such file or directory

set_attributes: failed to set time on ./fsroot-vs/usr/lib/modules/6.1.0-29-2-amd64/kernel/drivers/net/wireless/intel/iwlwifi/mvm/iwlmvm.ko, because No such file or directory

set_attributes: failed to set time on ./fsroot-vs/usr/lib/modules/6.1.0-29-2-amd64/kernel/drivers/net/wireless/intel/iwlwifi/mvm, because No such file or directory

set_attributes: failed to set time on ./fsroot-vs/usr/lib/modules/6.1.0-29-2-amd64/kernel/drivers/net/wireless/intel/iwlwifi, because No such file or directory

set_attributes: failed to set time on ./fsroot-vs/usr/lib/modules/6.1.0-29-2-amd64/kernel/drivers/net/wireless/intel, because No such file or directory

set_attributes: failed to set time on ./fsroot-vs/usr/lib/modules/6.1.0-29-2-amd64/kernel/drivers/net/wireless/intersil/hostap/hostap.ko, because No such file or directory

set_attributes: failed to set time on ./fsroot-vs/usr/lib/modules/6.1.0-29-2-amd64/kernel/drivers/net/wireless/intersil/hostap/hostap_cs.ko, because No such file or directory

set_attributes: failed to set time on ./fsroot-vs/usr/lib/modules/6.1.0-29-2-amd64/kernel/drivers/net/wireless/intersil/hostap/hostap_pci.ko, because No such file or directory

set_attributes: failed to set time on ./fsroot-vs/usr/lib/modules/6.1.0-29-2-amd64/kernel/drivers/net/wireless/intersil/hostap/hostap_plx.ko, because No such file or directory

set_attributes: failed to set time on ./fsroot-vs/usr/lib/modules/6.1.0-29-2-amd64/kernel/drivers/net/wireless/intersil/hostap, because No such file or directory

set_attributes: failed to set time on ./fsroot-vs/usr/lib/modules/6.1.0-29-2-amd64/kernel/drivers/net/wireless/intersil/orinoco/orinoco.ko, because No such file or directory

set_attributes: failed to set time on ./fsroot-vs/usr/lib/modules/6.1.0-29-2-amd64/kernel/drivers/net/wireless/intersil/orinoco/orinoco_cs.ko, because No such file or directory

set_attributes: failed to set time on ./fsroot-vs/usr/lib/modules/6.1.0-29-2-amd64/kernel/drivers/net/wireless/intersil/orinoco/orinoco_nortel.ko, because No such file or directory

set_attributes: failed to set time on ./fsroot-vs/usr/lib/modules/6.1.0-29-2-amd64/kernel/drivers/net/wireless/intersil/orinoco/orinoco_plx.ko, because No such file or directory

set_attributes: failed to set time on ./fsroot-vs/usr/lib/modules/6.1.0-29-2-amd64/kernel/drivers/net/wireless/intersil/orinoco/orinoco_tmd.ko, because No such file or directory

set_attributes: failed to set time on ./fsroot-vs/usr/lib/modules/6.1.0-29-2-amd64/kernel/drivers/net/wireless/intersil/orinoco/orinoco_usb.ko, because No such file or directory

set_attributes: failed to set time on ./fsroot-vs/usr/lib/modules/6.1.0-29-2-amd64/kernel/drivers/net/wireless/intersil/orinoco/spectrum_cs.ko, because No such file or directory

set_attributes: failed to set time on ./fsroot-vs/usr/lib/modules/6.1.0-29-2-amd64/kernel/drivers/net/wireless/intersil/orinoco, because No such file or directory

set_attributes: failed to set time on ./fsroot-vs/usr/lib/modules/6.1.0-29-2-amd64/kernel/drivers/net/wireless/intersil/p54/p54common.ko, because No such file or directory

set_attributes: failed to set time on ./fsroot-vs/usr/lib/modules/6.1.0-29-2-amd64/kernel/drivers/net/wireless/intersil/p54/p54pci.ko, because No such file or directory

set_attributes: failed to set time on ./fsroot-vs/usr/lib/modules/6.1.0-29-2-amd64/kernel/drivers/net/wireless/intersil/p54/p54usb.ko, because No such file or directory

set_attributes: failed to set time on ./fsroot-vs/usr/lib/modules/6.1.0-29-2-amd64/kernel/drivers/net/wireless/intersil/p54, because No such file or directory

set_attributes: failed to set time on ./fsroot-vs/usr/lib/modules/6.1.0-29-2-amd64/kernel/drivers/net/wireless/intersil, because No such file or directory

set_attributes: failed to set time on ./fsroot-vs/usr/lib/modules/6.1.0-29-2-amd64/kernel/drivers/net/wireless/mac80211_hwsim.ko, because No such file or directory

set_attributes: failed to set time on ./fsroot-vs/usr/lib/modules/6.1.0-29-2-amd64/kernel/drivers/net/wireless/marvell/libertas/libertas.ko, because No such file or directory

set_attributes: failed to set time on ./fsroot-vs/usr/lib/modules/6.1.0-29-2-amd64/kernel/drivers/net/wireless/marvell/libertas/libertas_cs.ko, because No such file or directory

set_attributes: failed to set time on ./fsroot-vs/usr/lib/modules/6.1.0-29-2-amd64/kernel/drivers/net/wireless/marvell/libertas/libertas_sdio.ko, because No such file or directory

set_attributes: failed to set time on ./fsroot-vs/usr/lib/modules/6.1.0-29-2-amd64/kernel/drivers/net/wireless/marvell/libertas/usb8xxx.ko, because No such file or directory

set_attributes: failed to set time on ./fsroot-vs/usr/lib/modules/6.1.0-29-2-amd64/kernel/drivers/net/wireless/marvell/libertas, because No such file or directory

set_attributes: failed to set time on ./fsroot-vs/usr/lib/modules/6.1.0-29-2-amd64/kernel/drivers/net/wireless/marvell/libertas_tf/libertas_tf.ko, because No such file or directory

set_attributes: failed to set time on ./fsroot-vs/usr/lib/modules/6.1.0-29-2-amd64/kernel/drivers/net/wireless/marvell/libertas_tf/libertas_tf_usb.ko, because No such file or directory

set_attributes: failed to set time on ./fsroot-vs/usr/lib/modules/6.1.0-29-2-amd64/kernel/drivers/net/wireless/marvell/libertas_tf, because No such file or directory

set_attributes: failed to set time on ./fsroot-vs/usr/lib/modules/6.1.0-29-2-amd64/kernel/drivers/net/wireless/marvell/mwifiex/mwifiex.ko, because No such file or directory

set_attributes: failed to set time on ./fsroot-vs/usr/lib/modules/6.1.0-29-2-amd64/kernel/drivers/net/wireless/marvell/mwifiex/mwifiex_pcie.ko, because No such file or directory

set_attributes: failed to set time on ./fsroot-vs/usr/lib/modules/6.1.0-29-2-amd64/kernel/drivers/net/wireless/marvell/mwifiex/mwifiex_sdio.ko, because No such file or directory

set_attributes: failed to set time on ./fsroot-vs/usr/lib/modules/6.1.0-29-2-amd64/kernel/drivers/net/wireless/marvell/mwifiex/mwifiex_usb.ko, because No such file or directory

set_attributes: failed to set time on ./fsroot-vs/usr/lib/modules/6.1.0-29-2-amd64/kernel/drivers/net/wireless/marvell/mwifiex, because No such file or directory

set_attributes: failed to set time on ./fsroot-vs/usr/lib/modules/6.1.0-29-2-amd64/kernel/drivers/net/wireless/marvell/mwl8k.ko, because No such file or directory

set_attributes: failed to set time on ./fsroot-vs/usr/lib/modules/6.1.0-29-2-amd64/kernel/drivers/net/wireless/marvell, because No such file or directory

set_attributes: failed to set time on ./fsroot-vs/usr/lib/modules/6.1.0-29-2-amd64/kernel/drivers/net/wireless/mediatek/mt76/mt76-connac-lib.ko, because No such file or directory

set_attributes: failed to set time on ./fsroot-vs/usr/lib/modules/6.1.0-29-2-amd64/kernel/drivers/net/wireless/mediatek/mt76/mt76-usb.ko, because No such file or directory

set_attributes: failed to set time on ./fsroot-vs/usr/lib/modules/6.1.0-29-2-amd64/kernel/drivers/net/wireless/mediatek/mt76/mt76.ko, because No such file or directory

set_attributes: failed to set time on ./fsroot-vs/usr/lib/modules/6.1.0-29-2-amd64/kernel/drivers/net/wireless/mediatek/mt76/mt7615/mt7615-common.ko, because No such file or directory

set_attributes: failed to set time on ./fsroot-vs/usr/lib/modules/6.1.0-29-2-amd64/kernel/drivers/net/wireless/mediatek/mt76/mt7615/mt7615e.ko, because No such file or directory

set_attributes: failed to set time on ./fsroot-vs/usr/lib/modules/6.1.0-29-2-amd64/kernel/drivers/net/wireless/mediatek/mt76/mt7615/mt7663-usb-sdio-common.ko, because No such file or directory

set_attributes: failed to set time on ./fsroot-vs/usr/lib/modules/6.1.0-29-2-amd64/kernel/drivers/net/wireless/mediatek/mt76/mt7615/mt7663u.ko, because No such file or directory

set_attributes: failed to set time on ./fsroot-vs/usr/lib/modules/6.1.0-29-2-amd64/kernel/drivers/net/wireless/mediatek/mt76/mt7615, because No such file or directory

set_attributes: failed to set time on ./fsroot-vs/usr/lib/modules/6.1.0-29-2-amd64/kernel/drivers/net/wireless/mediatek/mt76/mt76x0/mt76x0-common.ko, because No such file or directory

set_attributes: failed to set time on ./fsroot-vs/usr/lib/modules/6.1.0-29-2-amd64/kernel/drivers/net/wireless/mediatek/mt76/mt76x0/mt76x0e.ko, because No such file or directory

set_attributes: failed to set time on ./fsroot-vs/usr/lib/modules/6.1.0-29-2-amd64/kernel/drivers/net/wireless/mediatek/mt76/mt76x0/mt76x0u.ko, because No such file or directory

set_attributes: failed to set time on ./fsroot-vs/usr/lib/modules/6.1.0-29-2-amd64/kernel/drivers/net/wireless/mediatek/mt76/mt76x0, because No such file or directory

set_attributes: failed to set time on ./fsroot-vs/usr/lib/modules/6.1.0-29-2-amd64/kernel/drivers/net/wireless/mediatek/mt76/mt76x02-lib.ko, because No such file or directory

set_attributes: failed to set time on ./fsroot-vs/usr/lib/modules/6.1.0-29-2-amd64/kernel/drivers/net/wireless/mediatek/mt76/mt76x02-usb.ko, because No such file or directory

set_attributes: failed to set time on ./fsroot-vs/usr/lib/modules/6.1.0-29-2-amd64/kernel/drivers/net/wireless/mediatek/mt76/mt76x2/mt76x2-common.ko, because No such file or directory

set_attributes: failed to set time on ./fsroot-vs/usr/lib/modules/6.1.0-29-2-amd64/kernel/drivers/net/wireless/mediatek/mt76/mt76x2/mt76x2e.ko, because No such file or directory

set_attributes: failed to set time on ./fsroot-vs/usr/lib/modules/6.1.0-29-2-amd64/kernel/drivers/net/wireless/mediatek/mt76/mt76x2/mt76x2u.ko, because No such file or directory

set_attributes: failed to set time on ./fsroot-vs/usr/lib/modules/6.1.0-29-2-amd64/kernel/drivers/net/wireless/mediatek/mt76/mt76x2, because No such file or directory

set_attributes: failed to set time on ./fsroot-vs/usr/lib/modules/6.1.0-29-2-amd64/kernel/drivers/net/wireless/mediatek/mt76/mt7915/mt7915e.ko, because No such file or directory

set_attributes: failed to set time on ./fsroot-vs/usr/lib/modules/6.1.0-29-2-amd64/kernel/drivers/net/wireless/mediatek/mt76/mt7915, because No such file or directory

set_attributes: failed to set time on ./fsroot-vs/usr/lib/modules/6.1.0-29-2-amd64/kernel/drivers/net/wireless/mediatek/mt76/mt7921/mt7921-common.ko, because No such file or directory

set_attributes: failed to set time on ./fsroot-vs/usr/lib/modules/6.1.0-29-2-amd64/kernel/drivers/net/wireless/mediatek/mt76/mt7921/mt7921e.ko, because No such file or directory

set_attributes: failed to set time on ./fsroot-vs/usr/lib/modules/6.1.0-29-2-amd64/kernel/drivers/net/wireless/mediatek/mt76/mt7921/mt7921u.ko, because No such file or directory

set_attributes: failed to set time on ./fsroot-vs/usr/lib/modules/6.1.0-29-2-amd64/kernel/drivers/net/wireless/mediatek/mt76/mt7921, because No such file or directory

set_attributes: failed to set time on ./fsroot-vs/usr/lib/modules/6.1.0-29-2-amd64/kernel/drivers/net/wireless/mediatek/mt76, because No such file or directory

set_attributes: failed to set time on ./fsroot-vs/usr/lib/modules/6.1.0-29-2-amd64/kernel/drivers/net/wireless/mediatek/mt7601u/mt7601u.ko, because No such file or directory

set_attributes: failed to set time on ./fsroot-vs/usr/lib/modules/6.1.0-29-2-amd64/kernel/drivers/net/wireless/mediatek/mt7601u, because No such file or directory

set_attributes: failed to set time on ./fsroot-vs/usr/lib/modules/6.1.0-29-2-amd64/kernel/drivers/net/wireless/mediatek, because No such file or directory

[===========================|                                ] 31199/67775  46%
[======================================/                     ] 43814/67775  64%
[========================================================-   ] 64896/67775  95%
[===========================================================-] 67775/67775 100%

created 25922 files
created 3484 directories
created 2373 symlinks
created 5351 devices
created 0 fifos
created 0 sockets
created 5 hardlinks
[  FAIL LOG END  ] [ target/sonic-vs.bin ]
make: *** [slave.mk:1435: target/sonic-vs.bin] Error 1
[ finished ] [ target/docker-sonic-vs.gz ] 
make[1]: *** [Makefile.work:611: all] Error 2
make[1]: Leaving directory '/var/lib/jenkins/workspace/DevOps-test2/platform-vs'
make: *** [Makefile:53: all] Error 2