+++ --- Applying local submodule patches --- +++
already applied: sonic-utilities
already applied: sonic-swss
already applied: sonic-swss-new
already applied: sonic-sairedis-vslib
already applied: sonic-sairedis-meta
already applied: sonic-sairedis-SAI
already applied: sonic-sairedis-SAI-apidef
already applied: sonic-mgmt-framework
+++ --- Making all --- +++
./scripts/run_with_retry make BLDENV=bookworm -f Makefile.work all
make[1]: Entering directory '/var/lib/jenkins/workspace/DevOps-test2/platform-vs'
"SECURE_UPGRADE_PROD_SIGNING_TOOL": ""
~/workspace/DevOps-test2/platform-vs/src/sonic-build-hooks ~/workspace/DevOps-test2/platform-vs
make[2]: Entering directory '/var/lib/jenkins/workspace/DevOps-test2/platform-vs/src/sonic-build-hooks'
dpkg-deb: building package 'sonic-build-hooks' in 'buildinfo/sonic-build-hooks_1.0_all.deb'.
make[2]: Leaving directory '/var/lib/jenkins/workspace/DevOps-test2/platform-vs/src/sonic-build-hooks'
~/workspace/DevOps-test2/platform-vs
Checking sonic-slave-base image: sonic-slave-bookworm:2f250bfbb4a
Checking sonic-slave-user image: sonic-slave-bookworm-jenkins:d05b1641d68
SONiC Build System
Build Configuration
"CONFIGURED_PLATFORM" : "vs"
"CONFIGURED_ARCH" : "amd64"
"SONIC_CONFIG_PRINT_DEPENDENCIES" : ""
"SONIC_BUILD_JOBS" : "4"
"SONIC_CONFIG_MAKE_JOBS" : "112"
"USE_NATIVE_DOCKERD_FOR_BUILD" : ""
"SONIC_USE_DOCKER_BUILDKIT" : ""
"USERNAME" : "admin"
"PASSWORD" : "YourPaSsWoRd"
"CHANGE_DEFAULT_PASSWORD" : "n"
"SECURE_UPGRADE_MODE" : "no_sign"
"SECURE_UPGRADE_DEV_SIGNING_KEY" : ""
"SECURE_UPGRADE_SIGNING_CERT" : ""
"SECURE_UPGRADE_PROD_SIGNING_TOOL": ""
"SECURE_UPGRADE_PROD_TOOL_ARGS" : ""
"ONIE_IMAGE_PART_SIZE" : ""
"SHUTDOWN_BGP_ON_START" : ""
"ENABLE_PFCWD_ON_START" : ""
"SONIC_BUFFER_MODEL" : ""
"INSTALL_DEBUG_TOOLS" : ""
"ROUTING_STACK" : "frr"
"FRR_USER_UID" : "300"
"FRR_USER_GID" : "300"
"ENABLE_SYNCD_RPC" : ""
"SAITHRIFT_V2" : ""
"ENABLE_ORGANIZATION_EXTENSIONS" : "y"
"HTTP_PROXY" : ""
"HTTPS_PROXY" : ""
"NO_PROXY" : ""
"ENABLE_ZTP" : ""
"INCLUDE_PDE" : ""
"SONIC_DEBUGGING_ON" : ""
"SONIC_PROFILING_ON" : ""
"KERNEL_PROCURE_METHOD" : "build"
"BUILD_TIMESTAMP" : "20260927.014428"
"BUILD_LOG_TIMESTAMP" : "none"
"SONIC_IMAGE_VERSION" : "etri-202505.17-8610ff460"
"BLDENV" : "bookworm"
"VS_PREPARE_MEM" : "yes"
"INCLUDE_MGMT_FRAMEWORK" : "y"
"INCLUDE_ICCPD" : "n"
"INCLUDE_STP" : "y"
"INCLUDE_SYSTEM_TELEMETRY" : "y"
"INCLUDE_SYSTEM_GNMI" : "y"
"INCLUDE_SYSTEM_BMP" : "y"
"INCLUDE_SYSTEM_EVENTD" : "y"
"ENABLE_HOST_SERVICE_ON_START" : "y"
"INCLUDE_RESTAPI" : "n"
"INCLUDE_SFLOW" : "y"
"INCLUDE_NAT" : "y"
"INCLUDE_DHCP_RELAY" : "y"
"INCLUDE_DHCP_SERVER" : "n"
"INCLUDE_P4RT" : "n"
"INCLUDE_VS_DASH_SAI" : "y"
"INCLUDE_KUBERNETES" : "n"
"INCLUDE_KUBERNETES_MASTER" : "n"
"INCLUDE_MACSEC" : "y"
"INCLUDE_MUX" : "y"
"INCLUDE_TEAMD" : "y"
"INCLUDE_DASH_HA" : "y"
"INCLUDE_ROUTER_ADVERTISER" : "y"
"INCLUDE_BOOTCHART : "y"
"ENABLE_BOOTCHART : "n"
"INCLUDE_FIPS" : "y"
"ENABLE_TRANSLIB_WRITE" : ""
"ENABLE_NATIVE_WRITE" : "y"
"ENABLE_DIALOUT" : ""
"ENABLE_AUTO_TECH_SUPPORT" : "y"
"PDDF_SUPPORT" : "y"
"MULTIARCH_QEMU_ENVIRON" : "n"
"SONIC_VERSION_CONTROL_COMPONENTS": "py2,py3,web,git,docker"
"ENABLE_ASAN" : "n"
"DEFAULT_CONTAINER_REGISTRY" : "publicmirror.azurecr.io/"
"BUILD_MULTIASIC_KVM" : "n"
"CROSS_BUILD_ENVIRON" : "n"
"LEGACY_SONIC_MGMT_DOCKER" : "y"
"INCLUDE_EXTERNAL_PATCHES" : "n"
"PTF_ENV_PY_VER" : "py3"
"ENABLE_MULTIDB" : ""
mv: cannot move '/etc/apt/sources.list.d/debian.sources' to '/etc/apt/sources.list.d/debian.sources.back': Permission denied
fatal: not a git repository (or any of the parent directories): .git
"SONIC_DPKG_CACHE_METHOD" : "none"
basename: missing operand
Try 'basename --help' for more information.
basename: missing operand
Try 'basename --help' for more information.
[ building ] [ target/sonic-vs.bin ]
[ building ] [ target/sonic-vs.img.gz ]
[ building ] [ target/files/bookworm/sonic_version.yml ]
[ finished ] [ target/files/bookworm/sonic_version.yml ]
[ building ] [ target/docker-swss-layer-bookworm.gz-load ]
[ finished ] [ target/docker-swss-layer-bookworm.gz-load ]
[ building ] [ target/docker-sonic-vs.gz ]
[ finished ] [ target/sonic-vs.img.gz ]
[ FAIL LOG START ] [ target/sonic-vs.img.gz ]
Build start time: Sat Sep 26 16:44:51 UTC 2026
++ '[' -f .arch ']'
++ cat .arch
+ CONFIGURED_ARCH=amd64
+ DOCKER_VERSION=5:24.0.2-1~debian.12~bookworm
+ CONTAINERD_IO_VERSION=1.6.21-1
+ LINUX_KERNEL_VERSION=6.1.0-29-2
+ FILESYSTEM_ROOT=./fsroot
+ PLATFORM_DIR=platform
+ HOSTNAME=sonic
+ DEFAULT_USERINFO='Default admin user,,,'
+ BUILD_TOOL_PATH=src/sonic-build-hooks/buildinfo
+ TRUSTED_GPG_DIR=src/sonic-build-hooks/buildinfo/trusted.gpg.d
+ . ./onie-image.conf
++ : 32768
++ : x86_64
++ : vs
++ ONIEIMAGE_VERSION=r0
++ FILESYSTEM_ROOT=./fsroot-vs
++ FILESYSTEM_SQUASHFS=fs.squashfs
++ INSTALLER_PAYLOAD=fs.zip
++ FILESYSTEM_DOCKERFS=dockerfs.tar.gz
++ DOCKERFS_DIR=docker
++ DOCKER_RAMFS_SIZE=3500M
++ OUTPUT_ONIE_IMAGE=target/sonic-vs.bin
++ OUTPUT_RAW_IMAGE=target/sonic-vs.raw
++ RAW_IMAGE_DISK_SIZE=1700
++ OUTPUT_KVM_IMAGE=target/sonic-vs.img
++ KVM_IMAGE_DISK_SIZE=16
++ OUTPUT_ABOOT_IMAGE=target/sonic-aboot-vs.swi
++ ABOOT_BOOT_IMAGE=.sonic-boot.swi
++ OUTPUT_KVM_4ASIC_IMAGE=target/sonic-4asic-vs.img
++ OUTPUT_KVM_6ASIC_IMAGE=target/sonic-6asic-vs.img
++ OUTPUT_DSC_IMAGE=target/sonic-vs.tar
+ '[' -n 32768 ']'
+ '[' -n fs.zip ']'
+ '[' -n fs.squashfs ']'
+ '[' kvm = aboot ']'
+ [[ y != y ]]
+ [[ n == y ]]
+ [[ y == y ]]
+ echo '[INFO] RFS build: second stage'
[INFO] RFS build: second stage
+ sudo mount proc /proc -t proc
+ sudo fuser -vm ./fsroot-vs
USER PID ACCESS COMMAND
/sonic/fsroot-vs: root kernel mount /usr/sbin/docker-init
jenkins 1 ..ce. docker-init
jenkins 7 ..c.. bash
jenkins 8 ..c.. make
jenkins 6229 ..c.. bash
jenkins 6494 ..c.. bash
root 6683 ....m dockerd
root 6758 ....m containerd
jenkins 7266 ..c.. bash
jenkins 7501 ..c.. docker
jenkins 7502 ..c.. process_log.sh
jenkins 12626 ..c.. build_debian.sh
jenkins 12627 ..c.. process_log.sh
root 12640 ..c.. sudo
root 12641 F.c.. unsquashfs
jenkins 12761 ..c.. build_debian.sh
jenkins 12762 ..c.. process_log.sh
root 12770 ..c.. sudo
+ sudo rm -rf ./fsroot-vs
rm: cannot remove './fsroot-vs/usr/lib/x86_64-linux-gnu': Directory not empty
[ FAIL LOG END ] [ target/sonic-vs.img.gz ]
make: *** [slave.mk:1435: target/sonic-vs.img.gz] Error 1
make: *** Waiting for unfinished jobs....
[ finished ] [ target/sonic-vs.bin ]
[ FAIL LOG START ] [ target/sonic-vs.bin ]
Build start time: Sat Sep 26 16:44:50 UTC 2026
++ '[' -f .arch ']'
++ cat .arch
+ CONFIGURED_ARCH=amd64
+ DOCKER_VERSION=5:24.0.2-1~debian.12~bookworm
+ CONTAINERD_IO_VERSION=1.6.21-1
+ LINUX_KERNEL_VERSION=6.1.0-29-2
+ FILESYSTEM_ROOT=./fsroot
+ PLATFORM_DIR=platform
+ HOSTNAME=sonic
+ DEFAULT_USERINFO='Default admin user,,,'
+ BUILD_TOOL_PATH=src/sonic-build-hooks/buildinfo
+ TRUSTED_GPG_DIR=src/sonic-build-hooks/buildinfo/trusted.gpg.d
+ . ./onie-image.conf
++ : 32768
++ : x86_64
++ : vs
++ ONIEIMAGE_VERSION=r0
++ FILESYSTEM_ROOT=./fsroot-vs
++ FILESYSTEM_SQUASHFS=fs.squashfs
++ INSTALLER_PAYLOAD=fs.zip
++ FILESYSTEM_DOCKERFS=dockerfs.tar.gz
++ DOCKERFS_DIR=docker
++ DOCKER_RAMFS_SIZE=3500M
++ OUTPUT_ONIE_IMAGE=target/sonic-vs.bin
++ OUTPUT_RAW_IMAGE=target/sonic-vs.raw
++ RAW_IMAGE_DISK_SIZE=1700
++ OUTPUT_KVM_IMAGE=target/sonic-vs.img
++ KVM_IMAGE_DISK_SIZE=16
++ OUTPUT_ABOOT_IMAGE=target/sonic-aboot-vs.swi
++ ABOOT_BOOT_IMAGE=.sonic-boot.swi
++ OUTPUT_KVM_4ASIC_IMAGE=target/sonic-4asic-vs.img
++ OUTPUT_KVM_6ASIC_IMAGE=target/sonic-6asic-vs.img
++ OUTPUT_DSC_IMAGE=target/sonic-vs.tar
+ '[' -n 32768 ']'
+ '[' -n fs.zip ']'
+ '[' -n fs.squashfs ']'
+ '[' onie = aboot ']'
+ [[ y != y ]]
+ [[ n == y ]]
+ [[ y == y ]]
+ echo '[INFO] RFS build: second stage'
[INFO] RFS build: second stage
+ sudo mount proc /proc -t proc
+ sudo fuser -vm ./fsroot-vs
USER PID ACCESS COMMAND
/sonic/fsroot-vs: root kernel mount /usr/sbin/docker-init
jenkins 1 ..ce. docker-init
jenkins 7 ..c.. bash
jenkins 8 ..c.. make
jenkins 6229 ..c.. bash
jenkins 6494 ..c.. bash
root 6683 ....m dockerd
root 6758 ....m containerd
jenkins 7266 ..c.. bash
jenkins 7501 ..c.. docker
jenkins 7502 ..c.. process_log.sh
jenkins 12473 ..c.. j2
jenkins 12626 ..c.. build_debian.sh
jenkins 12627 ..c.. process_log.sh
root 12635 ..c.. sudo
+ sudo rm -rf ./fsroot-vs
+ sudo unsquashfs -d ./fsroot-vs target/sonic-vs.bin__vs__rfs.squashfs
Parallel unsquashfs: Using 112 processors
33651 inodes (34124 blocks) to write
[=======/ ] 8476/67775 12%
[==========- ] 12585/67775 18%
[==================\ ] 21030/67775 31%
[============================| ] 33079/67775 48%
set_attributes: failed to change uid and gids on ./fsroot-vs/usr/lib/x86_64-linux-gnu/libxenguest.so.4.17.0, because No such file or directory
set_attributes: failed to set time on ./fsroot-vs/usr/lib/x86_64-linux-gnu/perl/cross-config-5.36.0, because No such file or directory
set_attributes: failed to set time on ./fsroot-vs/usr/lib/x86_64-linux-gnu/perl/debian-config-data-5.36.0/README, because No such file or directory
set_attributes: failed to set time on ./fsroot-vs/usr/lib/x86_64-linux-gnu/perl/debian-config-data-5.36.0/config.sh.debug.gz, because No such file or directory
set_attributes: failed to set time on ./fsroot-vs/usr/lib/x86_64-linux-gnu/perl/debian-config-data-5.36.0/config.sh.shared.gz, because No such file or directory
set_attributes: failed to set time on ./fsroot-vs/usr/lib/x86_64-linux-gnu/perl/debian-config-data-5.36.0/config.sh.static.gz, because No such file or directory
set_attributes: failed to set time on ./fsroot-vs/usr/lib/x86_64-linux-gnu/perl/debian-config-data-5.36.0, because No such file or directory
set_attributes: failed to set time on ./fsroot-vs/usr/lib/x86_64-linux-gnu/perl-base/AutoLoader.pm, because No such file or directory
set_attributes: failed to set time on ./fsroot-vs/usr/lib/x86_64-linux-gnu/perl-base/Carp/Heavy.pm, because No such file or directory
set_attributes: failed to set time on ./fsroot-vs/usr/lib/x86_64-linux-gnu/perl-base/Carp, because No such file or directory
set_attributes: failed to set time on ./fsroot-vs/usr/lib/x86_64-linux-gnu/perl-base/Carp.pm, because No such file or directory
set_attributes: failed to set time on ./fsroot-vs/usr/lib/x86_64-linux-gnu/perl-base/Config.pm, because No such file or directory
set_attributes: failed to set time on ./fsroot-vs/usr/lib/x86_64-linux-gnu/perl-base/Config_git.pl, because No such file or directory
set_attributes: failed to set time on ./fsroot-vs/usr/lib/x86_64-linux-gnu/perl-base/Config_heavy.pl, because No such file or directory
set_attributes: failed to set time on ./fsroot-vs/usr/lib/x86_64-linux-gnu/perl-base/Cwd.pm, because No such file or directory
set_attributes: failed to set time on ./fsroot-vs/usr/lib/x86_64-linux-gnu/perl-base/DynaLoader.pm, because No such file or directory
set_attributes: failed to set time on ./fsroot-vs/usr/lib/x86_64-linux-gnu/perl-base/Errno.pm, because No such file or directory
set_attributes: failed to set time on ./fsroot-vs/usr/lib/x86_64-linux-gnu/perl-base/Exporter/Heavy.pm, because No such file or directory
set_attributes: failed to set time on ./fsroot-vs/usr/lib/x86_64-linux-gnu/perl-base/Exporter, because No such file or directory
set_attributes: failed to set time on ./fsroot-vs/usr/lib/x86_64-linux-gnu/perl-base/Exporter.pm, because No such file or directory
set_attributes: failed to set time on ./fsroot-vs/usr/lib/x86_64-linux-gnu/perl-base/Fcntl.pm, because No such file or directory
set_attributes: failed to set time on ./fsroot-vs/usr/lib/x86_64-linux-gnu/perl-base/File/Basename.pm, because No such file or directory
set_attributes: failed to set time on ./fsroot-vs/usr/lib/x86_64-linux-gnu/perl-base/File/Glob.pm, because No such file or directory
set_attributes: failed to set time on ./fsroot-vs/usr/lib/x86_64-linux-gnu/perl-base/File/Path.pm, because No such file or directory
set_attributes: failed to set time on ./fsroot-vs/usr/lib/x86_64-linux-gnu/perl-base/File/Spec/Unix.pm, because No such file or directory
set_attributes: failed to set time on ./fsroot-vs/usr/lib/x86_64-linux-gnu/perl-base/File/Spec, because No such file or directory
set_attributes: failed to set time on ./fsroot-vs/usr/lib/x86_64-linux-gnu/perl-base/File/Spec.pm, because No such file or directory
set_attributes: failed to set time on ./fsroot-vs/usr/lib/x86_64-linux-gnu/perl-base/File/Temp.pm, because No such file or directory
set_attributes: failed to set time on ./fsroot-vs/usr/lib/x86_64-linux-gnu/perl-base/File, because No such file or directory
set_attributes: failed to set time on ./fsroot-vs/usr/lib/x86_64-linux-gnu/perl-base/FileHandle.pm, because No such file or directory
set_attributes: failed to set time on ./fsroot-vs/usr/lib/x86_64-linux-gnu/perl-base/Getopt/Long.pm, because No such file or directory
set_attributes: failed to set time on ./fsroot-vs/usr/lib/x86_64-linux-gnu/perl-base/Getopt, because No such file or directory
set_attributes: failed to set time on ./fsroot-vs/usr/lib/x86_64-linux-gnu/perl-base/Hash/Util.pm, because No such file or directory
set_attributes: failed to set time on ./fsroot-vs/usr/lib/x86_64-linux-gnu/perl-base/Hash, because No such file or directory
set_attributes: failed to set time on ./fsroot-vs/usr/lib/x86_64-linux-gnu/perl-base/IO/File.pm, because No such file or directory
set_attributes: failed to set time on ./fsroot-vs/usr/lib/x86_64-linux-gnu/perl-base/IO/Handle.pm, because No such file or directory
set_attributes: failed to set time on ./fsroot-vs/usr/lib/x86_64-linux-gnu/perl-base/IO/Pipe.pm, because No such file or directory
set_attributes: failed to set time on ./fsroot-vs/usr/lib/x86_64-linux-gnu/perl-base/IO/Seekable.pm, because No such file or directory
set_attributes: failed to set time on ./fsroot-vs/usr/lib/x86_64-linux-gnu/perl-base/IO/Select.pm, because No such file or directory
set_attributes: failed to set time on ./fsroot-vs/usr/lib/x86_64-linux-gnu/perl-base/IO/Socket/INET.pm, because No such file or directory
set_attributes: failed to set time on ./fsroot-vs/usr/lib/x86_64-linux-gnu/perl-base/IO/Socket/IP.pm, because No such file or directory
set_attributes: failed to set time on ./fsroot-vs/usr/lib/x86_64-linux-gnu/perl-base/IO/Socket/UNIX.pm, because No such file or directory
set_attributes: failed to set time on ./fsroot-vs/usr/lib/x86_64-linux-gnu/perl-base/IO/Socket, because No such file or directory
set_attributes: failed to set time on ./fsroot-vs/usr/lib/x86_64-linux-gnu/perl-base/IO/Socket.pm, because No such file or directory
set_attributes: failed to set time on ./fsroot-vs/usr/lib/x86_64-linux-gnu/perl-base/IO, because No such file or directory
set_attributes: failed to set time on ./fsroot-vs/usr/lib/x86_64-linux-gnu/perl-base/IO.pm, because No such file or directory
set_attributes: failed to set time on ./fsroot-vs/usr/lib/x86_64-linux-gnu/perl-base/IPC/Open2.pm, because No such file or directory
set_attributes: failed to set time on ./fsroot-vs/usr/lib/x86_64-linux-gnu/perl-base/IPC/Open3.pm, because No such file or directory
set_attributes: failed to set time on ./fsroot-vs/usr/lib/x86_64-linux-gnu/perl-base/IPC, because No such file or directory
set_attributes: failed to set time on ./fsroot-vs/usr/lib/x86_64-linux-gnu/perl-base/List/Util.pm, because No such file or directory
set_attributes: failed to set time on ./fsroot-vs/usr/lib/x86_64-linux-gnu/perl-base/List, because No such file or directory
set_attributes: failed to set time on ./fsroot-vs/usr/lib/x86_64-linux-gnu/perl-base/POSIX.pm, because No such file or directory
set_attributes: failed to set time on ./fsroot-vs/usr/lib/x86_64-linux-gnu/perl-base/Scalar/Util.pm, because No such file or directory
set_attributes: failed to set time on ./fsroot-vs/usr/lib/x86_64-linux-gnu/perl-base/Scalar, because No such file or directory
set_attributes: failed to set time on ./fsroot-vs/usr/lib/x86_64-linux-gnu/perl-base/SelectSaver.pm, because No such file or directory
set_attributes: failed to set time on ./fsroot-vs/usr/lib/x86_64-linux-gnu/perl-base/Socket.pm, because No such file or directory
set_attributes: failed to set time on ./fsroot-vs/usr/lib/x86_64-linux-gnu/perl-base/Symbol.pm, because No such file or directory
set_attributes: failed to set time on ./fsroot-vs/usr/lib/x86_64-linux-gnu/perl-base/Text/ParseWords.pm, because No such file or directory
set_attributes: failed to set time on ./fsroot-vs/usr/lib/x86_64-linux-gnu/perl-base/Text/Tabs.pm, because No such file or directory
set_attributes: failed to set time on ./fsroot-vs/usr/lib/x86_64-linux-gnu/perl-base/Text/Wrap.pm, because No such file or directory
set_attributes: failed to set time on ./fsroot-vs/usr/lib/x86_64-linux-gnu/perl-base/Text, because No such file or directory
set_attributes: failed to set time on ./fsroot-vs/usr/lib/x86_64-linux-gnu/perl-base/Tie/Hash.pm, because No such file or directory
set_attributes: failed to set time on ./fsroot-vs/usr/lib/x86_64-linux-gnu/perl-base/Tie, because No such file or directory
set_attributes: failed to set time on ./fsroot-vs/usr/lib/x86_64-linux-gnu/perl-base/XSLoader.pm, because No such file or directory
set_attributes: failed to set time on ./fsroot-vs/usr/lib/x86_64-linux-gnu/perl-base/attributes.pm, because No such file or directory
set_attributes: failed to set time on ./fsroot-vs/usr/lib/x86_64-linux-gnu/perl-base/auto/Cwd/Cwd.so, because No such file or directory
set_attributes: failed to set time on ./fsroot-vs/usr/lib/x86_64-linux-gnu/perl-base/auto/Cwd, because No such file or directory
set_attributes: failed to set time on ./fsroot-vs/usr/lib/x86_64-linux-gnu/perl-base/auto/Fcntl/Fcntl.so, because No such file or directory
set_attributes: failed to set time on ./fsroot-vs/usr/lib/x86_64-linux-gnu/perl-base/auto/Fcntl, because No such file or directory
set_attributes: failed to set time on ./fsroot-vs/usr/lib/x86_64-linux-gnu/perl-base/auto/File/Glob/Glob.so, because No such file or directory
set_attributes: failed to set time on ./fsroot-vs/usr/lib/x86_64-linux-gnu/perl-base/auto/File/Glob, because No such file or directory
set_attributes: failed to set time on ./fsroot-vs/usr/lib/x86_64-linux-gnu/perl-base/auto/File, because No such file or directory
set_attributes: failed to set time on ./fsroot-vs/usr/lib/x86_64-linux-gnu/perl-base/auto/Hash/Util/Util.so, because No such file or directory
set_attributes: failed to set time on ./fsroot-vs/usr/lib/x86_64-linux-gnu/perl-base/auto/Hash/Util, because No such file or directory
set_attributes: failed to set time on ./fsroot-vs/usr/lib/x86_64-linux-gnu/perl-base/auto/Hash, because No such file or directory
set_attributes: failed to set time on ./fsroot-vs/usr/lib/x86_64-linux-gnu/perl-base/auto/IO/IO.so, because No such file or directory
set_attributes: failed to set time on ./fsroot-vs/usr/lib/x86_64-linux-gnu/perl-base/auto/IO, because No such file or directory
set_attributes: failed to set time on ./fsroot-vs/usr/lib/x86_64-linux-gnu/perl-base/auto/List/Util/Util.so, because No such file or directory
set_attributes: failed to set time on ./fsroot-vs/usr/lib/x86_64-linux-gnu/perl-base/auto/List/Util, because No such file or directory
set_attributes: failed to set time on ./fsroot-vs/usr/lib/x86_64-linux-gnu/perl-base/auto/List, because No such file or directory
set_attributes: failed to set time on ./fsroot-vs/usr/lib/x86_64-linux-gnu/perl-base/auto/POSIX/POSIX.so, because No such file or directory
set_attributes: failed to set time on ./fsroot-vs/usr/lib/x86_64-linux-gnu/perl-base/auto/POSIX, because No such file or directory
set_attributes: failed to set time on ./fsroot-vs/usr/lib/x86_64-linux-gnu/perl-base/auto/Socket/Socket.so, because No such file or directory
set_attributes: failed to set time on ./fsroot-vs/usr/lib/x86_64-linux-gnu/perl-base/auto/Socket, because No such file or directory
set_attributes: failed to set time on ./fsroot-vs/usr/lib/x86_64-linux-gnu/perl-base/auto/attributes/attributes.so, because No such file or directory
set_attributes: failed to set time on ./fsroot-vs/usr/lib/x86_64-linux-gnu/perl-base/auto/attributes, because No such file or directory
set_attributes: failed to set time on ./fsroot-vs/usr/lib/x86_64-linux-gnu/perl-base/auto/re/re.so, because No such file or directory
set_attributes: failed to set time on ./fsroot-vs/usr/lib/x86_64-linux-gnu/perl-base/auto/re, because No such file or directory
set_attributes: failed to set time on ./fsroot-vs/usr/lib/x86_64-linux-gnu/perl-base/auto, because No such file or directory
set_attributes: failed to set time on ./fsroot-vs/usr/lib/x86_64-linux-gnu/perl-base/base.pm, because No such file or directory
set_attributes: failed to set time on ./fsroot-vs/usr/lib/x86_64-linux-gnu/perl-base/builtin.pm, because No such file or directory
set_attributes: failed to set time on ./fsroot-vs/usr/lib/x86_64-linux-gnu/perl-base/bytes.pm, because No such file or directory
set_attributes: failed to set time on ./fsroot-vs/usr/lib/x86_64-linux-gnu/perl-base/bytes_heavy.pl, because No such file or directory
set_attributes: failed to set time on ./fsroot-vs/usr/lib/x86_64-linux-gnu/perl-base/constant.pm, because No such file or directory
set_attributes: failed to set time on ./fsroot-vs/usr/lib/x86_64-linux-gnu/perl-base/feature.pm, because No such file or directory
set_attributes: failed to set time on ./fsroot-vs/usr/lib/x86_64-linux-gnu/perl-base/fields.pm, because No such file or directory
set_attributes: failed to set time on ./fsroot-vs/usr/lib/x86_64-linux-gnu/perl-base/integer.pm, because No such file or directory
set_attributes: failed to set time on ./fsroot-vs/usr/lib/x86_64-linux-gnu/perl-base/lib.pm, because No such file or directory
set_attributes: failed to set time on ./fsroot-vs/usr/lib/x86_64-linux-gnu/perl-base/locale.pm, because No such file or directory
set_attributes: failed to set time on ./fsroot-vs/usr/lib/x86_64-linux-gnu/perl-base/overload.pm, because No such file or directory
set_attributes: failed to set time on ./fsroot-vs/usr/lib/x86_64-linux-gnu/perl-base/overloading.pm, because No such file or directory
set_attributes: failed to set time on ./fsroot-vs/usr/lib/x86_64-linux-gnu/perl-base/parent.pm, because No such file or directory
set_attributes: failed to set time on ./fsroot-vs/usr/lib/x86_64-linux-gnu/perl-base/re.pm, because No such file or directory
set_attributes: failed to set time on ./fsroot-vs/usr/lib/x86_64-linux-gnu/perl-base/strict.pm, because No such file or directory
set_attributes: failed to set time on ./fsroot-vs/usr/lib/x86_64-linux-gnu/perl-base/unicore/To/Age.pl, because No such file or directory
set_attributes: failed to set time on ./fsroot-vs/usr/lib/x86_64-linux-gnu/perl-base/unicore/To/Bc.pl, because No such file or directory
set_attributes: failed to set time on ./fsroot-vs/usr/lib/x86_64-linux-gnu/perl-base/unicore/To/Bmg.pl, because No such file or directory
set_attributes: failed to set time on ./fsroot-vs/usr/lib/x86_64-linux-gnu/perl-base/unicore/To/Bpb.pl, because No such file or directory
set_attributes: failed to set time on ./fsroot-vs/usr/lib/x86_64-linux-gnu/perl-base/unicore/To/Bpt.pl, because No such file or directory
set_attributes: failed to set time on ./fsroot-vs/usr/lib/x86_64-linux-gnu/perl-base/unicore/To/Cf.pl, because No such file or directory
set_attributes: failed to set time on ./fsroot-vs/usr/lib/x86_64-linux-gnu/perl-base/unicore/To/Ea.pl, because No such file or directory
set_attributes: failed to set time on ./fsroot-vs/usr/lib/x86_64-linux-gnu/perl-base/unicore/To/EqUIdeo.pl, because No such file or directory
set_attributes: failed to set time on ./fsroot-vs/usr/lib/x86_64-linux-gnu/perl-base/unicore/To/GCB.pl, because No such file or directory
set_attributes: failed to set time on ./fsroot-vs/usr/lib/x86_64-linux-gnu/perl-base/unicore/To/Gc.pl, because No such file or directory
set_attributes: failed to set time on ./fsroot-vs/usr/lib/x86_64-linux-gnu/perl-base/unicore/To/Hst.pl, because No such file or directory
set_attributes: failed to set time on ./fsroot-vs/usr/lib/x86_64-linux-gnu/perl-base/unicore/To/Identif2.pl, because No such file or directory
set_attributes: failed to set time on ./fsroot-vs/usr/lib/x86_64-linux-gnu/perl-base/unicore/To/Identifi.pl, because No such file or directory
set_attributes: failed to set time on ./fsroot-vs/usr/lib/x86_64-linux-gnu/perl-base/unicore/To/InPC.pl, because No such file or directory
set_attributes: failed to set time on ./fsroot-vs/usr/lib/x86_64-linux-gnu/perl-base/unicore/To/InSC.pl, because No such file or directory
set_attributes: failed to set time on ./fsroot-vs/usr/lib/x86_64-linux-gnu/perl-base/unicore/To/Isc.pl, because No such file or directory
set_attributes: failed to set time on ./fsroot-vs/usr/lib/x86_64-linux-gnu/perl-base/unicore/To/Jg.pl, because No such file or directory
set_attributes: failed to set time on ./fsroot-vs/usr/lib/x86_64-linux-gnu/perl-base/unicore/To/Jt.pl, because No such file or directory
set_attributes: failed to set time on ./fsroot-vs/usr/lib/x86_64-linux-gnu/perl-base/unicore/To/Lb.pl, because No such file or directory
set_attributes: failed to set time on ./fsroot-vs/usr/lib/x86_64-linux-gnu/perl-base/unicore/To/Lc.pl, because No such file or directory
set_attributes: failed to set time on ./fsroot-vs/usr/lib/x86_64-linux-gnu/perl-base/unicore/To/NFCQC.pl, because No such file or directory
set_attributes: failed to set time on ./fsroot-vs/usr/lib/x86_64-linux-gnu/perl-base/unicore/To/NFDQC.pl, because No such file or directory
set_attributes: failed to set time on ./fsroot-vs/usr/lib/x86_64-linux-gnu/perl-base/unicore/To/NFKCCF.pl, because No such file or directory
set_attributes: failed to set time on ./fsroot-vs/usr/lib/x86_64-linux-gnu/perl-base/unicore/To/NFKCQC.pl, because No such file or directory
set_attributes: failed to set time on ./fsroot-vs/usr/lib/x86_64-linux-gnu/perl-base/unicore/To/NFKDQC.pl, because No such file or directory
set_attributes: failed to set time on ./fsroot-vs/usr/lib/x86_64-linux-gnu/perl-base/unicore/To/Na1.pl, because No such file or directory
set_attributes: failed to set time on ./fsroot-vs/usr/lib/x86_64-linux-gnu/perl-base/unicore/To/NameAlia.pl, because No such file or directory
set_attributes: failed to set time on ./fsroot-vs/usr/lib/x86_64-linux-gnu/perl-base/unicore/To/Nt.pl, because No such file or directory
set_attributes: failed to set time on ./fsroot-vs/usr/lib/x86_64-linux-gnu/perl-base/unicore/To/Nv.pl, because No such file or directory
set_attributes: failed to set time on ./fsroot-vs/usr/lib/x86_64-linux-gnu/perl-base/unicore/To/PerlDeci.pl, because No such file or directory
set_attributes: failed to set time on ./fsroot-vs/usr/lib/x86_64-linux-gnu/perl-base/unicore/To/SB.pl, because No such file or directory
set_attributes: failed to set time on ./fsroot-vs/usr/lib/x86_64-linux-gnu/perl-base/unicore/To/Sc.pl, because No such file or directory
set_attributes: failed to set time on ./fsroot-vs/usr/lib/x86_64-linux-gnu/perl-base/unicore/To/Scx.pl, because No such file or directory
set_attributes: failed to set time on ./fsroot-vs/usr/lib/x86_64-linux-gnu/perl-base/unicore/To/Tc.pl, because No such file or directory
set_attributes: failed to set time on ./fsroot-vs/usr/lib/x86_64-linux-gnu/perl-base/unicore/To/Uc.pl, because No such file or directory
set_attributes: failed to set time on ./fsroot-vs/usr/lib/x86_64-linux-gnu/perl-base/unicore/To/Vo.pl, because No such file or directory
set_attributes: failed to set time on ./fsroot-vs/usr/lib/x86_64-linux-gnu/perl-base/unicore/To/WB.pl, because No such file or directory
set_attributes: failed to set time on ./fsroot-vs/usr/lib/x86_64-linux-gnu/perl-base/unicore/To/_PerlLB.pl, because No such file or directory
set_attributes: failed to set time on ./fsroot-vs/usr/lib/x86_64-linux-gnu/perl-base/unicore/To/_PerlSCX.pl, because No such file or directory
set_attributes: failed to set time on ./fsroot-vs/usr/lib/x86_64-linux-gnu/perl-base/unicore/To, because No such file or directory
set_attributes: failed to set time on ./fsroot-vs/usr/lib/x86_64-linux-gnu/perl-base/unicore/lib/Age/NA.pl, because No such file or directory
set_attributes: failed to set time on ./fsroot-vs/usr/lib/x86_64-linux-gnu/perl-base/unicore/lib/Age/V100.pl, because No such file or directory
set_attributes: failed to set time on ./fsroot-vs/usr/lib/x86_64-linux-gnu/perl-base/unicore/lib/Age/V11.pl, because No such file or directory
set_attributes: failed to set time on ./fsroot-vs/usr/lib/x86_64-linux-gnu/perl-base/unicore/lib/Age/V110.pl, because No such file or directory
set_attributes: failed to set time on ./fsroot-vs/usr/lib/x86_64-linux-gnu/perl-base/unicore/lib/Age/V120.pl, because No such file or directory
set_attributes: failed to set time on ./fsroot-vs/usr/lib/x86_64-linux-gnu/perl-base/unicore/lib/Age/V130.pl, because No such file or directory
set_attributes: failed to set time on ./fsroot-vs/usr/lib/x86_64-linux-gnu/perl-base/unicore/lib/Age/V140.pl, because No such file or directory
set_attributes: failed to set time on ./fsroot-vs/usr/lib/x86_64-linux-gnu/perl-base/unicore/lib/Age/V20.pl, because No such file or directory
set_attributes: failed to set time on ./fsroot-vs/usr/lib/x86_64-linux-gnu/perl-base/unicore/lib/Age/V30.pl, because No such file or directory
set_attributes: failed to set time on ./fsroot-vs/usr/lib/x86_64-linux-gnu/perl-base/unicore/lib/Age/V31.pl, because No such file or directory
set_attributes: failed to set time on ./fsroot-vs/usr/lib/x86_64-linux-gnu/perl-base/unicore/lib/Age/V32.pl, because No such file or directory
set_attributes: failed to set time on ./fsroot-vs/usr/lib/x86_64-linux-gnu/perl-base/unicore/lib/Age/V40.pl, because No such file or directory
set_attributes: failed to set time on ./fsroot-vs/usr/lib/x86_64-linux-gnu/perl-base/unicore/lib/Age/V41.pl, because No such file or directory
set_attributes: failed to set time on ./fsroot-vs/usr/lib/x86_64-linux-gnu/perl-base/unicore/lib/Age/V50.pl, because No such file or directory
set_attributes: failed to set time on ./fsroot-vs/usr/lib/x86_64-linux-gnu/perl-base/unicore/lib/Age/V51.pl, because No such file or directory
set_attributes: failed to set time on ./fsroot-vs/usr/lib/x86_64-linux-gnu/perl-base/unicore/lib/Age/V52.pl, because No such file or directory
set_attributes: failed to set time on ./fsroot-vs/usr/lib/x86_64-linux-gnu/perl-base/unicore/lib/Age/V60.pl, because No such file or directory
set_attributes: failed to set time on ./fsroot-vs/usr/lib/x86_64-linux-gnu/perl-base/unicore/lib/Age/V61.pl, because No such file or directory
set_attributes: failed to set time on ./fsroot-vs/usr/lib/x86_64-linux-gnu/perl-base/unicore/lib/Age/V70.pl, because No such file or directory
set_attributes: failed to set time on ./fsroot-vs/usr/lib/x86_64-linux-gnu/perl-base/unicore/lib/Age/V80.pl, because No such file or directory
set_attributes: failed to set time on ./fsroot-vs/usr/lib/x86_64-linux-gnu/perl-base/unicore/lib/Age/V90.pl, because No such file or directory
set_attributes: failed to set time on ./fsroot-vs/usr/lib/x86_64-linux-gnu/perl-base/unicore/lib/Age, because No such file or directory
set_attributes: failed to set time on ./fsroot-vs/usr/lib/x86_64-linux-gnu/perl-base/unicore/lib/Alpha/Y.pl, because No such file or directory
set_attributes: failed to set time on ./fsroot-vs/usr/lib/x86_64-linux-gnu/perl-base/unicore/lib/Alpha, because No such file or directory
set_attributes: failed to set time on ./fsroot-vs/usr/lib/x86_64-linux-gnu/perl-base/unicore/lib/Bc/AL.pl, because No such file or directory
set_attributes: failed to set time on ./fsroot-vs/usr/lib/x86_64-linux-gnu/perl-base/unicore/lib/Bc/AN.pl, because No such file or directory
set_attributes: failed to set time on ./fsroot-vs/usr/lib/x86_64-linux-gnu/perl-base/unicore/lib/Bc/B.pl, because No such file or directory
set_attributes: failed to set time on ./fsroot-vs/usr/lib/x86_64-linux-gnu/perl-base/unicore/lib/Bc/BN.pl, because No such file or directory
set_attributes: failed to set time on ./fsroot-vs/usr/lib/x86_64-linux-gnu/perl-base/unicore/lib/Bc/CS.pl, because No such file or directory
set_attributes: failed to set time on ./fsroot-vs/usr/lib/x86_64-linux-gnu/perl-base/unicore/lib/Bc/EN.pl, because No such file or directory
set_attributes: failed to set time on ./fsroot-vs/usr/lib/x86_64-linux-gnu/perl-base/unicore/lib/Bc/ES.pl, because No such file or directory
set_attributes: failed to set time on ./fsroot-vs/usr/lib/x86_64-linux-gnu/perl-base/unicore/lib/Bc/ET.pl, because No such file or directory
set_attributes: failed to set time on ./fsroot-vs/usr/lib/x86_64-linux-gnu/perl-base/unicore/lib/Bc/L.pl, because No such file or directory
set_attributes: failed to set time on ./fsroot-vs/usr/lib/x86_64-linux-gnu/perl-base/unicore/lib/Bc/NSM.pl, because No such file or directory
set_attributes: failed to set time on ./fsroot-vs/usr/lib/x86_64-linux-gnu/perl-base/unicore/lib/Bc/ON.pl, because No such file or directory
set_attributes: failed to set time on ./fsroot-vs/usr/lib/x86_64-linux-gnu/perl-base/unicore/lib/Bc/R.pl, because No such file or directory
set_attributes: failed to set time on ./fsroot-vs/usr/lib/x86_64-linux-gnu/perl-base/unicore/lib/Bc/WS.pl, because No such file or directory
set_attributes: failed to set time on ./fsroot-vs/usr/lib/x86_64-linux-gnu/perl-base/unicore/lib/Bc, because No such file or directory
set_attributes: failed to set time on ./fsroot-vs/usr/lib/x86_64-linux-gnu/perl-base/unicore/lib/BidiC/Y.pl, because No such file or directory
set_attributes: failed to set time on ./fsroot-vs/usr/lib/x86_64-linux-gnu/perl-base/unicore/lib/BidiC, because No such file or directory
set_attributes: failed to set time on ./fsroot-vs/usr/lib/x86_64-linux-gnu/perl-base/unicore/lib/BidiM/Y.pl, because No such file or directory
set_attributes: failed to set time on ./fsroot-vs/usr/lib/x86_64-linux-gnu/perl-base/unicore/lib/BidiM, because No such file or directory
set_attributes: failed to set time on ./fsroot-vs/usr/lib/x86_64-linux-gnu/perl-base/unicore/lib/Blk/NB.pl, because No such file or directory
set_attributes: failed to set time on ./fsroot-vs/usr/lib/x86_64-linux-gnu/perl-base/unicore/lib/Blk, because No such file or directory
set_attributes: failed to set time on ./fsroot-vs/usr/lib/x86_64-linux-gnu/perl-base/unicore/lib/Bpt/C.pl, because No such file or directory
set_attributes: failed to set time on ./fsroot-vs/usr/lib/x86_64-linux-gnu/perl-base/unicore/lib/Bpt/N.pl, because No such file or directory
set_attributes: failed to set time on ./fsroot-vs/usr/lib/x86_64-linux-gnu/perl-base/unicore/lib/Bpt/O.pl, because No such file or directory
set_attributes: failed to set time on ./fsroot-vs/usr/lib/x86_64-linux-gnu/perl-base/unicore/lib/Bpt, because No such file or directory
set_attributes: failed to set time on ./fsroot-vs/usr/lib/x86_64-linux-gnu/perl-base/unicore/lib/CE/Y.pl, because No such file or directory
set_attributes: failed to set time on ./fsroot-vs/usr/lib/x86_64-linux-gnu/perl-base/unicore/lib/CE, because No such file or directory
set_attributes: failed to set time on ./fsroot-vs/usr/lib/x86_64-linux-gnu/perl-base/unicore/lib/CI/Y.pl, because No such file or directory
set_attributes: failed to set time on ./fsroot-vs/usr/lib/x86_64-linux-gnu/perl-base/unicore/lib/CI, because No such file or directory
set_attributes: failed to set time on ./fsroot-vs/usr/lib/x86_64-linux-gnu/perl-base/unicore/lib/CWCF/Y.pl, because No such file or directory
set_attributes: failed to set time on ./fsroot-vs/usr/lib/x86_64-linux-gnu/perl-base/unicore/lib/CWCF, because No such file or directory
set_attributes: failed to set time on ./fsroot-vs/usr/lib/x86_64-linux-gnu/perl-base/unicore/lib/CWCM/Y.pl, because No such file or directory
set_attributes: failed to set time on ./fsroot-vs/usr/lib/x86_64-linux-gnu/perl-base/unicore/lib/CWCM, because No such file or directory
set_attributes: failed to set time on ./fsroot-vs/usr/lib/x86_64-linux-gnu/perl-base/unicore/lib/CWKCF/Y.pl, because No such file or directory
set_attributes: failed to set time on ./fsroot-vs/usr/lib/x86_64-linux-gnu/perl-base/unicore/lib/CWKCF, because No such file or directory
set_attributes: failed to set time on ./fsroot-vs/usr/lib/x86_64-linux-gnu/perl-base/unicore/lib/CWL/Y.pl, because No such file or directory
set_attributes: failed to set time on ./fsroot-vs/usr/lib/x86_64-linux-gnu/perl-base/unicore/lib/CWL, because No such file or directory
set_attributes: failed to set time on ./fsroot-vs/usr/lib/x86_64-linux-gnu/perl-base/unicore/lib/CWT/Y.pl, because No such file or directory
set_attributes: failed to set time on ./fsroot-vs/usr/lib/x86_64-linux-gnu/perl-base/unicore/lib/CWT, because No such file or directory
set_attributes: failed to set time on ./fsroot-vs/usr/lib/x86_64-linux-gnu/perl-base/unicore/lib/CWU/Y.pl, because No such file or directory
set_attributes: failed to set time on ./fsroot-vs/usr/lib/x86_64-linux-gnu/perl-base/unicore/lib/CWU, because No such file or directory
set_attributes: failed to set time on ./fsroot-vs/usr/lib/x86_64-linux-gnu/perl-base/unicore/lib/Cased/Y.pl, because No such file or directory
set_attributes: failed to set time on ./fsroot-vs/usr/lib/x86_64-linux-gnu/perl-base/unicore/lib/Cased, because No such file or directory
set_attributes: failed to set time on ./fsroot-vs/usr/lib/x86_64-linux-gnu/perl-base/unicore/lib/Ccc/A.pl, because No such file or directory
set_attributes: failed to set time on ./fsroot-vs/usr/lib/x86_64-linux-gnu/perl-base/unicore/lib/Ccc/AL.pl, because No such file or directory
set_attributes: failed to set time on ./fsroot-vs/usr/lib/x86_64-linux-gnu/perl-base/unicore/lib/Ccc/AR.pl, because No such file or directory
set_attributes: failed to set time on ./fsroot-vs/usr/lib/x86_64-linux-gnu/perl-base/unicore/lib/Ccc/ATAR.pl, because No such file or directory
set_attributes: failed to set time on ./fsroot-vs/usr/lib/x86_64-linux-gnu/perl-base/unicore/lib/Ccc/B.pl, because No such file or directory
set_attributes: failed to set time on ./fsroot-vs/usr/lib/x86_64-linux-gnu/perl-base/unicore/lib/Ccc/BR.pl, because No such file or directory
set_attributes: failed to set time on ./fsroot-vs/usr/lib/x86_64-linux-gnu/perl-base/unicore/lib/Ccc/DB.pl, because No such file or directory
set_attributes: failed to set time on ./fsroot-vs/usr/lib/x86_64-linux-gnu/perl-base/unicore/lib/Ccc/NK.pl, because No such file or directory
set_attributes: failed to set time on ./fsroot-vs/usr/lib/x86_64-linux-gnu/perl-base/unicore/lib/Ccc/NR.pl, because No such file or directory
set_attributes: failed to set time on ./fsroot-vs/usr/lib/x86_64-linux-gnu/perl-base/unicore/lib/Ccc/OV.pl, because No such file or directory
set_attributes: failed to set time on ./fsroot-vs/usr/lib/x86_64-linux-gnu/perl-base/unicore/lib/Ccc/VR.pl, because No such file or directory
set_attributes: failed to set time on ./fsroot-vs/usr/lib/x86_64-linux-gnu/perl-base/unicore/lib/Ccc, because No such file or directory
set_attributes: failed to set time on ./fsroot-vs/usr/lib/x86_64-linux-gnu/perl-base/unicore/lib/CompEx/Y.pl, because No such file or directory
set_attributes: failed to set time on ./fsroot-vs/usr/lib/x86_64-linux-gnu/perl-base/unicore/lib/CompEx, because No such file or directory
set_attributes: failed to set time on ./fsroot-vs/usr/lib/x86_64-linux-gnu/perl-base/unicore/lib/DI/Y.pl, because No such file or directory
set_attributes: failed to set time on ./fsroot-vs/usr/lib/x86_64-linux-gnu/perl-base/unicore/lib/DI, because No such file or directory
set_attributes: failed to set time on ./fsroot-vs/usr/lib/x86_64-linux-gnu/perl-base/unicore/lib/Dash/Y.pl, because No such file or directory
set_attributes: failed to set time on ./fsroot-vs/usr/lib/x86_64-linux-gnu/perl-base/unicore/lib/Dash, because No such file or directory
set_attributes: failed to set time on ./fsroot-vs/usr/lib/x86_64-linux-gnu/perl-base/unicore/lib/Dep/Y.pl, because No such file or directory
set_attributes: failed to set time on ./fsroot-vs/usr/lib/x86_64-linux-gnu/perl-base/unicore/lib/Dep, because No such file or directory
set_attributes: failed to set time on ./fsroot-vs/usr/lib/x86_64-linux-gnu/perl-base/unicore/lib/Dia/Y.pl, because No such file or directory
set_attributes: failed to set time on ./fsroot-vs/usr/lib/x86_64-linux-gnu/perl-base/unicore/lib/Dia, because No such file or directory
set_attributes: failed to set time on ./fsroot-vs/usr/lib/x86_64-linux-gnu/perl-base/unicore/lib/Dt/Com.pl, because No such file or directory
set_attributes: failed to set time on ./fsroot-vs/usr/lib/x86_64-linux-gnu/perl-base/unicore/lib/Dt/Enc.pl, because No such file or directory
set_attributes: failed to set time on ./fsroot-vs/usr/lib/x86_64-linux-gnu/perl-base/unicore/lib/Dt/Fin.pl, because No such file or directory
set_attributes: failed to set time on ./fsroot-vs/usr/lib/x86_64-linux-gnu/perl-base/unicore/lib/Dt/Font.pl, because No such file or directory
set_attributes: failed to set time on ./fsroot-vs/usr/lib/x86_64-linux-gnu/perl-base/unicore/lib/Dt/Init.pl, because No such file or directory
set_attributes: failed to set time on ./fsroot-vs/usr/lib/x86_64-linux-gnu/perl-base/unicore/lib/Dt/Iso.pl, because No such file or directory
set_attributes: failed to set time on ./fsroot-vs/usr/lib/x86_64-linux-gnu/perl-base/unicore/lib/Dt/Med.pl, because No such file or directory
set_attributes: failed to set time on ./fsroot-vs/usr/lib/x86_64-linux-gnu/perl-base/unicore/lib/Dt/Nar.pl, because No such file or directory
set_attributes: failed to set time on ./fsroot-vs/usr/lib/x86_64-linux-gnu/perl-base/unicore/lib/Dt/Nb.pl, because No such file or directory
set_attributes: failed to set time on ./fsroot-vs/usr/lib/x86_64-linux-gnu/perl-base/unicore/lib/Dt/NonCanon.pl, because No such file or directory
set_attributes: failed to set time on ./fsroot-vs/usr/lib/x86_64-linux-gnu/perl-base/unicore/lib/Dt/Sqr.pl, because No such file or directory
set_attributes: failed to set time on ./fsroot-vs/usr/lib/x86_64-linux-gnu/perl-base/unicore/lib/Dt/Sub.pl, because No such file or directory
set_attributes: failed to set time on ./fsroot-vs/usr/lib/x86_64-linux-gnu/perl-base/unicore/lib/Dt/Sup.pl, because No such file or directory
set_attributes: failed to set time on ./fsroot-vs/usr/lib/x86_64-linux-gnu/perl-base/unicore/lib/Dt/Vert.pl, because No such file or directory
set_attributes: failed to set time on ./fsroot-vs/usr/lib/x86_64-linux-gnu/perl-base/unicore/lib/Dt, because No such file or directory
set_attributes: failed to set time on ./fsroot-vs/usr/lib/x86_64-linux-gnu/perl-base/unicore/lib/EBase/Y.pl, because No such file or directory
set_attributes: failed to set time on ./fsroot-vs/usr/lib/x86_64-linux-gnu/perl-base/unicore/lib/EBase, because No such file or directory
set_attributes: failed to set time on ./fsroot-vs/usr/lib/x86_64-linux-gnu/perl-base/unicore/lib/EComp/Y.pl, because No such file or directory
set_attributes: failed to set time on ./fsroot-vs/usr/lib/x86_64-linux-gnu/perl-base/unicore/lib/EComp, because No such file or directory
set_attributes: failed to set time on ./fsroot-vs/usr/lib/x86_64-linux-gnu/perl-base/unicore/lib/EPres/Y.pl, because No such file or directory
set_attributes: failed to set time on ./fsroot-vs/usr/lib/x86_64-linux-gnu/perl-base/unicore/lib/EPres, because No such file or directory
set_attributes: failed to set time on ./fsroot-vs/usr/lib/x86_64-linux-gnu/perl-base/unicore/lib/Ea/A.pl, because No such file or directory
set_attributes: failed to set time on ./fsroot-vs/usr/lib/x86_64-linux-gnu/perl-base/unicore/lib/Ea/H.pl, because No such file or directory
set_attributes: failed to set time on ./fsroot-vs/usr/lib/x86_64-linux-gnu/perl-base/unicore/lib/Ea/N.pl, because No such file or directory
set_attributes: failed to set time on ./fsroot-vs/usr/lib/x86_64-linux-gnu/perl-base/unicore/lib/Ea/Na.pl, because No such file or directory
set_attributes: failed to set time on ./fsroot-vs/usr/lib/x86_64-linux-gnu/perl-base/unicore/lib/Ea/W.pl, because No such file or directory
set_attributes: failed to set time on ./fsroot-vs/usr/lib/x86_64-linux-gnu/perl-base/unicore/lib/Ea, because No such file or directory
set_attributes: failed to set time on ./fsroot-vs/usr/lib/x86_64-linux-gnu/perl-base/unicore/lib/Emoji/Y.pl, because No such file or directory
set_attributes: failed to set time on ./fsroot-vs/usr/lib/x86_64-linux-gnu/perl-base/unicore/lib/Emoji, because No such file or directory
set_attributes: failed to set time on ./fsroot-vs/usr/lib/x86_64-linux-gnu/perl-base/unicore/lib/Ext/Y.pl, because No such file or directory
set_attributes: failed to set time on ./fsroot-vs/usr/lib/x86_64-linux-gnu/perl-base/unicore/lib/Ext, because No such file or directory
set_attributes: failed to set time on ./fsroot-vs/usr/lib/x86_64-linux-gnu/perl-base/unicore/lib/ExtPict/Y.pl, because No such file or directory
set_attributes: failed to set time on ./fsroot-vs/usr/lib/x86_64-linux-gnu/perl-base/unicore/lib/ExtPict, because No such file or directory
set_attributes: failed to set time on ./fsroot-vs/usr/lib/x86_64-linux-gnu/perl-base/unicore/lib/GCB/CN.pl, because No such file or directory
set_attributes: failed to set time on ./fsroot-vs/usr/lib/x86_64-linux-gnu/perl-base/unicore/lib/GCB/EX.pl, because No such file or directory
set_attributes: failed to set time on ./fsroot-vs/usr/lib/x86_64-linux-gnu/perl-base/unicore/lib/GCB/LV.pl, because No such file or directory
set_attributes: failed to set time on ./fsroot-vs/usr/lib/x86_64-linux-gnu/perl-base/unicore/lib/GCB/LVT.pl, because No such file or directory
set_attributes: failed to set time on ./fsroot-vs/usr/lib/x86_64-linux-gnu/perl-base/unicore/lib/GCB/PP.pl, because No such file or directory
set_attributes: failed to set time on ./fsroot-vs/usr/lib/x86_64-linux-gnu/perl-base/unicore/lib/GCB/SM.pl, because No such file or directory
set_attributes: failed to set time on ./fsroot-vs/usr/lib/x86_64-linux-gnu/perl-base/unicore/lib/GCB/XX.pl, because No such file or directory
set_attributes: failed to set time on ./fsroot-vs/usr/lib/x86_64-linux-gnu/perl-base/unicore/lib/GCB, because No such file or directory
set_attributes: failed to set time on ./fsroot-vs/usr/lib/x86_64-linux-gnu/perl-base/unicore/lib/Gc/C.pl, because No such file or directory
set_attributes: failed to set time on ./fsroot-vs/usr/lib/x86_64-linux-gnu/perl-base/unicore/lib/Gc/Cf.pl, because No such file or directory
set_attributes: failed to set time on ./fsroot-vs/usr/lib/x86_64-linux-gnu/perl-base/unicore/lib/Gc/Cn.pl, because No such file or directory
set_attributes: failed to set time on ./fsroot-vs/usr/lib/x86_64-linux-gnu/perl-base/unicore/lib/Gc/L.pl, because No such file or directory
set_attributes: failed to set time on ./fsroot-vs/usr/lib/x86_64-linux-gnu/perl-base/unicore/lib/Gc/LC.pl, because No such file or directory
set_attributes: failed to set time on ./fsroot-vs/usr/lib/x86_64-linux-gnu/perl-base/unicore/lib/Gc/Ll.pl, because No such file or directory
set_attributes: failed to set time on ./fsroot-vs/usr/lib/x86_64-linux-gnu/perl-base/unicore/lib/Gc/Lm.pl, because No such file or directory
set_attributes: failed to set time on ./fsroot-vs/usr/lib/x86_64-linux-gnu/perl-base/unicore/lib/Gc/Lo.pl, because No such file or directory
set_attributes: failed to set time on ./fsroot-vs/usr/lib/x86_64-linux-gnu/perl-base/unicore/lib/Gc/Lu.pl, because No such file or directory
set_attributes: failed to set time on ./fsroot-vs/usr/lib/x86_64-linux-gnu/perl-base/unicore/lib/Gc/M.pl, because No such file or directory
set_attributes: failed to set time on ./fsroot-vs/usr/lib/x86_64-linux-gnu/perl-base/unicore/lib/Gc/Mc.pl, because No such file or directory
set_attributes: failed to set time on ./fsroot-vs/usr/lib/x86_64-linux-gnu/perl-base/unicore/lib/Gc/Me.pl, because No such file or directory
set_attributes: failed to set time on ./fsroot-vs/usr/lib/x86_64-linux-gnu/perl-base/unicore/lib/Gc/Mn.pl, because No such file or directory
set_attributes: failed to set time on ./fsroot-vs/usr/lib/x86_64-linux-gnu/perl-base/unicore/lib/Gc/N.pl, because No such file or directory
set_attributes: failed to set time on ./fsroot-vs/usr/lib/x86_64-linux-gnu/perl-base/unicore/lib/Gc/Nd.pl, because No such file or directory
set_attributes: failed to set time on ./fsroot-vs/usr/lib/x86_64-linux-gnu/perl-base/unicore/lib/Gc/Nl.pl, because No such file or directory
set_attributes: failed to set time on ./fsroot-vs/usr/lib/x86_64-linux-gnu/perl-base/unicore/lib/Gc/No.pl, because No such file or directory
set_attributes: failed to set time on ./fsroot-vs/usr/lib/x86_64-linux-gnu/perl-base/unicore/lib/Gc/P.pl, because No such file or directory
set_attributes: failed to set time on ./fsroot-vs/usr/lib/x86_64-linux-gnu/perl-base/unicore/lib/Gc/Pc.pl, because No such file or directory
set_attributes: failed to set time on ./fsroot-vs/usr/lib/x86_64-linux-gnu/perl-base/unicore/lib/Gc/Pd.pl, because No such file or directory
set_attributes: failed to set time on ./fsroot-vs/usr/lib/x86_64-linux-gnu/perl-base/unicore/lib/Gc/Pe.pl, because No such file or directory
set_attributes: failed to set time on ./fsroot-vs/usr/lib/x86_64-linux-gnu/perl-base/unicore/lib/Gc/Pf.pl, because No such file or directory
set_attributes: failed to set time on ./fsroot-vs/usr/lib/x86_64-linux-gnu/perl-base/unicore/lib/Gc/Pi.pl, because No such file or directory
set_attributes: failed to set time on ./fsroot-vs/usr/lib/x86_64-linux-gnu/perl-base/unicore/lib/Gc/Po.pl, because No such file or directory
set_attributes: failed to set time on ./fsroot-vs/usr/lib/x86_64-linux-gnu/perl-base/unicore/lib/Gc/Ps.pl, because No such file or directory
set_attributes: failed to set time on ./fsroot-vs/usr/lib/x86_64-linux-gnu/perl-base/unicore/lib/Gc/S.pl, because No such file or directory
set_attributes: failed to set time on ./fsroot-vs/usr/lib/x86_64-linux-gnu/perl-base/unicore/lib/Gc/Sc.pl, because No such file or directory
set_attributes: failed to set time on ./fsroot-vs/usr/lib/x86_64-linux-gnu/perl-base/unicore/lib/Gc/Sk.pl, because No such file or directory
set_attributes: failed to set time on ./fsroot-vs/usr/lib/x86_64-linux-gnu/perl-base/unicore/lib/Gc/Sm.pl, because No such file or directory
set_attributes: failed to set time on ./fsroot-vs/usr/lib/x86_64-linux-gnu/perl-base/unicore/lib/Gc/So.pl, because No such file or directory
set_attributes: failed to set time on ./fsroot-vs/usr/lib/x86_64-linux-gnu/perl-base/unicore/lib/Gc/Z.pl, because No such file or directory
set_attributes: failed to set time on ./fsroot-vs/usr/lib/x86_64-linux-gnu/perl-base/unicore/lib/Gc/Zs.pl, because No such file or directory
set_attributes: failed to set time on ./fsroot-vs/usr/lib/x86_64-linux-gnu/perl-base/unicore/lib/Gc, because No such file or directory
set_attributes: failed to set time on ./fsroot-vs/usr/lib/x86_64-linux-gnu/perl-base/unicore/lib/GrBase/Y.pl, because No such file or directory
set_attributes: failed to set time on ./fsroot-vs/usr/lib/x86_64-linux-gnu/perl-base/unicore/lib/GrBase, because No such file or directory
set_attributes: failed to set time on ./fsroot-vs/usr/lib/x86_64-linux-gnu/perl-base/unicore/lib/GrExt/Y.pl, because No such file or directory
set_attributes: failed to set time on ./fsroot-vs/usr/lib/x86_64-linux-gnu/perl-base/unicore/lib/GrExt, because No such file or directory
set_attributes: failed to set time on ./fsroot-vs/usr/lib/x86_64-linux-gnu/perl-base/unicore/lib/Hex/Y.pl, because No such file or directory
set_attributes: failed to set time on ./fsroot-vs/usr/lib/x86_64-linux-gnu/perl-base/unicore/lib/Hex, because No such file or directory
set_attributes: failed to set time on ./fsroot-vs/usr/lib/x86_64-linux-gnu/perl-base/unicore/lib/Hst/NA.pl, because No such file or directory
set_attributes: failed to set time on ./fsroot-vs/usr/lib/x86_64-linux-gnu/perl-base/unicore/lib/Hst, because No such file or directory
set_attributes: failed to set time on ./fsroot-vs/usr/lib/x86_64-linux-gnu/perl-base/unicore/lib/Hyphen/T.pl, because No such file or directory
set_attributes: failed to set time on ./fsroot-vs/usr/lib/x86_64-linux-gnu/perl-base/unicore/lib/Hyphen, because No such file or directory
set_attributes: failed to set time on ./fsroot-vs/usr/lib/x86_64-linux-gnu/perl-base/unicore/lib/IDC/Y.pl, because No such file or directory
set_attributes: failed to set time on ./fsroot-vs/usr/lib/x86_64-linux-gnu/perl-base/unicore/lib/IDC, because No such file or directory
set_attributes: failed to set time on ./fsroot-vs/usr/lib/x86_64-linux-gnu/perl-base/unicore/lib/IDS/Y.pl, because No such file or directory
set_attributes: failed to set time on ./fsroot-vs/usr/lib/x86_64-linux-gnu/perl-base/unicore/lib/IDS, because No such file or directory
set_attributes: failed to set time on ./fsroot-vs/usr/lib/x86_64-linux-gnu/perl-base/unicore/lib/IdStatus/Allowed.pl, because No such file or directory
set_attributes: failed to set time on ./fsroot-vs/usr/lib/x86_64-linux-gnu/perl-base/unicore/lib/IdStatus/Restrict.pl, because No such file or directory
set_attributes: failed to set time on ./fsroot-vs/usr/lib/x86_64-linux-gnu/perl-base/unicore/lib/IdStatus, because No such file or directory
set_attributes: failed to set time on ./fsroot-vs/usr/lib/x86_64-linux-gnu/perl-base/unicore/lib/IdType/DefaultI.pl, because No such file or directory
set_attributes: failed to set time on ./fsroot-vs/usr/lib/x86_64-linux-gnu/perl-base/unicore/lib/IdType/Exclusio.pl, because No such file or directory
set_attributes: failed to set time on ./fsroot-vs/usr/lib/x86_64-linux-gnu/perl-base/unicore/lib/IdType/Inclusio.pl, because No such file or directory
set_attributes: failed to set time on ./fsroot-vs/usr/lib/x86_64-linux-gnu/perl-base/unicore/lib/IdType/LimitedU.pl, because No such file or directory
set_attributes: failed to set time on ./fsroot-vs/usr/lib/x86_64-linux-gnu/perl-base/unicore/lib/IdType/NotChara.pl, because No such file or directory
set_attributes: failed to set time on ./fsroot-vs/usr/lib/x86_64-linux-gnu/perl-base/unicore/lib/IdType/NotNFKC.pl, because No such file or directory
set_attributes: failed to set time on ./fsroot-vs/usr/lib/x86_64-linux-gnu/perl-base/unicore/lib/IdType/NotXID.pl, because No such file or directory
set_attributes: failed to set time on ./fsroot-vs/usr/lib/x86_64-linux-gnu/perl-base/unicore/lib/IdType/Obsolete.pl, because No such file or directory
set_attributes: failed to set time on ./fsroot-vs/usr/lib/x86_64-linux-gnu/perl-base/unicore/lib/IdType/Recommen.pl, because No such file or directory
set_attributes: failed to set time on ./fsroot-vs/usr/lib/x86_64-linux-gnu/perl-base/unicore/lib/IdType/Technica.pl, because No such file or directory
set_attributes: failed to set time on ./fsroot-vs/usr/lib/x86_64-linux-gnu/perl-base/unicore/lib/IdType/Uncommon.pl, because No such file or directory
set_attributes: failed to set time on ./fsroot-vs/usr/lib/x86_64-linux-gnu/perl-base/unicore/lib/IdType, because No such file or directory
set_attributes: failed to set time on ./fsroot-vs/usr/lib/x86_64-linux-gnu/perl-base/unicore/lib/Ideo/Y.pl, because No such file or directory
set_attributes: failed to set time on ./fsroot-vs/usr/lib/x86_64-linux-gnu/perl-base/unicore/lib/Ideo, because No such file or directory
set_attributes: failed to set time on ./fsroot-vs/usr/lib/x86_64-linux-gnu/perl-base/unicore/lib/In/10_0.pl, because No such file or directory
set_attributes: failed to set time on ./fsroot-vs/usr/lib/x86_64-linux-gnu/perl-base/unicore/lib/In/11_0.pl, because No such file or directory
set_attributes: failed to set time on ./fsroot-vs/usr/lib/x86_64-linux-gnu/perl-base/unicore/lib/In/12_0.pl, because No such file or directory
set_attributes: failed to set time on ./fsroot-vs/usr/lib/x86_64-linux-gnu/perl-base/unicore/lib/In/12_1.pl, because No such file or directory
set_attributes: failed to set time on ./fsroot-vs/usr/lib/x86_64-linux-gnu/perl-base/unicore/lib/In/13_0.pl, because No such file or directory
set_attributes: failed to set time on ./fsroot-vs/usr/lib/x86_64-linux-gnu/perl-base/unicore/lib/In/14_0.pl, because No such file or directory
set_attributes: failed to set time on ./fsroot-vs/usr/lib/x86_64-linux-gnu/perl-base/unicore/lib/In/2_0.pl, because No such file or directory
set_attributes: failed to set time on ./fsroot-vs/usr/lib/x86_64-linux-gnu/perl-base/unicore/lib/In/2_1.pl, because No such file or directory
set_attributes: failed to set time on ./fsroot-vs/usr/lib/x86_64-linux-gnu/perl-base/unicore/lib/In/3_0.pl, because No such file or directory
set_attributes: failed to set time on ./fsroot-vs/usr/lib/x86_64-linux-gnu/perl-base/unicore/lib/In/3_1.pl, because No such file or directory
set_attributes: failed to set time on ./fsroot-vs/usr/lib/x86_64-linux-gnu/perl-base/unicore/lib/In/3_2.pl, because No such file or directory
set_attributes: failed to set time on ./fsroot-vs/usr/lib/x86_64-linux-gnu/perl-base/unicore/lib/In/4_0.pl, because No such file or directory
set_attributes: failed to set time on ./fsroot-vs/usr/lib/x86_64-linux-gnu/perl-base/unicore/lib/In/4_1.pl, because No such file or directory
set_attributes: failed to set time on ./fsroot-vs/usr/lib/x86_64-linux-gnu/perl-base/unicore/lib/In/5_0.pl, because No such file or directory
set_attributes: failed to set time on ./fsroot-vs/usr/lib/x86_64-linux-gnu/perl-base/unicore/lib/In/5_1.pl, because No such file or directory
set_attributes: failed to set time on ./fsroot-vs/usr/lib/x86_64-linux-gnu/perl-base/unicore/lib/In/5_2.pl, because No such file or directory
set_attributes: failed to set time on ./fsroot-vs/usr/lib/x86_64-linux-gnu/perl-base/unicore/lib/In/6_0.pl, because No such file or directory
set_attributes: failed to set time on ./fsroot-vs/usr/lib/x86_64-linux-gnu/perl-base/unicore/lib/In/6_1.pl, because No such file or directory
set_attributes: failed to set time on ./fsroot-vs/usr/lib/x86_64-linux-gnu/perl-base/unicore/lib/In/6_2.pl, because No such file or directory
set_attributes: failed to set time on ./fsroot-vs/usr/lib/x86_64-linux-gnu/perl-base/unicore/lib/In/6_3.pl, because No such file or directory
set_attributes: failed to set time on ./fsroot-vs/usr/lib/x86_64-linux-gnu/perl-base/unicore/lib/In/7_0.pl, because No such file or directory
set_attributes: failed to set time on ./fsroot-vs/usr/lib/x86_64-linux-gnu/perl-base/unicore/lib/In/8_0.pl, because No such file or directory
set_attributes: failed to set time on ./fsroot-vs/usr/lib/x86_64-linux-gnu/perl-base/unicore/lib/In/9_0.pl, because No such file or directory
set_attributes: failed to set time on ./fsroot-vs/usr/lib/x86_64-linux-gnu/perl-base/unicore/lib/In, because No such file or directory
set_attributes: failed to set time on ./fsroot-vs/usr/lib/x86_64-linux-gnu/perl-base/unicore/lib/InPC/Bottom.pl, because No such file or directory
set_attributes: failed to set time on ./fsroot-vs/usr/lib/x86_64-linux-gnu/perl-base/unicore/lib/InPC/BottomAn.pl, because No such file or directory
set_attributes: failed to set time on ./fsroot-vs/usr/lib/x86_64-linux-gnu/perl-base/unicore/lib/InPC/Left.pl, because No such file or directory
set_attributes: failed to set time on ./fsroot-vs/usr/lib/x86_64-linux-gnu/perl-base/unicore/lib/InPC/LeftAndR.pl, because No such file or directory
set_attributes: failed to set time on ./fsroot-vs/usr/lib/x86_64-linux-gnu/perl-base/unicore/lib/InPC/NA.pl, because No such file or directory
set_attributes: failed to set time on ./fsroot-vs/usr/lib/x86_64-linux-gnu/perl-base/unicore/lib/InPC/Overstru.pl, because No such file or directory
set_attributes: failed to set time on ./fsroot-vs/usr/lib/x86_64-linux-gnu/perl-base/unicore/lib/InPC/Right.pl, because No such file or directory
set_attributes: failed to set time on ./fsroot-vs/usr/lib/x86_64-linux-gnu/perl-base/unicore/lib/InPC/Top.pl, because No such file or directory
set_attributes: failed to set time on ./fsroot-vs/usr/lib/x86_64-linux-gnu/perl-base/unicore/lib/InPC/TopAndBo.pl, because No such file or directory
set_attributes: failed to set time on ./fsroot-vs/usr/lib/x86_64-linux-gnu/perl-base/unicore/lib/InPC/TopAndL2.pl, because No such file or directory
set_attributes: failed to set time on ./fsroot-vs/usr/lib/x86_64-linux-gnu/perl-base/unicore/lib/InPC/TopAndLe.pl, because No such file or directory
set_attributes: failed to set time on ./fsroot-vs/usr/lib/x86_64-linux-gnu/perl-base/unicore/lib/InPC/TopAndRi.pl, because No such file or directory
set_attributes: failed to set time on ./fsroot-vs/usr/lib/x86_64-linux-gnu/perl-base/unicore/lib/InPC/VisualOr.pl, because No such file or directory
set_attributes: failed to set time on ./fsroot-vs/usr/lib/x86_64-linux-gnu/perl-base/unicore/lib/InPC, because No such file or directory
set_attributes: failed to set time on ./fsroot-vs/usr/lib/x86_64-linux-gnu/perl-base/unicore/lib/InSC/Avagraha.pl, because No such file or directory
set_attributes: failed to set time on ./fsroot-vs/usr/lib/x86_64-linux-gnu/perl-base/unicore/lib/InSC/Bindu.pl, because No such file or directory
set_attributes: failed to set time on ./fsroot-vs/usr/lib/x86_64-linux-gnu/perl-base/unicore/lib/InSC/Cantilla.pl, because No such file or directory
set_attributes: failed to set time on ./fsroot-vs/usr/lib/x86_64-linux-gnu/perl-base/unicore/lib/InSC/Consona2.pl, because No such file or directory
set_attributes: failed to set time on ./fsroot-vs/usr/lib/x86_64-linux-gnu/perl-base/unicore/lib/InSC/Consona3.pl, because No such file or directory
set_attributes: failed to set time on ./fsroot-vs/usr/lib/x86_64-linux-gnu/perl-base/unicore/lib/InSC/Consona4.pl, because No such file or directory
set_attributes: failed to set time on ./fsroot-vs/usr/lib/x86_64-linux-gnu/perl-base/unicore/lib/InSC/Consona5.pl, because No such file or directory
set_attributes: failed to set time on ./fsroot-vs/usr/lib/x86_64-linux-gnu/perl-base/unicore/lib/InSC/Consona6.pl, because No such file or directory
set_attributes: failed to set time on ./fsroot-vs/usr/lib/x86_64-linux-gnu/perl-base/unicore/lib/InSC/Consona7.pl, because No such file or directory
set_attributes: failed to set time on ./fsroot-vs/usr/lib/x86_64-linux-gnu/perl-base/unicore/lib/InSC/Consona8.pl, because No such file or directory
set_attributes: failed to set time on ./fsroot-vs/usr/lib/x86_64-linux-gnu/perl-base/unicore/lib/InSC/Consonan.pl, because No such file or directory
set_attributes: failed to set time on ./fsroot-vs/usr/lib/x86_64-linux-gnu/perl-base/unicore/lib/InSC/Invisibl.pl, because No such file or directory
set_attributes: failed to set time on ./fsroot-vs/usr/lib/x86_64-linux-gnu/perl-base/unicore/lib/InSC/Nukta.pl, because No such file or directory
set_attributes: failed to set time on ./fsroot-vs/usr/lib/x86_64-linux-gnu/perl-base/unicore/lib/InSC/Number.pl, because No such file or directory
set_attributes: failed to set time on ./fsroot-vs/usr/lib/x86_64-linux-gnu/perl-base/unicore/lib/InSC/Other.pl, because No such file or directory
set_attributes: failed to set time on ./fsroot-vs/usr/lib/x86_64-linux-gnu/perl-base/unicore/lib/InSC/PureKill.pl, because No such file or directory
set_attributes: failed to set time on ./fsroot-vs/usr/lib/x86_64-linux-gnu/perl-base/unicore/lib/InSC/Syllable.pl, because No such file or directory
set_attributes: failed to set time on ./fsroot-vs/usr/lib/x86_64-linux-gnu/perl-base/unicore/lib/InSC/ToneMark.pl, because No such file or directory
set_attributes: failed to set time on ./fsroot-vs/usr/lib/x86_64-linux-gnu/perl-base/unicore/lib/InSC/Virama.pl, because No such file or directory
set_attributes: failed to set time on ./fsroot-vs/usr/lib/x86_64-linux-gnu/perl-base/unicore/lib/InSC/Visarga.pl, because No such file or directory
set_attributes: failed to set time on ./fsroot-vs/usr/lib/x86_64-linux-gnu/perl-base/unicore/lib/InSC/Vowel.pl, because No such file or directory
set_attributes: failed to set time on ./fsroot-vs/usr/lib/x86_64-linux-gnu/perl-base/unicore/lib/InSC/VowelDep.pl, because No such file or directory
set_attributes: failed to set time on ./fsroot-vs/usr/lib/x86_64-linux-gnu/perl-base/unicore/lib/InSC/VowelInd.pl, because No such file or directory
set_attributes: failed to set time on ./fsroot-vs/usr/lib/x86_64-linux-gnu/perl-base/unicore/lib/InSC, because No such file or directory
set_attributes: failed to set time on ./fsroot-vs/usr/lib/x86_64-linux-gnu/perl-base/unicore/lib/Jg/Ain.pl, because No such file or directory
set_attributes: failed to set time on ./fsroot-vs/usr/lib/x86_64-linux-gnu/perl-base/unicore/lib/Jg/Alef.pl, because No such file or directory
set_attributes: failed to set time on ./fsroot-vs/usr/lib/x86_64-linux-gnu/perl-base/unicore/lib/Jg/Beh.pl, because No such file or directory
set_attributes: failed to set time on ./fsroot-vs/usr/lib/x86_64-linux-gnu/perl-base/unicore/lib/Jg/Dal.pl, because No such file or directory
set_attributes: failed to set time on ./fsroot-vs/usr/lib/x86_64-linux-gnu/perl-base/unicore/lib/Jg/FarsiYeh.pl, because No such file or directory
set_attributes: failed to set time on ./fsroot-vs/usr/lib/x86_64-linux-gnu/perl-base/unicore/lib/Jg/Feh.pl, because No such file or directory
set_attributes: failed to set time on ./fsroot-vs/usr/lib/x86_64-linux-gnu/perl-base/unicore/lib/Jg/Gaf.pl, because No such file or directory
set_attributes: failed to set time on ./fsroot-vs/usr/lib/x86_64-linux-gnu/perl-base/unicore/lib/Jg/Hah.pl, because No such file or directory
set_attributes: failed to set time on ./fsroot-vs/usr/lib/x86_64-linux-gnu/perl-base/unicore/lib/Jg/HanifiRo.pl, because No such file or directory
set_attributes: failed to set time on ./fsroot-vs/usr/lib/x86_64-linux-gnu/perl-base/unicore/lib/Jg/Kaf.pl, because No such file or directory
set_attributes: failed to set time on ./fsroot-vs/usr/lib/x86_64-linux-gnu/perl-base/unicore/lib/Jg/Lam.pl, because No such file or directory
set_attributes: failed to set time on ./fsroot-vs/usr/lib/x86_64-linux-gnu/perl-base/unicore/lib/Jg/NoJoinin.pl, because No such file or directory
set_attributes: failed to set time on ./fsroot-vs/usr/lib/x86_64-linux-gnu/perl-base/unicore/lib/Jg/Noon.pl, because No such file or directory
set_attributes: failed to set time on ./fsroot-vs/usr/lib/x86_64-linux-gnu/perl-base/unicore/lib/Jg/Qaf.pl, because No such file or directory
set_attributes: failed to set time on ./fsroot-vs/usr/lib/x86_64-linux-gnu/perl-base/unicore/lib/Jg/Reh.pl, because No such file or directory
set_attributes: failed to set time on ./fsroot-vs/usr/lib/x86_64-linux-gnu/perl-base/unicore/lib/Jg/Sad.pl, because No such file or directory
set_attributes: failed to set time on ./fsroot-vs/usr/lib/x86_64-linux-gnu/perl-base/unicore/lib/Jg/Seen.pl, because No such file or directory
set_attributes: failed to set time on ./fsroot-vs/usr/lib/x86_64-linux-gnu/perl-base/unicore/lib/Jg/Tah.pl, because No such file or directory
set_attributes: failed to set time on ./fsroot-vs/usr/lib/x86_64-linux-gnu/perl-base/unicore/lib/Jg/Waw.pl, because No such file or directory
set_attributes: failed to set time on ./fsroot-vs/usr/lib/x86_64-linux-gnu/perl-base/unicore/lib/Jg/Yeh.pl, because No such file or directory
set_attributes: failed to set time on ./fsroot-vs/usr/lib/x86_64-linux-gnu/perl-base/unicore/lib/Jg, because No such file or directory
set_attributes: failed to set time on ./fsroot-vs/usr/lib/x86_64-linux-gnu/perl-base/unicore/lib/Jt/C.pl, because No such file or directory
set_attributes: failed to set time on ./fsroot-vs/usr/lib/x86_64-linux-gnu/perl-base/unicore/lib/Jt/D.pl, because No such file or directory
set_attributes: failed to set time on ./fsroot-vs/usr/lib/x86_64-linux-gnu/perl-base/unicore/lib/Jt/L.pl, because No such file or directory
set_attributes: failed to set time on ./fsroot-vs/usr/lib/x86_64-linux-gnu/perl-base/unicore/lib/Jt/R.pl, because No such file or directory
set_attributes: failed to set time on ./fsroot-vs/usr/lib/x86_64-linux-gnu/perl-base/unicore/lib/Jt/T.pl, because No such file or directory
set_attributes: failed to set time on ./fsroot-vs/usr/lib/x86_64-linux-gnu/perl-base/unicore/lib/Jt/U.pl, because No such file or directory
set_attributes: failed to set time on ./fsroot-vs/usr/lib/x86_64-linux-gnu/perl-base/unicore/lib/Jt, because No such file or directory
set_attributes: failed to set time on ./fsroot-vs/usr/lib/x86_64-linux-gnu/perl-base/unicore/lib/Lb/AI.pl, because No such file or directory
set_attributes: failed to set time on ./fsroot-vs/usr/lib/x86_64-linux-gnu/perl-base/unicore/lib/Lb/AL.pl, because No such file or directory
set_attributes: failed to set time on ./fsroot-vs/usr/lib/x86_64-linux-gnu/perl-base/unicore/lib/Lb/BA.pl, because No such file or directory
set_attributes: failed to set time on ./fsroot-vs/usr/lib/x86_64-linux-gnu/perl-base/unicore/lib/Lb/BB.pl, because No such file or directory
set_attributes: failed to set time on ./fsroot-vs/usr/lib/x86_64-linux-gnu/perl-base/unicore/lib/Lb/CJ.pl, because No such file or directory
set_attributes: failed to set time on ./fsroot-vs/usr/lib/x86_64-linux-gnu/perl-base/unicore/lib/Lb/CL.pl, because No such file or directory
set_attributes: failed to set time on ./fsroot-vs/usr/lib/x86_64-linux-gnu/perl-base/unicore/lib/Lb/CM.pl, because No such file or directory
set_attributes: failed to set time on ./fsroot-vs/usr/lib/x86_64-linux-gnu/perl-base/unicore/lib/Lb/EX.pl, because No such file or directory
set_attributes: failed to set time on ./fsroot-vs/usr/lib/x86_64-linux-gnu/perl-base/unicore/lib/Lb/GL.pl, because No such file or directory
set_attributes: failed to set time on ./fsroot-vs/usr/lib/x86_64-linux-gnu/perl-base/unicore/lib/Lb/ID.pl, because No such file or directory
set_attributes: failed to set time on ./fsroot-vs/usr/lib/x86_64-linux-gnu/perl-base/unicore/lib/Lb/IN.pl, because No such file or directory
set_attributes: failed to set time on ./fsroot-vs/usr/lib/x86_64-linux-gnu/perl-base/unicore/lib/Lb/IS.pl, because No such file or directory
set_attributes: failed to set time on ./fsroot-vs/usr/lib/x86_64-linux-gnu/perl-base/unicore/lib/Lb/NS.pl, because No such file or directory
set_attributes: failed to set time on ./fsroot-vs/usr/lib/x86_64-linux-gnu/perl-base/unicore/lib/Lb/NU.pl, because No such file or directory
set_attributes: failed to set time on ./fsroot-vs/usr/lib/x86_64-linux-gnu/perl-base/unicore/lib/Lb/OP.pl, because No such file or directory
set_attributes: failed to set time on ./fsroot-vs/usr/lib/x86_64-linux-gnu/perl-base/unicore/lib/Lb/PO.pl, because No such file or directory
set_attributes: failed to set time on ./fsroot-vs/usr/lib/x86_64-linux-gnu/perl-base/unicore/lib/Lb/PR.pl, because No such file or directory
set_attributes: failed to set time on ./fsroot-vs/usr/lib/x86_64-linux-gnu/perl-base/unicore/lib/Lb/QU.pl, because No such file or directory
set_attributes: failed to set time on ./fsroot-vs/usr/lib/x86_64-linux-gnu/perl-base/unicore/lib/Lb/SA.pl, because No such file or directory
set_attributes: failed to set time on ./fsroot-vs/usr/lib/x86_64-linux-gnu/perl-base/unicore/lib/Lb/XX.pl, because No such file or directory
set_attributes: failed to set time on ./fsroot-vs/usr/lib/x86_64-linux-gnu/perl-base/unicore/lib/Lb, because No such file or directory
set_attributes: failed to set time on ./fsroot-vs/usr/lib/x86_64-linux-gnu/perl-base/unicore/lib/Lower/Y.pl, because No such file or directory
set_attributes: failed to set time on ./fsroot-vs/usr/lib/x86_64-linux-gnu/perl-base/unicore/lib/Lower, because No such file or directory
set_attributes: failed to set time on ./fsroot-vs/usr/lib/x86_64-linux-gnu/perl-base/unicore/lib/Math/Y.pl, because No such file or directory
set_attributes: failed to set time on ./fsroot-vs/usr/lib/x86_64-linux-gnu/perl-base/unicore/lib/Math, because No such file or directory
set_attributes: failed to set time on ./fsroot-vs/usr/lib/x86_64-linux-gnu/perl-base/unicore/lib/NFCQC/M.pl, because No such file or directory
set_attributes: failed to set time on ./fsroot-vs/usr/lib/x86_64-linux-gnu/perl-base/unicore/lib/NFCQC/Y.pl, because No such file or directory
set_attributes: failed to set time on ./fsroot-vs/usr/lib/x86_64-linux-gnu/perl-base/unicore/lib/NFCQC, because No such file or directory
set_attributes: failed to set time on ./fsroot-vs/usr/lib/x86_64-linux-gnu/perl-base/unicore/lib/NFDQC/N.pl, because No such file or directory
set_attributes: failed to set time on ./fsroot-vs/usr/lib/x86_64-linux-gnu/perl-base/unicore/lib/NFDQC/Y.pl, because No such file or directory
set_attributes: failed to set time on ./fsroot-vs/usr/lib/x86_64-linux-gnu/perl-base/unicore/lib/NFDQC, because No such file or directory
set_attributes: failed to set time on ./fsroot-vs/usr/lib/x86_64-linux-gnu/perl-base/unicore/lib/NFKCQC/N.pl, because No such file or directory
set_attributes: failed to set time on ./fsroot-vs/usr/lib/x86_64-linux-gnu/perl-base/unicore/lib/NFKCQC/Y.pl, because No such file or directory
set_attributes: failed to set time on ./fsroot-vs/usr/lib/x86_64-linux-gnu/perl-base/unicore/lib/NFKCQC, because No such file or directory
set_attributes: failed to set time on ./fsroot-vs/usr/lib/x86_64-linux-gnu/perl-base/unicore/lib/NFKDQC/N.pl, because No such file or directory
set_attributes: failed to set time on ./fsroot-vs/usr/lib/x86_64-linux-gnu/perl-base/unicore/lib/NFKDQC/Y.pl, because No such file or directory
set_attributes: failed to set time on ./fsroot-vs/usr/lib/x86_64-linux-gnu/perl-base/unicore/lib/NFKDQC, because No such file or directory
set_attributes: failed to set time on ./fsroot-vs/usr/lib/x86_64-linux-gnu/perl-base/unicore/lib/Nt/Di.pl, because No such file or directory
set_attributes: failed to set time on ./fsroot-vs/usr/lib/x86_64-linux-gnu/perl-base/unicore/lib/Nt/None.pl, because No such file or directory
set_attributes: failed to set time on ./fsroot-vs/usr/lib/x86_64-linux-gnu/perl-base/unicore/lib/Nt/Nu.pl, because No such file or directory
set_attributes: failed to set time on ./fsroot-vs/usr/lib/x86_64-linux-gnu/perl-base/unicore/lib/Nt, because No such file or directory
set_attributes: failed to set time on ./fsroot-vs/usr/lib/x86_64-linux-gnu/perl-base/unicore/lib/Nv/0.pl, because No such file or directory
set_attributes: failed to set time on ./fsroot-vs/usr/lib/x86_64-linux-gnu/perl-base/unicore/lib/Nv/1.pl, because No such file or directory
set_attributes: failed to set time on ./fsroot-vs/usr/lib/x86_64-linux-gnu/perl-base/unicore/lib/Nv/10.pl, because No such file or directory
set_attributes: failed to set time on ./fsroot-vs/usr/lib/x86_64-linux-gnu/perl-base/unicore/lib/Nv/100.pl, because No such file or directory
set_attributes: failed to set time on ./fsroot-vs/usr/lib/x86_64-linux-gnu/perl-base/unicore/lib/Nv/1000.pl, because No such file or directory
set_attributes: failed to set time on ./fsroot-vs/usr/lib/x86_64-linux-gnu/perl-base/unicore/lib/Nv/10000.pl, because No such file or directory
set_attributes: failed to set time on ./fsroot-vs/usr/lib/x86_64-linux-gnu/perl-base/unicore/lib/Nv/100000.pl, because No such file or directory
set_attributes: failed to set time on ./fsroot-vs/usr/lib/x86_64-linux-gnu/perl-base/unicore/lib/Nv/11.pl, because No such file or directory
set_attributes: failed to set time on ./fsroot-vs/usr/lib/x86_64-linux-gnu/perl-base/unicore/lib/Nv/12.pl, because No such file or directory
set_attributes: failed to set time on ./fsroot-vs/usr/lib/x86_64-linux-gnu/perl-base/unicore/lib/Nv/13.pl, because No such file or directory
set_attributes: failed to set time on ./fsroot-vs/usr/lib/x86_64-linux-gnu/perl-base/unicore/lib/Nv/14.pl, because No such file or directory
set_attributes: failed to set time on ./fsroot-vs/usr/lib/x86_64-linux-gnu/perl-base/unicore/lib/Nv/15.pl, because No such file or directory
set_attributes: failed to set time on ./fsroot-vs/usr/lib/x86_64-linux-gnu/perl-base/unicore/lib/Nv/16.pl, because No such file or directory
set_attributes: failed to set time on ./fsroot-vs/usr/lib/x86_64-linux-gnu/perl-base/unicore/lib/Nv/17.pl, because No such file or directory
set_attributes: failed to set time on ./fsroot-vs/usr/lib/x86_64-linux-gnu/perl-base/unicore/lib/Nv/18.pl, because No such file or directory
set_attributes: failed to set time on ./fsroot-vs/usr/lib/x86_64-linux-gnu/perl-base/unicore/lib/Nv/19.pl, because No such file or directory
set_attributes: failed to set time on ./fsroot-vs/usr/lib/x86_64-linux-gnu/perl-base/unicore/lib/Nv/1_16.pl, because No such file or directory
set_attributes: failed to set time on ./fsroot-vs/usr/lib/x86_64-linux-gnu/perl-base/unicore/lib/Nv/1_2.pl, because No such file or directory
set_attributes: failed to set time on ./fsroot-vs/usr/lib/x86_64-linux-gnu/perl-base/unicore/lib/Nv/1_3.pl, because No such file or directory
set_attributes: failed to set time on ./fsroot-vs/usr/lib/x86_64-linux-gnu/perl-base/unicore/lib/Nv/1_4.pl, because No such file or directory
set_attributes: failed to set time on ./fsroot-vs/usr/lib/x86_64-linux-gnu/perl-base/unicore/lib/Nv/1_6.pl, because No such file or directory
set_attributes: failed to set time on ./fsroot-vs/usr/lib/x86_64-linux-gnu/perl-base/unicore/lib/Nv/1_8.pl, because No such file or directory
set_attributes: failed to set time on ./fsroot-vs/usr/lib/x86_64-linux-gnu/perl-base/unicore/lib/Nv/2.pl, because No such file or directory
set_attributes: failed to set time on ./fsroot-vs/usr/lib/x86_64-linux-gnu/perl-base/unicore/lib/Nv/20.pl, because No such file or directory
set_attributes: failed to set time on ./fsroot-vs/usr/lib/x86_64-linux-gnu/perl-base/unicore/lib/Nv/200.pl, because No such file or directory
set_attributes: failed to set time on ./fsroot-vs/usr/lib/x86_64-linux-gnu/perl-base/unicore/lib/Nv/2000.pl, because No such file or directory
set_attributes: failed to set time on ./fsroot-vs/usr/lib/x86_64-linux-gnu/perl-base/unicore/lib/Nv/20000.pl, because No such file or directory
set_attributes: failed to set time on ./fsroot-vs/usr/lib/x86_64-linux-gnu/perl-base/unicore/lib/Nv/2_3.pl, because No such file or directory
set_attributes: failed to set time on ./fsroot-vs/usr/lib/x86_64-linux-gnu/perl-base/unicore/lib/Nv/3.pl, because No such file or directory
set_attributes: failed to set time on ./fsroot-vs/usr/lib/x86_64-linux-gnu/perl-base/unicore/lib/Nv/30.pl, because No such file or directory
set_attributes: failed to set time on ./fsroot-vs/usr/lib/x86_64-linux-gnu/perl-base/unicore/lib/Nv/300.pl, because No such file or directory
set_attributes: failed to set time on ./fsroot-vs/usr/lib/x86_64-linux-gnu/perl-base/unicore/lib/Nv/3000.pl, because No such file or directory
set_attributes: failed to set time on ./fsroot-vs/usr/lib/x86_64-linux-gnu/perl-base/unicore/lib/Nv/30000.pl, because No such file or directory
set_attributes: failed to set time on ./fsroot-vs/usr/lib/x86_64-linux-gnu/perl-base/unicore/lib/Nv/3_16.pl, because No such file or directory
set_attributes: failed to set time on ./fsroot-vs/usr/lib/x86_64-linux-gnu/perl-base/unicore/lib/Nv/3_4.pl, because No such file or directory
set_attributes: failed to set time on ./fsroot-vs/usr/lib/x86_64-linux-gnu/perl-base/unicore/lib/Nv/4.pl, because No such file or directory
set_attributes: failed to set time on ./fsroot-vs/usr/lib/x86_64-linux-gnu/perl-base/unicore/lib/Nv/40.pl, because No such file or directory
set_attributes: failed to set time on ./fsroot-vs/usr/lib/x86_64-linux-gnu/perl-base/unicore/lib/Nv/400.pl, because No such file or directory
set_attributes: failed to set time on ./fsroot-vs/usr/lib/x86_64-linux-gnu/perl-base/unicore/lib/Nv/4000.pl, because No such file or directory
set_attributes: failed to set time on ./fsroot-vs/usr/lib/x86_64-linux-gnu/perl-base/unicore/lib/Nv/40000.pl, because No such file or directory
set_attributes: failed to set time on ./fsroot-vs/usr/lib/x86_64-linux-gnu/perl-base/unicore/lib/Nv/5.pl, because No such file or directory
set_attributes: failed to set time on ./fsroot-vs/usr/lib/x86_64-linux-gnu/perl-base/unicore/lib/Nv/50.pl, because No such file or directory
set_attributes: failed to set time on ./fsroot-vs/usr/lib/x86_64-linux-gnu/perl-base/unicore/lib/Nv/500.pl, because No such file or directory
set_attributes: failed to set time on ./fsroot-vs/usr/lib/x86_64-linux-gnu/perl-base/unicore/lib/Nv/5000.pl, because No such file or directory
set_attributes: failed to set time on ./fsroot-vs/usr/lib/x86_64-linux-gnu/perl-base/unicore/lib/Nv/50000.pl, because No such file or directory
set_attributes: failed to set time on ./fsroot-vs/usr/lib/x86_64-linux-gnu/perl-base/unicore/lib/Nv/6.pl, because No such file or directory
set_attributes: failed to set time on ./fsroot-vs/usr/lib/x86_64-linux-gnu/perl-base/unicore/lib/Nv/60.pl, because No such file or directory
set_attributes: failed to set time on ./fsroot-vs/usr/lib/x86_64-linux-gnu/perl-base/unicore/lib/Nv/600.pl, because No such file or directory
set_attributes: failed to set time on ./fsroot-vs/usr/lib/x86_64-linux-gnu/perl-base/unicore/lib/Nv/6000.pl, because No such file or directory
set_attributes: failed to set time on ./fsroot-vs/usr/lib/x86_64-linux-gnu/perl-base/unicore/lib/Nv/60000.pl, because No such file or directory
set_attributes: failed to set time on ./fsroot-vs/usr/lib/x86_64-linux-gnu/perl-base/unicore/lib/Nv/7.pl, because No such file or directory
set_attributes: failed to set time on ./fsroot-vs/usr/lib/x86_64-linux-gnu/perl-base/unicore/lib/Nv/70.pl, because No such file or directory
set_attributes: failed to set time on ./fsroot-vs/usr/lib/x86_64-linux-gnu/perl-base/unicore/lib/Nv/700.pl, because No such file or directory
set_attributes: failed to set time on ./fsroot-vs/usr/lib/x86_64-linux-gnu/perl-base/unicore/lib/Nv/7000.pl, because No such file or directory
set_attributes: failed to set time on ./fsroot-vs/usr/lib/x86_64-linux-gnu/perl-base/unicore/lib/Nv/70000.pl, because No such file or directory
set_attributes: failed to set time on ./fsroot-vs/usr/lib/x86_64-linux-gnu/perl-base/unicore/lib/Nv/8.pl, because No such file or directory
set_attributes: failed to set time on ./fsroot-vs/usr/lib/x86_64-linux-gnu/perl-base/unicore/lib/Nv/80.pl, because No such file or directory
set_attributes: failed to set time on ./fsroot-vs/usr/lib/x86_64-linux-gnu/perl-base/unicore/lib/Nv/800.pl, because No such file or directory
set_attributes: failed to set time on ./fsroot-vs/usr/lib/x86_64-linux-gnu/perl-base/unicore/lib/Nv/8000.pl, because No such file or directory
set_attributes: failed to set time on ./fsroot-vs/usr/lib/x86_64-linux-gnu/perl-base/unicore/lib/Nv/80000.pl, because No such file or directory
set_attributes: failed to set time on ./fsroot-vs/usr/lib/x86_64-linux-gnu/perl-base/unicore/lib/Nv/9.pl, because No such file or directory
set_attributes: failed to set time on ./fsroot-vs/usr/lib/x86_64-linux-gnu/perl-base/unicore/lib/Nv/90.pl, because No such file or directory
set_attributes: failed to set time on ./fsroot-vs/usr/lib/x86_64-linux-gnu/perl-base/unicore/lib/Nv/900.pl, because No such file or directory
set_attributes: failed to set time on ./fsroot-vs/usr/lib/x86_64-linux-gnu/perl-base/unicore/lib/Nv/9000.pl, because No such file or directory
set_attributes: failed to set time on ./fsroot-vs/usr/lib/x86_64-linux-gnu/perl-base/unicore/lib/Nv/90000.pl, because No such file or directory
set_attributes: failed to set time on ./fsroot-vs/usr/lib/x86_64-linux-gnu/perl-base/unicore/lib/Nv, because No such file or directory
set_attributes: failed to set time on ./fsroot-vs/usr/lib/x86_64-linux-gnu/perl-base/unicore/lib/PCM/Y.pl, because No such file or directory
set_attributes: failed to set time on ./fsroot-vs/usr/lib/x86_64-linux-gnu/perl-base/unicore/lib/PCM, because No such file or directory
set_attributes: failed to set time on ./fsroot-vs/usr/lib/x86_64-linux-gnu/perl-base/unicore/lib/PatSyn/Y.pl, because No such file or directory
set_attributes: failed to set time on ./fsroot-vs/usr/lib/x86_64-linux-gnu/perl-base/unicore/lib/PatSyn, because No such file or directory
set_attributes: failed to set time on ./fsroot-vs/usr/lib/x86_64-linux-gnu/perl-base/unicore/lib/Perl/Alnum.pl, because No such file or directory
set_attributes: failed to set time on ./fsroot-vs/usr/lib/x86_64-linux-gnu/perl-base/unicore/lib/Perl/Assigned.pl, because No such file or directory
set_attributes: failed to set time on ./fsroot-vs/usr/lib/x86_64-linux-gnu/perl-base/unicore/lib/Perl/Blank.pl, because No such file or directory
set_attributes: failed to set time on ./fsroot-vs/usr/lib/x86_64-linux-gnu/perl-base/unicore/lib/Perl/Graph.pl, because No such file or directory
set_attributes: failed to set time on ./fsroot-vs/usr/lib/x86_64-linux-gnu/perl-base/unicore/lib/Perl/PerlWord.pl, because No such file or directory
set_attributes: failed to set time on ./fsroot-vs/usr/lib/x86_64-linux-gnu/perl-base/unicore/lib/Perl/PosixPun.pl, because No such file or directory
set_attributes: failed to set time on ./fsroot-vs/usr/lib/x86_64-linux-gnu/perl-base/unicore/lib/Perl/Print.pl, because No such file or directory
set_attributes: failed to set time on ./fsroot-vs/usr/lib/x86_64-linux-gnu/perl-base/unicore/lib/Perl/SpacePer.pl, because No such file or directory
set_attributes: failed to set time on ./fsroot-vs/usr/lib/x86_64-linux-gnu/perl-base/unicore/lib/Perl/Title.pl, because No such file or directory
set_attributes: failed to set time on ./fsroot-vs/usr/lib/x86_64-linux-gnu/perl-base/unicore/lib/Perl/Word.pl, because No such file or directory
set_attributes: failed to set time on ./fsroot-vs/usr/lib/x86_64-linux-gnu/perl-base/unicore/lib/Perl/XPosixPu.pl, because No such file or directory
set_attributes: failed to set time on ./fsroot-vs/usr/lib/x86_64-linux-gnu/perl-base/unicore/lib/Perl/_PerlAny.pl, because No such file or directory
set_attributes: failed to set time on ./fsroot-vs/usr/lib/x86_64-linux-gnu/perl-base/unicore/lib/Perl/_PerlCh2.pl, because No such file or directory
set_attributes: failed to set time on ./fsroot-vs/usr/lib/x86_64-linux-gnu/perl-base/unicore/lib/Perl/_PerlCha.pl, because No such file or directory
set_attributes: failed to set time on ./fsroot-vs/usr/lib/x86_64-linux-gnu/perl-base/unicore/lib/Perl/_PerlFol.pl, because No such file or directory
set_attributes: failed to set time on ./fsroot-vs/usr/lib/x86_64-linux-gnu/perl-base/unicore/lib/Perl/_PerlIDC.pl, because No such file or directory
set_attributes: failed to set time on ./fsroot-vs/usr/lib/x86_64-linux-gnu/perl-base/unicore/lib/Perl/_PerlIDS.pl, because No such file or directory
set_attributes: failed to set time on ./fsroot-vs/usr/lib/x86_64-linux-gnu/perl-base/unicore/lib/Perl/_PerlIsI.pl, because No such file or directory
set_attributes: failed to set time on ./fsroot-vs/usr/lib/x86_64-linux-gnu/perl-base/unicore/lib/Perl/_PerlNch.pl, because No such file or directory
set_attributes: failed to set time on ./fsroot-vs/usr/lib/x86_64-linux-gnu/perl-base/unicore/lib/Perl/_PerlPat.pl, because No such file or directory
set_attributes: failed to set time on ./fsroot-vs/usr/lib/x86_64-linux-gnu/perl-base/unicore/lib/Perl/_PerlPr2.pl, because No such file or directory
set_attributes: failed to set time on ./fsroot-vs/usr/lib/x86_64-linux-gnu/perl-base/unicore/lib/Perl/_PerlPro.pl, because No such file or directory
set_attributes: failed to set time on ./fsroot-vs/usr/lib/x86_64-linux-gnu/perl-base/unicore/lib/Perl/_PerlQuo.pl, because No such file or directory
set_attributes: failed to set time on ./fsroot-vs/usr/lib/x86_64-linux-gnu/perl-base/unicore/lib/Perl, because No such file or directory
set_attributes: failed to set time on ./fsroot-vs/usr/lib/x86_64-linux-gnu/perl-base/unicore/lib/QMark/Y.pl, because No such file or directory
set_attributes: failed to set time on ./fsroot-vs/usr/lib/x86_64-linux-gnu/perl-base/unicore/lib/QMark, because No such file or directory
set_attributes: failed to set time on ./fsroot-vs/usr/lib/x86_64-linux-gnu/perl-base/unicore/lib/SB/AT.pl, because No such file or directory
set_attributes: failed to set time on ./fsroot-vs/usr/lib/x86_64-linux-gnu/perl-base/unicore/lib/SB/CL.pl, because No such file or directory
set_attributes: failed to set time on ./fsroot-vs/usr/lib/x86_64-linux-gnu/perl-base/unicore/lib/SB/EX.pl, because No such file or directory
set_attributes: failed to set time on ./fsroot-vs/usr/lib/x86_64-linux-gnu/perl-base/unicore/lib/SB/FO.pl, because No such file or directory
set_attributes: failed to set time on ./fsroot-vs/usr/lib/x86_64-linux-gnu/perl-base/unicore/lib/SB/LE.pl, because No such file or directory
set_attributes: failed to set time on ./fsroot-vs/usr/lib/x86_64-linux-gnu/perl-base/unicore/lib/SB/LO.pl, because No such file or directory
set_attributes: failed to set time on ./fsroot-vs/usr/lib/x86_64-linux-gnu/perl-base/unicore/lib/SB/NU.pl, because No such file or directory
set_attributes: failed to set time on ./fsroot-vs/usr/lib/x86_64-linux-gnu/perl-base/unicore/lib/SB/SC.pl, because No such file or directory
set_attributes: failed to set time on ./fsroot-vs/usr/lib/x86_64-linux-gnu/perl-base/unicore/lib/SB/ST.pl, because No such file or directory
set_attributes: failed to set time on ./fsroot-vs/usr/lib/x86_64-linux-gnu/perl-base/unicore/lib/SB/Sp.pl, because No such file or directory
set_attributes: failed to set time on ./fsroot-vs/usr/lib/x86_64-linux-gnu/perl-base/unicore/lib/SB/UP.pl, because No such file or directory
set_attributes: failed to set time on ./fsroot-vs/usr/lib/x86_64-linux-gnu/perl-base/unicore/lib/SB/XX.pl, because No such file or directory
set_attributes: failed to set time on ./fsroot-vs/usr/lib/x86_64-linux-gnu/perl-base/unicore/lib/SB, because No such file or directory
set_attributes: failed to set time on ./fsroot-vs/usr/lib/x86_64-linux-gnu/perl-base/unicore/lib/SD/Y.pl, because No such file or directory
set_attributes: failed to set time on ./fsroot-vs/usr/lib/x86_64-linux-gnu/perl-base/unicore/lib/SD, because No such file or directory
set_attributes: failed to set time on ./fsroot-vs/usr/lib/x86_64-linux-gnu/perl-base/unicore/lib/STerm/Y.pl, because No such file or directory
set_attributes: failed to set time on ./fsroot-vs/usr/lib/x86_64-linux-gnu/perl-base/unicore/lib/STerm, because No such file or directory
set_attributes: failed to set time on ./fsroot-vs/usr/lib/x86_64-linux-gnu/perl-base/unicore/lib/Sc/Arab.pl, because No such file or directory
set_attributes: failed to set time on ./fsroot-vs/usr/lib/x86_64-linux-gnu/perl-base/unicore/lib/Sc/Beng.pl, because No such file or directory
set_attributes: failed to set time on ./fsroot-vs/usr/lib/x86_64-linux-gnu/perl-base/unicore/lib/Sc/Cprt.pl, because No such file or directory
set_attributes: failed to set time on ./fsroot-vs/usr/lib/x86_64-linux-gnu/perl-base/unicore/lib/Sc/Cyrl.pl, because No such file or directory
set_attributes: failed to set time on ./fsroot-vs/usr/lib/x86_64-linux-gnu/perl-base/unicore/lib/Sc/Deva.pl, because No such file or directory
set_attributes: failed to set time on ./fsroot-vs/usr/lib/x86_64-linux-gnu/perl-base/unicore/lib/Sc/Dupl.pl, because No such file or directory
set_attributes: failed to set time on ./fsroot-vs/usr/lib/x86_64-linux-gnu/perl-base/unicore/lib/Sc/Geor.pl, because No such file or directory
set_attributes: failed to set time on ./fsroot-vs/usr/lib/x86_64-linux-gnu/perl-base/unicore/lib/Sc/Glag.pl, because No such file or directory
set_attributes: failed to set time on ./fsroot-vs/usr/lib/x86_64-linux-gnu/perl-base/unicore/lib/Sc/Gong.pl, because No such file or directory
set_attributes: failed to set time on ./fsroot-vs/usr/lib/x86_64-linux-gnu/perl-base/unicore/lib/Sc/Gonm.pl, because No such file or directory
set_attributes: failed to set time on ./fsroot-vs/usr/lib/x86_64-linux-gnu/perl-base/unicore/lib/Sc/Gran.pl, because No such file or directory
set_attributes: failed to set time on ./fsroot-vs/usr/lib/x86_64-linux-gnu/perl-base/unicore/lib/Sc/Grek.pl, because No such file or directory
set_attributes: failed to set time on ./fsroot-vs/usr/lib/x86_64-linux-gnu/perl-base/unicore/lib/Sc/Gujr.pl, because No such file or directory
set_attributes: failed to set time on ./fsroot-vs/usr/lib/x86_64-linux-gnu/perl-base/unicore/lib/Sc/Guru.pl, because No such file or directory
set_attributes: failed to set time on ./fsroot-vs/usr/lib/x86_64-linux-gnu/perl-base/unicore/lib/Sc/Han.pl, because No such file or directory
set_attributes: failed to set time on ./fsroot-vs/usr/lib/x86_64-linux-gnu/perl-base/unicore/lib/Sc/Hang.pl, because No such file or directory
set_attributes: failed to set time on ./fsroot-vs/usr/lib/x86_64-linux-gnu/perl-base/unicore/lib/Sc/Hira.pl, because No such file or directory
set_attributes: failed to set time on ./fsroot-vs/usr/lib/x86_64-linux-gnu/perl-base/unicore/lib/Sc/Kana.pl, because No such file or directory
set_attributes: failed to set time on ./fsroot-vs/usr/lib/x86_64-linux-gnu/perl-base/unicore/lib/Sc/Knda.pl, because No such file or directory
set_attributes: failed to set time on ./fsroot-vs/usr/lib/x86_64-linux-gnu/perl-base/unicore/lib/Sc/Latn.pl, because No such file or directory
set_attributes: failed to set time on ./fsroot-vs/usr/lib/x86_64-linux-gnu/perl-base/unicore/lib/Sc/Limb.pl, because No such file or directory
set_attributes: failed to set time on ./fsroot-vs/usr/lib/x86_64-linux-gnu/perl-base/unicore/lib/Sc/Linb.pl, because No such file or directory
set_attributes: failed to set time on ./fsroot-vs/usr/lib/x86_64-linux-gnu/perl-base/unicore/lib/Sc/Mlym.pl, because No such file or directory
set_attributes: failed to set time on ./fsroot-vs/usr/lib/x86_64-linux-gnu/perl-base/unicore/lib/Sc/Mong.pl, because No such file or directory
set_attributes: failed to set time on ./fsroot-vs/usr/lib/x86_64-linux-gnu/perl-base/unicore/lib/Sc/Mult.pl, because No such file or directory
set_attributes: failed to set time on ./fsroot-vs/usr/lib/x86_64-linux-gnu/perl-base/unicore/lib/Sc/Orya.pl, because No such file or directory
set_attributes: failed to set time on ./fsroot-vs/usr/lib/x86_64-linux-gnu/perl-base/unicore/lib/Sc/Sinh.pl, because No such file or directory
set_attributes: failed to set time on ./fsroot-vs/usr/lib/x86_64-linux-gnu/perl-base/unicore/lib/Sc/Syrc.pl, because No such file or directory
set_attributes: failed to set time on ./fsroot-vs/usr/lib/x86_64-linux-gnu/perl-base/unicore/lib/Sc/Taml.pl, because No such file or directory
set_attributes: failed to set time on ./fsroot-vs/usr/lib/x86_64-linux-gnu/perl-base/unicore/lib/Sc/Telu.pl, because No such file or directory
set_attributes: failed to set time on ./fsroot-vs/usr/lib/x86_64-linux-gnu/perl-base/unicore/lib/Sc/Zinh.pl, because No such file or directory
set_attributes: failed to set time on ./fsroot-vs/usr/lib/x86_64-linux-gnu/perl-base/unicore/lib/Sc/Zyyy.pl, because No such file or directory
set_attributes: failed to set time on ./fsroot-vs/usr/lib/x86_64-linux-gnu/perl-base/unicore/lib/Sc, because No such file or directory
set_attributes: failed to set time on ./fsroot-vs/usr/lib/x86_64-linux-gnu/perl-base/unicore/lib/Scx/Adlm.pl, because No such file or directory
set_attributes: failed to set time on ./fsroot-vs/usr/lib/x86_64-linux-gnu/perl-base/unicore/lib/Scx/Arab.pl, because No such file or directory
set_attributes: failed to set time on ./fsroot-vs/usr/lib/x86_64-linux-gnu/perl-base/unicore/lib/Scx/Armn.pl, because No such file or directory
set_attributes: failed to set time on ./fsroot-vs/usr/lib/x86_64-linux-gnu/perl-base/unicore/lib/Scx/Beng.pl, because No such file or directory
set_attributes: failed to set time on ./fsroot-vs/usr/lib/x86_64-linux-gnu/perl-base/unicore/lib/Scx/Bhks.pl, because No such file or directory
set_attributes: failed to set time on ./fsroot-vs/usr/lib/x86_64-linux-gnu/perl-base/unicore/lib/Scx/Bopo.pl, because No such file or directory
set_attributes: failed to set time on ./fsroot-vs/usr/lib/x86_64-linux-gnu/perl-base/unicore/lib/Scx/Cakm.pl, because No such file or directory
set_attributes: failed to set time on ./fsroot-vs/usr/lib/x86_64-linux-gnu/perl-base/unicore/lib/Scx/Cham.pl, because No such file or directory
set_attributes: failed to set time on ./fsroot-vs/usr/lib/x86_64-linux-gnu/perl-base/unicore/lib/Scx/Copt.pl, because No such file or directory
set_attributes: failed to set time on ./fsroot-vs/usr/lib/x86_64-linux-gnu/perl-base/unicore/lib/Scx/Cprt.pl, because No such file or directory
set_attributes: failed to set time on ./fsroot-vs/usr/lib/x86_64-linux-gnu/perl-base/unicore/lib/Scx/Cyrl.pl, because No such file or directory
set_attributes: failed to set time on ./fsroot-vs/usr/lib/x86_64-linux-gnu/perl-base/unicore/lib/Scx/Deva.pl, because No such file or directory
set_attributes: failed to set time on ./fsroot-vs/usr/lib/x86_64-linux-gnu/perl-base/unicore/lib/Scx/Diak.pl, because No such file or directory
set_attributes: failed to set time on ./fsroot-vs/usr/lib/x86_64-linux-gnu/perl-base/unicore/lib/Scx/Dupl.pl, because No such file or directory
set_attributes: failed to set time on ./fsroot-vs/usr/lib/x86_64-linux-gnu/perl-base/unicore/lib/Scx/Ethi.pl, because No such file or directory
set_attributes: failed to set time on ./fsroot-vs/usr/lib/x86_64-linux-gnu/perl-base/unicore/lib/Scx/Geor.pl, because No such file or directory
set_attributes: failed to set time on ./fsroot-vs/usr/lib/x86_64-linux-gnu/perl-base/unicore/lib/Scx/Glag.pl, because No such file or directory
set_attributes: failed to set time on ./fsroot-vs/usr/lib/x86_64-linux-gnu/perl-base/unicore/lib/Scx/Gong.pl, because No such file or directory
set_attributes: failed to set time on ./fsroot-vs/usr/lib/x86_64-linux-gnu/perl-base/unicore/lib/Scx/Gonm.pl, because No such file or directory
set_attributes: failed to set time on ./fsroot-vs/usr/lib/x86_64-linux-gnu/perl-base/unicore/lib/Scx/Gran.pl, because No such file or directory
set_attributes: failed to set time on ./fsroot-vs/usr/lib/x86_64-linux-gnu/perl-base/unicore/lib/Scx/Grek.pl, because No such file or directory
set_attributes: failed to set time on ./fsroot-vs/usr/lib/x86_64-linux-gnu/perl-base/unicore/lib/Scx/Gujr.pl, because No such file or directory
set_attributes: failed to set time on ./fsroot-vs/usr/lib/x86_64-linux-gnu/perl-base/unicore/lib/Scx/Guru.pl, because No such file or directory
set_attributes: failed to set time on ./fsroot-vs/usr/lib/x86_64-linux-gnu/perl-base/unicore/lib/Scx/Han.pl, because No such file or directory
set_attributes: failed to set time on ./fsroot-vs/usr/lib/x86_64-linux-gnu/perl-base/unicore/lib/Scx/Hang.pl, because No such file or directory
set_attributes: failed to set time on ./fsroot-vs/usr/lib/x86_64-linux-gnu/perl-base/unicore/lib/Scx/Hebr.pl, because No such file or directory
set_attributes: failed to set time on ./fsroot-vs/usr/lib/x86_64-linux-gnu/perl-base/unicore/lib/Scx/Hira.pl, because No such file or directory
set_attributes: failed to set time on ./fsroot-vs/usr/lib/x86_64-linux-gnu/perl-base/unicore/lib/Scx/Hmng.pl, because No such file or directory
set_attributes: failed to set time on ./fsroot-vs/usr/lib/x86_64-linux-gnu/perl-base/unicore/lib/Scx/Hmnp.pl, because No such file or directory
set_attributes: failed to set time on ./fsroot-vs/usr/lib/x86_64-linux-gnu/perl-base/unicore/lib/Scx/Kana.pl, because No such file or directory
set_attributes: failed to set time on ./fsroot-vs/usr/lib/x86_64-linux-gnu/perl-base/unicore/lib/Scx/Khar.pl, because No such file or directory
set_attributes: failed to set time on ./fsroot-vs/usr/lib/x86_64-linux-gnu/perl-base/unicore/lib/Scx/Khmr.pl, because No such file or directory
set_attributes: failed to set time on ./fsroot-vs/usr/lib/x86_64-linux-gnu/perl-base/unicore/lib/Scx/Khoj.pl, because No such file or directory
set_attributes: failed to set time on ./fsroot-vs/usr/lib/x86_64-linux-gnu/perl-base/unicore/lib/Scx/Knda.pl, because No such file or directory
set_attributes: failed to set time on ./fsroot-vs/usr/lib/x86_64-linux-gnu/perl-base/unicore/lib/Scx/Kthi.pl, because No such file or directory
set_attributes: failed to set time on ./fsroot-vs/usr/lib/x86_64-linux-gnu/perl-base/unicore/lib/Scx/Lana.pl, because No such file or directory
set_attributes: failed to set time on ./fsroot-vs/usr/lib/x86_64-linux-gnu/perl-base/unicore/lib/Scx/Lao.pl, because No such file or directory
set_attributes: failed to set time on ./fsroot-vs/usr/lib/x86_64-linux-gnu/perl-base/unicore/lib/Scx/Latn.pl, because No such file or directory
set_attributes: failed to set time on ./fsroot-vs/usr/lib/x86_64-linux-gnu/perl-base/unicore/lib/Scx/Limb.pl, because No such file or directory
set_attributes: failed to set time on ./fsroot-vs/usr/lib/x86_64-linux-gnu/perl-base/unicore/lib/Scx/Lina.pl, because No such file or directory
set_attributes: failed to set time on ./fsroot-vs/usr/lib/x86_64-linux-gnu/perl-base/unicore/lib/Scx/Linb.pl, because No such file or directory
set_attributes: failed to set time on ./fsroot-vs/usr/lib/x86_64-linux-gnu/perl-base/unicore/lib/Scx/Mlym.pl, because No such file or directory
set_attributes: failed to set time on ./fsroot-vs/usr/lib/x86_64-linux-gnu/perl-base/unicore/lib/Scx/Mong.pl, because No such file or directory
set_attributes: failed to set time on ./fsroot-vs/usr/lib/x86_64-linux-gnu/perl-base/unicore/lib/Scx/Mult.pl, because No such file or directory
set_attributes: failed to set time on ./fsroot-vs/usr/lib/x86_64-linux-gnu/perl-base/unicore/lib/Scx/Mymr.pl, because No such file or directory
set_attributes: failed to set time on ./fsroot-vs/usr/lib/x86_64-linux-gnu/perl-base/unicore/lib/Scx/Nand.pl, because No such file or directory
set_attributes: failed to set time on ./fsroot-vs/usr/lib/x86_64-linux-gnu/perl-base/unicore/lib/Scx/Nko.pl, because No such file or directory
set_attributes: failed to set time on ./fsroot-vs/usr/lib/x86_64-linux-gnu/perl-base/unicore/lib/Scx/Orya.pl, because No such file or directory
set_attributes: failed to set time on ./fsroot-vs/usr/lib/x86_64-linux-gnu/perl-base/unicore/lib/Scx/Phlp.pl, because No such file or directory
set_attributes: failed to set time on ./fsroot-vs/usr/lib/x86_64-linux-gnu/perl-base/unicore/lib/Scx/Rohg.pl, because No such file or directory
set_attributes: failed to set time on ./fsroot-vs/usr/lib/x86_64-linux-gnu/perl-base/unicore/lib/Scx/Shrd.pl, because No such file or directory
set_attributes: failed to set time on ./fsroot-vs/usr/lib/x86_64-linux-gnu/perl-base/unicore/lib/Scx/Sind.pl, because No such file or directory
set_attributes: failed to set time on ./fsroot-vs/usr/lib/x86_64-linux-gnu/perl-base/unicore/lib/Scx/Sinh.pl, because No such file or directory
set_attributes: failed to set time on ./fsroot-vs/usr/lib/x86_64-linux-gnu/perl-base/unicore/lib/Scx/Syrc.pl, because No such file or directory
set_attributes: failed to set time on ./fsroot-vs/usr/lib/x86_64-linux-gnu/perl-base/unicore/lib/Scx/Tagb.pl, because No such file or directory
set_attributes: failed to set time on ./fsroot-vs/usr/lib/x86_64-linux-gnu/perl-base/unicore/lib/Scx/Takr.pl, because No such file or directory
set_attributes: failed to set time on ./fsroot-vs/usr/lib/x86_64-linux-gnu/perl-base/unicore/lib/Scx/Talu.pl, because No such file or directory
set_attributes: failed to set time on ./fsroot-vs/usr/lib/x86_64-linux-gnu/perl-base/unicore/lib/Scx/Taml.pl, because No such file or directory
set_attributes: failed to set time on ./fsroot-vs/usr/lib/x86_64-linux-gnu/perl-base/unicore/lib/Scx/Tang.pl, because No such file or directory
set_attributes: failed to set time on ./fsroot-vs/usr/lib/x86_64-linux-gnu/perl-base/unicore/lib/Scx/Telu.pl, because No such file or directory
set_attributes: failed to set time on ./fsroot-vs/usr/lib/x86_64-linux-gnu/perl-base/unicore/lib/Scx/Thaa.pl, because No such file or directory
set_attributes: failed to set time on ./fsroot-vs/usr/lib/x86_64-linux-gnu/perl-base/unicore/lib/Scx/Tibt.pl, because No such file or directory
set_attributes: failed to set time on ./fsroot-vs/usr/lib/x86_64-linux-gnu/perl-base/unicore/lib/Scx/Tirh.pl, because No such file or directory
set_attributes: failed to set time on ./fsroot-vs/usr/lib/x86_64-linux-gnu/perl-base/unicore/lib/Scx/Vith.pl, because No such file or directory
set_attributes: failed to set time on ./fsroot-vs/usr/lib/x86_64-linux-gnu/perl-base/unicore/lib/Scx/Xsux.pl, because No such file or directory
set_attributes: failed to set time on ./fsroot-vs/usr/lib/x86_64-linux-gnu/perl-base/unicore/lib/Scx/Yezi.pl, because No such file or directory
set_attributes: failed to set time on ./fsroot-vs/usr/lib/x86_64-linux-gnu/perl-base/unicore/lib/Scx/Yi.pl, because No such file or directory
set_attributes: failed to set time on ./fsroot-vs/usr/lib/x86_64-linux-gnu/perl-base/unicore/lib/Scx/Zinh.pl, because No such file or directory
set_attributes: failed to set time on ./fsroot-vs/usr/lib/x86_64-linux-gnu/perl-base/unicore/lib/Scx/Zyyy.pl, because No such file or directory
set_attributes: failed to set time on ./fsroot-vs/usr/lib/x86_64-linux-gnu/perl-base/unicore/lib/Scx/Zzzz.pl, because No such file or directory
set_attributes: failed to set time on ./fsroot-vs/usr/lib/x86_64-linux-gnu/perl-base/unicore/lib/Scx, because No such file or directory
set_attributes: failed to set time on ./fsroot-vs/usr/lib/x86_64-linux-gnu/perl-base/unicore/lib/Term/Y.pl, because No such file or directory
set_attributes: failed to set time on ./fsroot-vs/usr/lib/x86_64-linux-gnu/perl-base/unicore/lib/Term, because No such file or directory
set_attributes: failed to set time on ./fsroot-vs/usr/lib/x86_64-linux-gnu/perl-base/unicore/lib/UIdeo/Y.pl, because No such file or directory
set_attributes: failed to set time on ./fsroot-vs/usr/lib/x86_64-linux-gnu/perl-base/unicore/lib/UIdeo, because No such file or directory
set_attributes: failed to set time on ./fsroot-vs/usr/lib/x86_64-linux-gnu/perl-base/unicore/lib/Upper/Y.pl, because No such file or directory
set_attributes: failed to set time on ./fsroot-vs/usr/lib/x86_64-linux-gnu/perl-base/unicore/lib/Upper, because No such file or directory
set_attributes: failed to set time on ./fsroot-vs/usr/lib/x86_64-linux-gnu/perl-base/unicore/lib/VS/Y.pl, because No such file or directory
set_attributes: failed to set time on ./fsroot-vs/usr/lib/x86_64-linux-gnu/perl-base/unicore/lib/VS, because No such file or directory
set_attributes: failed to set time on ./fsroot-vs/usr/lib/x86_64-linux-gnu/perl-base/unicore/lib/Vo/R.pl, because No such file or directory
set_attributes: failed to set time on ./fsroot-vs/usr/lib/x86_64-linux-gnu/perl-base/unicore/lib/Vo/Tr.pl, because No such file or directory
set_attributes: failed to set time on ./fsroot-vs/usr/lib/x86_64-linux-gnu/perl-base/unicore/lib/Vo/Tu.pl, because No such file or directory
set_attributes: failed to set time on ./fsroot-vs/usr/lib/x86_64-linux-gnu/perl-base/unicore/lib/Vo/U.pl, because No such file or directory
set_attributes: failed to set time on ./fsroot-vs/usr/lib/x86_64-linux-gnu/perl-base/unicore/lib/Vo, because No such file or directory
set_attributes: failed to set time on ./fsroot-vs/usr/lib/x86_64-linux-gnu/perl-base/unicore/lib/WB/EX.pl, because No such file or directory
set_attributes: failed to set time on ./fsroot-vs/usr/lib/x86_64-linux-gnu/perl-base/unicore/lib/WB/Extend.pl, because No such file or directory
set_attributes: failed to set time on ./fsroot-vs/usr/lib/x86_64-linux-gnu/perl-base/unicore/lib/WB/FO.pl, because No such file or directory
set_attributes: failed to set time on ./fsroot-vs/usr/lib/x86_64-linux-gnu/perl-base/unicore/lib/WB/HL.pl, because No such file or directory
set_attributes: failed to set time on ./fsroot-vs/usr/lib/x86_64-linux-gnu/perl-base/unicore/lib/WB/KA.pl, because No such file or directory
set_attributes: failed to set time on ./fsroot-vs/usr/lib/x86_64-linux-gnu/perl-base/unicore/lib/WB/LE.pl, because No such file or directory
set_attributes: failed to set time on ./fsroot-vs/usr/lib/x86_64-linux-gnu/perl-base/unicore/lib/WB/MB.pl, because No such file or directory
set_attributes: failed to set time on ./fsroot-vs/usr/lib/x86_64-linux-gnu/perl-base/unicore/lib/WB/ML.pl, because No such file or directory
set_attributes: failed to set time on ./fsroot-vs/usr/lib/x86_64-linux-gnu/perl-base/unicore/lib/WB/MN.pl, because No such file or directory
set_attributes: failed to set time on ./fsroot-vs/usr/lib/x86_64-linux-gnu/perl-base/unicore/lib/WB/NU.pl, because No such file or directory
set_attributes: failed to set time on ./fsroot-vs/usr/lib/x86_64-linux-gnu/perl-base/unicore/lib/WB/WSegSpac.pl, because No such file or directory
set_attributes: failed to set time on ./fsroot-vs/usr/lib/x86_64-linux-gnu/perl-base/unicore/lib/WB/XX.pl, because No such file or directory
set_attributes: failed to set time on ./fsroot-vs/usr/lib/x86_64-linux-gnu/perl-base/unicore/lib/WB, because No such file or directory
set_attributes: failed to set time on ./fsroot-vs/usr/lib/x86_64-linux-gnu/perl-base/unicore/lib/XIDC/Y.pl, because No such file or directory
set_attributes: failed to set time on ./fsroot-vs/usr/lib/x86_64-linux-gnu/perl-base/unicore/lib/XIDC, because No such file or directory
set_attributes: failed to set time on ./fsroot-vs/usr/lib/x86_64-linux-gnu/perl-base/unicore/lib/XIDS/Y.pl, because No such file or directory
set_attributes: failed to set time on ./fsroot-vs/usr/lib/x86_64-linux-gnu/perl-base/unicore/lib/XIDS, because No such file or directory
set_attributes: failed to set time on ./fsroot-vs/usr/lib/x86_64-linux-gnu/perl-base/unicore/lib, because No such file or directory
set_attributes: failed to set time on ./fsroot-vs/usr/lib/x86_64-linux-gnu/perl-base/unicore, because No such file or directory
set_attributes: failed to set time on ./fsroot-vs/usr/lib/x86_64-linux-gnu/perl-base/utf8.pm, because No such file or directory
set_attributes: failed to set time on ./fsroot-vs/usr/lib/x86_64-linux-gnu/perl-base/vars.pm, because No such file or directory
set_attributes: failed to set time on ./fsroot-vs/usr/lib/x86_64-linux-gnu/perl-base/warnings/register.pm, because No such file or directory
set_attributes: failed to set time on ./fsroot-vs/usr/lib/x86_64-linux-gnu/perl-base/warnings, because No such file or directory
set_attributes: failed to set time on ./fsroot-vs/usr/lib/x86_64-linux-gnu/perl-base/warnings.pm, because No such file or directory
set_attributes: failed to set time on ./fsroot-vs/usr/lib/x86_64-linux-gnu/perl-base, because No such file or directory
[=====================================/ ] 43609/67775 64%
[========================================================- ] 65118/67775 96%
[===========================================================-] 67775/67775 100%
created 25922 files
created 3484 directories
created 2373 symlinks
created 5351 devices
created 0 fifos
created 0 sockets
created 5 hardlinks
[ FAIL LOG END ] [ target/sonic-vs.bin ]
make: *** [slave.mk:1435: target/sonic-vs.bin] Error 1
[ finished ] [ target/docker-sonic-vs.gz ]
make[1]: *** [Makefile.work:611: all] Error 2
make[1]: Leaving directory '/var/lib/jenkins/workspace/DevOps-test2/platform-vs'
make: *** [Makefile:53: all] Error 2
|