+++ --- Applying local submodule patches --- +++
already applied: sonic-utilities
already applied: sonic-swss
already applied: sonic-swss-new
already applied: sonic-sairedis-vslib
already applied: sonic-sairedis-meta
already applied: sonic-sairedis-SAI
already applied: sonic-sairedis-SAI-apidef
already applied: sonic-mgmt-framework
+++ --- Making all --- +++
./scripts/run_with_retry make BLDENV=bookworm -f Makefile.work all
make[1]: Entering directory '/var/lib/jenkins/workspace/DevOps-test2/platform-vs'
"SECURE_UPGRADE_PROD_SIGNING_TOOL": ""
~/workspace/DevOps-test2/platform-vs/src/sonic-build-hooks ~/workspace/DevOps-test2/platform-vs
make[2]: Entering directory '/var/lib/jenkins/workspace/DevOps-test2/platform-vs/src/sonic-build-hooks'
dpkg-deb: building package 'sonic-build-hooks' in 'buildinfo/sonic-build-hooks_1.0_all.deb'.
make[2]: Leaving directory '/var/lib/jenkins/workspace/DevOps-test2/platform-vs/src/sonic-build-hooks'
~/workspace/DevOps-test2/platform-vs
Checking sonic-slave-base image: sonic-slave-bookworm:2f250bfbb4a
Checking sonic-slave-user image: sonic-slave-bookworm-jenkins:d05b1641d68
SONiC Build System
Build Configuration
"CONFIGURED_PLATFORM" : "vs"
"CONFIGURED_ARCH" : "amd64"
"SONIC_CONFIG_PRINT_DEPENDENCIES" : ""
"SONIC_BUILD_JOBS" : "4"
"SONIC_CONFIG_MAKE_JOBS" : "112"
"USE_NATIVE_DOCKERD_FOR_BUILD" : ""
"SONIC_USE_DOCKER_BUILDKIT" : ""
"USERNAME" : "admin"
"PASSWORD" : "YourPaSsWoRd"
"CHANGE_DEFAULT_PASSWORD" : "n"
"SECURE_UPGRADE_MODE" : "no_sign"
"SECURE_UPGRADE_DEV_SIGNING_KEY" : ""
"SECURE_UPGRADE_SIGNING_CERT" : ""
"SECURE_UPGRADE_PROD_SIGNING_TOOL": ""
"SECURE_UPGRADE_PROD_TOOL_ARGS" : ""
"ONIE_IMAGE_PART_SIZE" : ""
"SHUTDOWN_BGP_ON_START" : ""
"ENABLE_PFCWD_ON_START" : ""
"SONIC_BUFFER_MODEL" : ""
"INSTALL_DEBUG_TOOLS" : ""
"ROUTING_STACK" : "frr"
"FRR_USER_UID" : "300"
"FRR_USER_GID" : "300"
"ENABLE_SYNCD_RPC" : ""
"SAITHRIFT_V2" : ""
"ENABLE_ORGANIZATION_EXTENSIONS" : "y"
"HTTP_PROXY" : ""
"HTTPS_PROXY" : ""
"NO_PROXY" : ""
"ENABLE_ZTP" : ""
"INCLUDE_PDE" : ""
"SONIC_DEBUGGING_ON" : ""
"SONIC_PROFILING_ON" : ""
"KERNEL_PROCURE_METHOD" : "build"
"BUILD_TIMESTAMP" : "20260928.003039"
"BUILD_LOG_TIMESTAMP" : "none"
"SONIC_IMAGE_VERSION" : "etri-202505.21-8610ff460"
"BLDENV" : "bookworm"
"VS_PREPARE_MEM" : "yes"
"INCLUDE_MGMT_FRAMEWORK" : "y"
"INCLUDE_ICCPD" : "n"
"INCLUDE_STP" : "y"
"INCLUDE_SYSTEM_TELEMETRY" : "y"
"INCLUDE_SYSTEM_GNMI" : "y"
"INCLUDE_SYSTEM_BMP" : "y"
"INCLUDE_SYSTEM_EVENTD" : "y"
"ENABLE_HOST_SERVICE_ON_START" : "y"
"INCLUDE_RESTAPI" : "n"
"INCLUDE_SFLOW" : "y"
"INCLUDE_NAT" : "y"
"INCLUDE_DHCP_RELAY" : "y"
"INCLUDE_DHCP_SERVER" : "n"
"INCLUDE_P4RT" : "n"
"INCLUDE_VS_DASH_SAI" : "y"
"INCLUDE_KUBERNETES" : "n"
"INCLUDE_KUBERNETES_MASTER" : "n"
"INCLUDE_MACSEC" : "y"
"INCLUDE_MUX" : "y"
"INCLUDE_TEAMD" : "y"
"INCLUDE_DASH_HA" : "y"
"INCLUDE_ROUTER_ADVERTISER" : "y"
"INCLUDE_BOOTCHART : "y"
"ENABLE_BOOTCHART : "n"
"INCLUDE_FIPS" : "y"
"ENABLE_TRANSLIB_WRITE" : ""
"ENABLE_NATIVE_WRITE" : "y"
"ENABLE_DIALOUT" : ""
"ENABLE_AUTO_TECH_SUPPORT" : "y"
"PDDF_SUPPORT" : "y"
"MULTIARCH_QEMU_ENVIRON" : "n"
"SONIC_VERSION_CONTROL_COMPONENTS": "py2,py3,web,git,docker"
"ENABLE_ASAN" : "n"
"DEFAULT_CONTAINER_REGISTRY" : "publicmirror.azurecr.io/"
"BUILD_MULTIASIC_KVM" : "n"
"CROSS_BUILD_ENVIRON" : "n"
"LEGACY_SONIC_MGMT_DOCKER" : "y"
"INCLUDE_EXTERNAL_PATCHES" : "n"
"PTF_ENV_PY_VER" : "py3"
"ENABLE_MULTIDB" : ""
mv: cannot move '/etc/apt/sources.list.d/debian.sources' to '/etc/apt/sources.list.d/debian.sources.back': Permission denied
fatal: not a git repository (or any of the parent directories): .git
"SONIC_DPKG_CACHE_METHOD" : "none"
basename: missing operand
Try 'basename --help' for more information.
basename: missing operand
Try 'basename --help' for more information.
[ building ] [ target/sonic-vs.bin ]
[ building ] [ target/sonic-vs.img.gz ]
[ building ] [ target/files/bookworm/sonic_version.yml ]
[ building ] [ target/docker-swss-layer-bookworm.gz-load ]
[ finished ] [ target/files/bookworm/sonic_version.yml ]
[ finished ] [ target/docker-swss-layer-bookworm.gz-load ]
[ building ] [ target/docker-sonic-vs.gz ]
[ finished ] [ target/sonic-vs.bin ]
[ FAIL LOG START ] [ target/sonic-vs.bin ]
Build start time: Sun Sep 27 15:31:15 UTC 2026
++ '[' -f .arch ']'
++ cat .arch
+ CONFIGURED_ARCH=amd64
+ DOCKER_VERSION=5:24.0.2-1~debian.12~bookworm
+ CONTAINERD_IO_VERSION=1.6.21-1
+ LINUX_KERNEL_VERSION=6.1.0-29-2
+ FILESYSTEM_ROOT=./fsroot
+ PLATFORM_DIR=platform
+ HOSTNAME=sonic
+ DEFAULT_USERINFO='Default admin user,,,'
+ BUILD_TOOL_PATH=src/sonic-build-hooks/buildinfo
+ TRUSTED_GPG_DIR=src/sonic-build-hooks/buildinfo/trusted.gpg.d
+ . ./onie-image.conf
++ : 32768
++ : x86_64
++ : vs
++ ONIEIMAGE_VERSION=r0
++ FILESYSTEM_ROOT=./fsroot-vs
++ FILESYSTEM_SQUASHFS=fs.squashfs
++ INSTALLER_PAYLOAD=fs.zip
++ FILESYSTEM_DOCKERFS=dockerfs.tar.gz
++ DOCKERFS_DIR=docker
++ DOCKER_RAMFS_SIZE=3500M
++ OUTPUT_ONIE_IMAGE=target/sonic-vs.bin
++ OUTPUT_RAW_IMAGE=target/sonic-vs.raw
++ RAW_IMAGE_DISK_SIZE=1700
++ OUTPUT_KVM_IMAGE=target/sonic-vs.img
++ KVM_IMAGE_DISK_SIZE=16
++ OUTPUT_ABOOT_IMAGE=target/sonic-aboot-vs.swi
++ ABOOT_BOOT_IMAGE=.sonic-boot.swi
++ OUTPUT_KVM_4ASIC_IMAGE=target/sonic-4asic-vs.img
++ OUTPUT_KVM_6ASIC_IMAGE=target/sonic-6asic-vs.img
++ OUTPUT_DSC_IMAGE=target/sonic-vs.tar
+ '[' -n 32768 ']'
+ '[' -n fs.zip ']'
+ '[' -n fs.squashfs ']'
+ '[' onie = aboot ']'
+ [[ y != y ]]
+ [[ n == y ]]
+ [[ y == y ]]
+ echo '[INFO] RFS build: second stage'
[INFO] RFS build: second stage
+ sudo mount proc /proc -t proc
+ sudo fuser -vm ./fsroot-vs
USER PID ACCESS COMMAND
/sonic/fsroot-vs: root kernel mount /usr/sbin/docker-init
jenkins 1 ..ce. docker-init
jenkins 7 ..c.. bash
jenkins 8 ..c.. make
jenkins 6229 ..c.. bash
jenkins 6494 ..c.. bash
root 6683 ....m dockerd
root 6773 ....m containerd
jenkins 7255 ..c.. bash
jenkins 7475 ..c.. docker
jenkins 7476 ..c.. process_log.sh
jenkins 12977 ..c.. j2
jenkins 12980 ..c.. build_debian.sh
jenkins 12981 ..c.. process_log.sh
root 12989 ..c.. sudo
+ sudo rm -rf ./fsroot-vs
+ sudo unsquashfs -d ./fsroot-vs target/sonic-vs.bin__vs__rfs.squashfs
Parallel unsquashfs: Using 112 processors
33651 inodes (34124 blocks) to write
[======| ] 7913/67775 11%
[==========- ] 12343/67775 18%
[=================\ ] 20647/67775 30%
[==========================| ] 30946/67775 45%
[====================================/ ] 41939/67775 61%
set_attributes: failed to set time on ./fsroot-vs/usr/share/doc/firmware-misc-nonfree/changelog.Debian.gz, because No such file or directory
set_attributes: failed to set time on ./fsroot-vs/usr/share/doc/firmware-misc-nonfree/copyright, because No such file or directory
set_attributes: failed to set time on ./fsroot-vs/usr/share/doc/firmware-misc-nonfree, because No such file or directory
set_attributes: failed to set time on ./fsroot-vs/usr/share/doc/gpgconf/NEWS.Debian.gz, because No such file or directory
set_attributes: failed to set time on ./fsroot-vs/usr/share/doc/gpgconf/changelog.Debian.gz, because No such file or directory
set_attributes: failed to set time on ./fsroot-vs/usr/share/doc/gpgconf/changelog.gz, because No such file or directory
set_attributes: failed to set time on ./fsroot-vs/usr/share/doc/gpgconf/copyright, because No such file or directory
set_attributes: failed to set time on ./fsroot-vs/usr/share/doc/gpgconf/examples/gpgconf.conf, because No such file or directory
set_attributes: failed to set time on ./fsroot-vs/usr/share/doc/gpgconf/examples, because No such file or directory
set_attributes: failed to set time on ./fsroot-vs/usr/share/doc/gpgconf, because No such file or directory
set_attributes: failed to set time on ./fsroot-vs/usr/share/doc/grep/AUTHORS, because No such file or directory
set_attributes: failed to set time on ./fsroot-vs/usr/share/doc/grep/NEWS.Debian.gz, because No such file or directory
set_attributes: failed to set time on ./fsroot-vs/usr/share/doc/grep/NEWS.gz, because No such file or directory
set_attributes: failed to set time on ./fsroot-vs/usr/share/doc/grep/README, because No such file or directory
set_attributes: failed to set time on ./fsroot-vs/usr/share/doc/grep/THANKS.gz, because No such file or directory
set_attributes: failed to set time on ./fsroot-vs/usr/share/doc/grep/TODO.gz, because No such file or directory
set_attributes: failed to set time on ./fsroot-vs/usr/share/doc/grep/changelog.Debian.gz, because No such file or directory
set_attributes: failed to set time on ./fsroot-vs/usr/share/doc/grep/changelog.gz, because No such file or directory
set_attributes: failed to set time on ./fsroot-vs/usr/share/doc/grep/copyright, because No such file or directory
set_attributes: failed to set time on ./fsroot-vs/usr/share/doc/grep, because No such file or directory
set_attributes: failed to set time on ./fsroot-vs/usr/share/doc/gzip/NEWS.gz, because No such file or directory
set_attributes: failed to set time on ./fsroot-vs/usr/share/doc/gzip/README.gz, because No such file or directory
set_attributes: failed to set time on ./fsroot-vs/usr/share/doc/gzip/TODO, because No such file or directory
set_attributes: failed to set time on ./fsroot-vs/usr/share/doc/gzip/changelog.Debian.gz, because No such file or directory
set_attributes: failed to set time on ./fsroot-vs/usr/share/doc/gzip/changelog.gz, because No such file or directory
set_attributes: failed to set time on ./fsroot-vs/usr/share/doc/gzip/copyright, because No such file or directory
set_attributes: failed to set time on ./fsroot-vs/usr/share/doc/gzip, because No such file or directory
set_attributes: failed to set time on ./fsroot-vs/usr/share/doc/ifmetric/README.gz, because No such file or directory
set_attributes: failed to set time on ./fsroot-vs/usr/share/doc/ifmetric/changelog.Debian.gz, because No such file or directory
set_attributes: failed to set time on ./fsroot-vs/usr/share/doc/ifmetric/changelog.gz, because No such file or directory
set_attributes: failed to set time on ./fsroot-vs/usr/share/doc/ifmetric/copyright, because No such file or directory
set_attributes: failed to set time on ./fsroot-vs/usr/share/doc/ifmetric, because No such file or directory
set_attributes: failed to set time on ./fsroot-vs/usr/share/doc/iproute2/README.Debian, because No such file or directory
set_attributes: failed to set time on ./fsroot-vs/usr/share/doc/iproute2/changelog.Debian.gz, because No such file or directory
set_attributes: failed to set time on ./fsroot-vs/usr/share/doc/iproute2/copyright, because No such file or directory
set_attributes: failed to set time on ./fsroot-vs/usr/share/doc/iproute2, because No such file or directory
set_attributes: failed to set time on ./fsroot-vs/usr/share/doc/libargon2-1/changelog.Debian.gz, because No such file or directory
set_attributes: failed to set time on ./fsroot-vs/usr/share/doc/libargon2-1/changelog.gz, because No such file or directory
set_attributes: failed to set time on ./fsroot-vs/usr/share/doc/libargon2-1/copyright, because No such file or directory
set_attributes: failed to set time on ./fsroot-vs/usr/share/doc/libargon2-1, because No such file or directory
set_attributes: failed to set time on ./fsroot-vs/usr/share/doc/libauparse0/changelog.Debian.gz, because No such file or directory
set_attributes: failed to set time on ./fsroot-vs/usr/share/doc/libauparse0/changelog.gz, because No such file or directory
set_attributes: failed to set time on ./fsroot-vs/usr/share/doc/libauparse0/copyright, because No such file or directory
set_attributes: failed to set time on ./fsroot-vs/usr/share/doc/libauparse0, because No such file or directory
set_attributes: failed to set time on ./fsroot-vs/usr/share/doc/libblkid1/changelog.Debian.gz, because No such file or directory
set_attributes: failed to set time on ./fsroot-vs/usr/share/doc/libblkid1/changelog.gz, because No such file or directory
set_attributes: failed to set time on ./fsroot-vs/usr/share/doc/libblkid1/copyright, because No such file or directory
set_attributes: failed to set time on ./fsroot-vs/usr/share/doc/libblkid1, because No such file or directory
set_attributes: failed to set time on ./fsroot-vs/usr/share/doc/libbsd0/changelog.Debian.gz, because No such file or directory
set_attributes: failed to set time on ./fsroot-vs/usr/share/doc/libbsd0/changelog.gz, because No such file or directory
set_attributes: failed to set time on ./fsroot-vs/usr/share/doc/libbsd0/copyright, because No such file or directory
set_attributes: failed to set time on ./fsroot-vs/usr/share/doc/libbsd0, because No such file or directory
set_attributes: failed to set time on ./fsroot-vs/usr/share/doc/libcap-ng0/changelog.Debian.amd64.gz, because No such file or directory
set_attributes: failed to set time on ./fsroot-vs/usr/share/doc/libcap-ng0/changelog.Debian.gz, because No such file or directory
set_attributes: failed to set time on ./fsroot-vs/usr/share/doc/libcap-ng0/changelog.gz, because No such file or directory
set_attributes: failed to set time on ./fsroot-vs/usr/share/doc/libcap-ng0/copyright, because No such file or directory
set_attributes: failed to set time on ./fsroot-vs/usr/share/doc/libcap-ng0, because No such file or directory
set_attributes: failed to set time on ./fsroot-vs/usr/share/doc/libcrypt1/changelog.Debian.gz, because No such file or directory
set_attributes: failed to set time on ./fsroot-vs/usr/share/doc/libcrypt1/changelog.gz, because No such file or directory
set_attributes: failed to set time on ./fsroot-vs/usr/share/doc/libcrypt1/copyright, because No such file or directory
set_attributes: failed to set time on ./fsroot-vs/usr/share/doc/libcrypt1, because No such file or directory
set_attributes: failed to set time on ./fsroot-vs/usr/share/doc/libdb5.3/build_signature_amd64.txt, because No such file or directory
set_attributes: failed to set time on ./fsroot-vs/usr/share/doc/libdb5.3/changelog.Debian.gz, because No such file or directory
set_attributes: failed to set time on ./fsroot-vs/usr/share/doc/libdb5.3/copyright, because No such file or directory
set_attributes: failed to set time on ./fsroot-vs/usr/share/doc/libdb5.3, because No such file or directory
set_attributes: failed to set time on ./fsroot-vs/usr/share/doc/libdevmapper1.02.1/changelog.Debian.devmapper.gz, because No such file or directory
set_attributes: failed to set time on ./fsroot-vs/usr/share/doc/libdevmapper1.02.1/changelog.Debian.gz, because No such file or directory
set_attributes: failed to set time on ./fsroot-vs/usr/share/doc/libdevmapper1.02.1/copyright, because No such file or directory
set_attributes: failed to set time on ./fsroot-vs/usr/share/doc/libdevmapper1.02.1, because No such file or directory
set_attributes: failed to set time on ./fsroot-vs/usr/share/doc/libdw1/changelog.Debian.gz, because No such file or directory
set_attributes: failed to set time on ./fsroot-vs/usr/share/doc/libdw1/changelog.gz, because No such file or directory
set_attributes: failed to set time on ./fsroot-vs/usr/share/doc/libdw1/copyright, because No such file or directory
set_attributes: failed to set time on ./fsroot-vs/usr/share/doc/libdw1, because No such file or directory
set_attributes: failed to set time on ./fsroot-vs/usr/share/doc/libeatmydata1/changelog.Debian.gz, because No such file or directory
set_attributes: failed to set time on ./fsroot-vs/usr/share/doc/libeatmydata1/copyright, because No such file or directory
set_attributes: failed to set time on ./fsroot-vs/usr/share/doc/libeatmydata1, because No such file or directory
set_attributes: failed to set time on ./fsroot-vs/usr/share/doc/libestr0/changelog.Debian.gz, because No such file or directory
set_attributes: failed to set time on ./fsroot-vs/usr/share/doc/libestr0/changelog.gz, because No such file or directory
set_attributes: failed to set time on ./fsroot-vs/usr/share/doc/libestr0/copyright, because No such file or directory
set_attributes: failed to set time on ./fsroot-vs/usr/share/doc/libestr0, because No such file or directory
set_attributes: failed to set time on ./fsroot-vs/usr/share/doc/libffi8/changelog.Debian.gz, because No such file or directory
set_attributes: failed to set time on ./fsroot-vs/usr/share/doc/libffi8/copyright, because No such file or directory
set_attributes: failed to set time on ./fsroot-vs/usr/share/doc/libffi8, because No such file or directory
set_attributes: failed to set time on ./fsroot-vs/usr/share/doc/libfreeipmi17/NEWS.Debian.gz, because No such file or directory
set_attributes: failed to set time on ./fsroot-vs/usr/share/doc/libfreeipmi17/changelog.Debian.amd64.gz, because No such file or directory
set_attributes: failed to set time on ./fsroot-vs/usr/share/doc/libfreeipmi17/changelog.Debian.gz, because No such file or directory
set_attributes: failed to set time on ./fsroot-vs/usr/share/doc/libfreeipmi17/changelog.gz, because No such file or directory
set_attributes: failed to set time on ./fsroot-vs/usr/share/doc/libfreeipmi17/copyright, because No such file or directory
set_attributes: failed to set time on ./fsroot-vs/usr/share/doc/libfreeipmi17, because No such file or directory
set_attributes: failed to set time on ./fsroot-vs/usr/share/doc/libfreetype6/README, because No such file or directory
set_attributes: failed to set time on ./fsroot-vs/usr/share/doc/libfreetype6/changelog.Debian.gz, because No such file or directory
set_attributes: failed to set time on ./fsroot-vs/usr/share/doc/libfreetype6/changelog.gz, because No such file or directory
set_attributes: failed to set time on ./fsroot-vs/usr/share/doc/libfreetype6/copyright, because No such file or directory
set_attributes: failed to set time on ./fsroot-vs/usr/share/doc/libfreetype6, because No such file or directory
set_attributes: failed to set time on ./fsroot-vs/usr/share/doc/libgdbm-compat4/changelog.Debian.gz, because No such file or directory
set_attributes: failed to set time on ./fsroot-vs/usr/share/doc/libgdbm-compat4/changelog.gz, because No such file or directory
set_attributes: failed to set time on ./fsroot-vs/usr/share/doc/libgdbm-compat4/copyright, because No such file or directory
set_attributes: failed to set time on ./fsroot-vs/usr/share/doc/libgdbm-compat4, because No such file or directory
set_attributes: failed to set time on ./fsroot-vs/usr/share/doc/libglib2.0-0/NEWS.gz, because No such file or directory
set_attributes: failed to set time on ./fsroot-vs/usr/share/doc/libglib2.0-0/README.md, because No such file or directory
set_attributes: failed to set time on ./fsroot-vs/usr/share/doc/libglib2.0-0/changelog.Debian.gz, because No such file or directory
set_attributes: failed to set time on ./fsroot-vs/usr/share/doc/libglib2.0-0/copyright, because No such file or directory
set_attributes: failed to set time on ./fsroot-vs/usr/share/doc/libglib2.0-0, because No such file or directory
set_attributes: failed to set time on ./fsroot-vs/usr/share/doc/libgnutls30/AUTHORS.gz, because No such file or directory
set_attributes: failed to set time on ./fsroot-vs/usr/share/doc/libgnutls30/NEWS.Debian.gz, because No such file or directory
set_attributes: failed to set time on ./fsroot-vs/usr/share/doc/libgnutls30/NEWS.gz, because No such file or directory
set_attributes: failed to set time on ./fsroot-vs/usr/share/doc/libgnutls30/README.md.gz, because No such file or directory
set_attributes: failed to set time on ./fsroot-vs/usr/share/doc/libgnutls30/THANKS.gz, because No such file or directory
set_attributes: failed to set time on ./fsroot-vs/usr/share/doc/libgnutls30/changelog.Debian.gz, because No such file or directory
set_attributes: failed to set time on ./fsroot-vs/usr/share/doc/libgnutls30/changelog.gz, because No such file or directory
set_attributes: failed to set time on ./fsroot-vs/usr/share/doc/libgnutls30/copyright, because No such file or directory
set_attributes: failed to set time on ./fsroot-vs/usr/share/doc/libgnutls30, because No such file or directory
set_attributes: failed to set time on ./fsroot-vs/usr/share/doc/libgpm2/changelog.Debian.amd64.gz, because No such file or directory
set_attributes: failed to set time on ./fsroot-vs/usr/share/doc/libgpm2/changelog.Debian.gz, because No such file or directory
set_attributes: failed to set time on ./fsroot-vs/usr/share/doc/libgpm2/changelog.gz, because No such file or directory
set_attributes: failed to set time on ./fsroot-vs/usr/share/doc/libgpm2/copyright, because No such file or directory
set_attributes: failed to set time on ./fsroot-vs/usr/share/doc/libgpm2, because No such file or directory
set_attributes: failed to set time on ./fsroot-vs/usr/share/doc/libgrpc++1.51/changelog.Debian.amd64.gz, because No such file or directory
set_attributes: failed to set time on ./fsroot-vs/usr/share/doc/libgrpc++1.51/changelog.Debian.gz, because No such file or directory
set_attributes: failed to set time on ./fsroot-vs/usr/share/doc/libgrpc++1.51/copyright, because No such file or directory
set_attributes: failed to set time on ./fsroot-vs/usr/share/doc/libgrpc++1.51, because No such file or directory
set_attributes: failed to set time on ./fsroot-vs/usr/share/doc/libgssapi-krb5-2/changelog.Debian.gz, because No such file or directory
set_attributes: failed to set time on ./fsroot-vs/usr/share/doc/libgssapi-krb5-2/copyright, because No such file or directory
set_attributes: failed to set time on ./fsroot-vs/usr/share/doc/libgssapi-krb5-2, because No such file or directory
set_attributes: failed to set time on ./fsroot-vs/usr/share/doc/libhogweed6/changelog.Debian.gz, because No such file or directory
set_attributes: failed to set time on ./fsroot-vs/usr/share/doc/libhogweed6/changelog.gz, because No such file or directory
set_attributes: failed to set time on ./fsroot-vs/usr/share/doc/libhogweed6/copyright, because No such file or directory
set_attributes: failed to set time on ./fsroot-vs/usr/share/doc/libhogweed6, because No such file or directory
set_attributes: failed to set time on ./fsroot-vs/usr/share/doc/libi2c0/changelog.Debian.amd64.gz, because No such file or directory
set_attributes: failed to set time on ./fsroot-vs/usr/share/doc/libi2c0/changelog.Debian.gz, because No such file or directory
set_attributes: failed to set time on ./fsroot-vs/usr/share/doc/libi2c0/changelog.gz, because No such file or directory
set_attributes: failed to set time on ./fsroot-vs/usr/share/doc/libi2c0/copyright, because No such file or directory
set_attributes: failed to set time on ./fsroot-vs/usr/share/doc/libi2c0, because No such file or directory
set_attributes: failed to set time on ./fsroot-vs/usr/share/doc/libidn2-0/AUTHORS, because No such file or directory
set_attributes: failed to set time on ./fsroot-vs/usr/share/doc/libidn2-0/NEWS.gz, because No such file or directory
set_attributes: failed to set time on ./fsroot-vs/usr/share/doc/libidn2-0/README.md.gz, because No such file or directory
set_attributes: failed to set time on ./fsroot-vs/usr/share/doc/libidn2-0/changelog.Debian.amd64.gz, because No such file or directory
set_attributes: failed to set time on ./fsroot-vs/usr/share/doc/libidn2-0/changelog.Debian.gz, because No such file or directory
set_attributes: failed to set time on ./fsroot-vs/usr/share/doc/libidn2-0/changelog.gz, because No such file or directory
set_attributes: failed to set time on ./fsroot-vs/usr/share/doc/libidn2-0/copyright, because No such file or directory
set_attributes: failed to set time on ./fsroot-vs/usr/share/doc/libidn2-0, because No such file or directory
set_attributes: failed to set time on ./fsroot-vs/usr/share/doc/libjansson4/README.rst, because No such file or directory
set_attributes: failed to set time on ./fsroot-vs/usr/share/doc/libjansson4/changelog.Debian.gz, because No such file or directory
set_attributes: failed to set time on ./fsroot-vs/usr/share/doc/libjansson4/changelog.gz, because No such file or directory
set_attributes: failed to set time on ./fsroot-vs/usr/share/doc/libjansson4/copyright, because No such file or directory
set_attributes: failed to set time on ./fsroot-vs/usr/share/doc/libjansson4/examples/json_process.c, because No such file or directory
set_attributes: failed to set time on ./fsroot-vs/usr/share/doc/libjansson4/examples, because No such file or directory
set_attributes: failed to set time on ./fsroot-vs/usr/share/doc/libjansson4, because No such file or directory
set_attributes: failed to set time on ./fsroot-vs/usr/share/doc/libjq1/changelog.Debian.gz, because No such file or directory
set_attributes: failed to set time on ./fsroot-vs/usr/share/doc/libjq1/changelog.gz, because No such file or directory
set_attributes: failed to set time on ./fsroot-vs/usr/share/doc/libjq1/copyright, because No such file or directory
set_attributes: failed to set time on ./fsroot-vs/usr/share/doc/libjq1, because No such file or directory
set_attributes: failed to set time on ./fsroot-vs/usr/share/doc/libjson-c5/README, because No such file or directory
set_attributes: failed to set time on ./fsroot-vs/usr/share/doc/libjson-c5/README.html, because No such file or directory
set_attributes: failed to set time on ./fsroot-vs/usr/share/doc/libjson-c5/changelog.Debian.gz, because No such file or directory
set_attributes: failed to set time on ./fsroot-vs/usr/share/doc/libjson-c5/changelog.gz, because No such file or directory
set_attributes: failed to set time on ./fsroot-vs/usr/share/doc/libjson-c5/copyright, because No such file or directory
set_attributes: failed to set time on ./fsroot-vs/usr/share/doc/libjson-c5, because No such file or directory
set_attributes: failed to set time on ./fsroot-vs/usr/share/doc/libklibc/README, because No such file or directory
set_attributes: failed to set time on ./fsroot-vs/usr/share/doc/libklibc/README.ipconfig.gz, because No such file or directory
set_attributes: failed to set time on ./fsroot-vs/usr/share/doc/libklibc/README.klibc.arch, because No such file or directory
set_attributes: failed to set time on ./fsroot-vs/usr/share/doc/libklibc/README.klibc.gz, because No such file or directory
set_attributes: failed to set time on ./fsroot-vs/usr/share/doc/libklibc/changelog.Debian.gz, because No such file or directory
set_attributes: failed to set time on ./fsroot-vs/usr/share/doc/libklibc/copyright, because No such file or directory
set_attributes: failed to set time on ./fsroot-vs/usr/share/doc/libklibc, because No such file or directory
set_attributes: failed to set time on ./fsroot-vs/usr/share/doc/libkmod2/README.md, because No such file or directory
set_attributes: failed to set time on ./fsroot-vs/usr/share/doc/libkmod2/TODO, because No such file or directory
set_attributes: failed to set time on ./fsroot-vs/usr/share/doc/libkmod2/changelog.Debian.gz, because No such file or directory
set_attributes: failed to set time on ./fsroot-vs/usr/share/doc/libkmod2/changelog.gz, because No such file or directory
set_attributes: failed to set time on ./fsroot-vs/usr/share/doc/libkmod2/copyright, because No such file or directory
set_attributes: failed to set time on ./fsroot-vs/usr/share/doc/libkmod2, because No such file or directory
set_attributes: failed to set time on ./fsroot-vs/usr/share/doc/libkrb5-3/README.Debian, because No such file or directory
set_attributes: failed to set time on ./fsroot-vs/usr/share/doc/libkrb5-3/README.gz, because No such file or directory
set_attributes: failed to set time on ./fsroot-vs/usr/share/doc/libkrb5-3/changelog.Debian.gz, because No such file or directory
set_attributes: failed to set time on ./fsroot-vs/usr/share/doc/libkrb5-3/copyright, because No such file or directory
set_attributes: failed to set time on ./fsroot-vs/usr/share/doc/libkrb5-3, because No such file or directory
set_attributes: failed to set time on ./fsroot-vs/usr/share/doc/libkrb5support0/changelog.Debian.gz, because No such file or directory
set_attributes: failed to set time on ./fsroot-vs/usr/share/doc/libkrb5support0/copyright, because No such file or directory
set_attributes: failed to set time on ./fsroot-vs/usr/share/doc/libkrb5support0, because No such file or directory
set_attributes: failed to set time on ./fsroot-vs/usr/share/doc/libldap-2.5-0/README.Debian, because No such file or directory
set_attributes: failed to set time on ./fsroot-vs/usr/share/doc/libldap-2.5-0/changelog.Debian.gz, because No such file or directory
set_attributes: failed to set time on ./fsroot-vs/usr/share/doc/libldap-2.5-0/changelog.gz, because No such file or directory
set_attributes: failed to set time on ./fsroot-vs/usr/share/doc/libldap-2.5-0/copyright, because No such file or directory
set_attributes: failed to set time on ./fsroot-vs/usr/share/doc/libldap-2.5-0, because No such file or directory
set_attributes: failed to set time on ./fsroot-vs/usr/share/doc/liblz4-1/changelog.Debian.gz, because No such file or directory
set_attributes: failed to set time on ./fsroot-vs/usr/share/doc/liblz4-1/copyright, because No such file or directory
set_attributes: failed to set time on ./fsroot-vs/usr/share/doc/liblz4-1, because No such file or directory
set_attributes: failed to set time on ./fsroot-vs/usr/share/doc/liblzma5/AUTHORS, because No such file or directory
set_attributes: failed to set time on ./fsroot-vs/usr/share/doc/liblzma5/NEWS.gz, because No such file or directory
set_attributes: failed to set time on ./fsroot-vs/usr/share/doc/liblzma5/THANKS, because No such file or directory
set_attributes: failed to set time on ./fsroot-vs/usr/share/doc/liblzma5/changelog.Debian.gz, because No such file or directory
set_attributes: failed to set time on ./fsroot-vs/usr/share/doc/liblzma5/changelog.gz, because No such file or directory
set_attributes: failed to set time on ./fsroot-vs/usr/share/doc/liblzma5/copyright, because No such file or directory
set_attributes: failed to set time on ./fsroot-vs/usr/share/doc/liblzma5, because No such file or directory
set_attributes: failed to set time on ./fsroot-vs/usr/share/doc/libmagic-mgc/README.Debian, because No such file or directory
set_attributes: failed to set time on ./fsroot-vs/usr/share/doc/libmagic-mgc/changelog.Debian.gz, because No such file or directory
set_attributes: failed to set time on ./fsroot-vs/usr/share/doc/libmagic-mgc/changelog.gz, because No such file or directory
set_attributes: failed to set time on ./fsroot-vs/usr/share/doc/libmagic-mgc/copyright, because No such file or directory
set_attributes: failed to set time on ./fsroot-vs/usr/share/doc/libmagic-mgc, because No such file or directory
set_attributes: failed to set time on ./fsroot-vs/usr/share/doc/libmagic1/changelog.Debian.gz, because No such file or directory
set_attributes: failed to set time on ./fsroot-vs/usr/share/doc/libmagic1/changelog.gz, because No such file or directory
set_attributes: failed to set time on ./fsroot-vs/usr/share/doc/libmagic1/copyright, because No such file or directory
set_attributes: failed to set time on ./fsroot-vs/usr/share/doc/libmagic1, because No such file or directory
set_attributes: failed to set time on ./fsroot-vs/usr/share/doc/libmnl0/changelog.Debian.gz, because No such file or directory
set_attributes: failed to set time on ./fsroot-vs/usr/share/doc/libmnl0/copyright, because No such file or directory
set_attributes: failed to set time on ./fsroot-vs/usr/share/doc/libmnl0, because No such file or directory
set_attributes: failed to set time on ./fsroot-vs/usr/share/doc/libmount1/changelog.Debian.gz, because No such file or directory
set_attributes: failed to set time on ./fsroot-vs/usr/share/doc/libmount1/changelog.gz, because No such file or directory
set_attributes: failed to set time on ./fsroot-vs/usr/share/doc/libmount1/copyright, because No such file or directory
set_attributes: failed to set time on ./fsroot-vs/usr/share/doc/libmount1, because No such file or directory
set_attributes: failed to set time on ./fsroot-vs/usr/share/doc/libmpc3/changelog.Debian.gz, because No such file or directory
set_attributes: failed to set time on ./fsroot-vs/usr/share/doc/libmpc3/copyright, because No such file or directory
set_attributes: failed to set time on ./fsroot-vs/usr/share/doc/libmpc3, because No such file or directory
set_attributes: failed to set time on ./fsroot-vs/usr/share/doc/libnet1/CONTRIB, because No such file or directory
set_attributes: failed to set time on ./fsroot-vs/usr/share/doc/libnet1/README, because No such file or directory
set_attributes: failed to set time on ./fsroot-vs/usr/share/doc/libnet1/TODO, because No such file or directory
set_attributes: failed to set time on ./fsroot-vs/usr/share/doc/libnet1/changelog.Debian.gz, because No such file or directory
set_attributes: failed to set time on ./fsroot-vs/usr/share/doc/libnet1/changelog.gz, because No such file or directory
set_attributes: failed to set time on ./fsroot-vs/usr/share/doc/libnet1/copyright, because No such file or directory
set_attributes: failed to set time on ./fsroot-vs/usr/share/doc/libnet1, because No such file or directory
set_attributes: failed to set time on ./fsroot-vs/usr/share/doc/libnetfilter-conntrack3/changelog.Debian.gz, because No such file or directory
set_attributes: failed to set time on ./fsroot-vs/usr/share/doc/libnetfilter-conntrack3/copyright, because No such file or directory
set_attributes: failed to set time on ./fsroot-vs/usr/share/doc/libnetfilter-conntrack3, because No such file or directory
set_attributes: failed to set time on ./fsroot-vs/usr/share/doc/libnettle8/NEWS.gz, because No such file or directory
set_attributes: failed to set time on ./fsroot-vs/usr/share/doc/libnettle8/README, because No such file or directory
set_attributes: failed to set time on ./fsroot-vs/usr/share/doc/libnettle8/changelog.Debian.gz, because No such file or directory
set_attributes: failed to set time on ./fsroot-vs/usr/share/doc/libnettle8/changelog.gz, because No such file or directory
set_attributes: failed to set time on ./fsroot-vs/usr/share/doc/libnettle8/copyright, because No such file or directory
set_attributes: failed to set time on ./fsroot-vs/usr/share/doc/libnettle8, because No such file or directory
set_attributes: failed to set time on ./fsroot-vs/usr/share/doc/libnftnl11/changelog.Debian.gz, because No such file or directory
set_attributes: failed to set time on ./fsroot-vs/usr/share/doc/libnftnl11/copyright, because No such file or directory
set_attributes: failed to set time on ./fsroot-vs/usr/share/doc/libnftnl11, because No such file or directory
set_attributes: failed to set time on ./fsroot-vs/usr/share/doc/libnsl2/changelog.Debian.gz, because No such file or directory
set_attributes: failed to set time on ./fsroot-vs/usr/share/doc/libnsl2/changelog.gz, because No such file or directory
set_attributes: failed to set time on ./fsroot-vs/usr/share/doc/libnsl2/copyright, because No such file or directory
set_attributes: failed to set time on ./fsroot-vs/usr/share/doc/libnsl2, because No such file or directory
set_attributes: failed to set time on ./fsroot-vs/usr/share/doc/libnuma1/changelog.Debian.gz, because No such file or directory
set_attributes: failed to set time on ./fsroot-vs/usr/share/doc/libnuma1/copyright, because No such file or directory
set_attributes: failed to set time on ./fsroot-vs/usr/share/doc/libnuma1, because No such file or directory
set_attributes: failed to set time on ./fsroot-vs/usr/share/doc/libnvme1/changelog.Debian.gz, because No such file or directory
set_attributes: failed to set time on ./fsroot-vs/usr/share/doc/libnvme1/copyright, because No such file or directory
set_attributes: failed to set time on ./fsroot-vs/usr/share/doc/libnvme1, because No such file or directory
set_attributes: failed to set time on ./fsroot-vs/usr/share/doc/libonig5/changelog.Debian.gz, because No such file or directory
set_attributes: failed to set time on ./fsroot-vs/usr/share/doc/libonig5/changelog.gz, because No such file or directory
set_attributes: failed to set time on ./fsroot-vs/usr/share/doc/libonig5/copyright, because No such file or directory
set_attributes: failed to set time on ./fsroot-vs/usr/share/doc/libonig5, because No such file or directory
set_attributes: failed to set time on ./fsroot-vs/usr/share/doc/libopencsd1/changelog.Debian.gz, because No such file or directory
set_attributes: failed to set time on ./fsroot-vs/usr/share/doc/libopencsd1/copyright, because No such file or directory
set_attributes: failed to set time on ./fsroot-vs/usr/share/doc/libopencsd1, because No such file or directory
set_attributes: failed to set time on ./fsroot-vs/usr/share/doc/libp11-kit0/changelog.Debian.gz, because No such file or directory
set_attributes: failed to set time on ./fsroot-vs/usr/share/doc/libp11-kit0/changelog.gz, because No such file or directory
set_attributes: failed to set time on ./fsroot-vs/usr/share/doc/libp11-kit0/copyright, because No such file or directory
set_attributes: failed to set time on ./fsroot-vs/usr/share/doc/libp11-kit0/examples/pkcs11.conf.example, because No such file or directory
set_attributes: failed to set time on ./fsroot-vs/usr/share/doc/libp11-kit0/examples, because No such file or directory
set_attributes: failed to set time on ./fsroot-vs/usr/share/doc/libp11-kit0, because No such file or directory
set_attributes: failed to set time on ./fsroot-vs/usr/share/doc/libpam-modules/NEWS.Debian.gz, because No such file or directory
set_attributes: failed to set time on ./fsroot-vs/usr/share/doc/libpam-modules/changelog.Debian.gz, because No such file or directory
set_attributes: failed to set time on ./fsroot-vs/usr/share/doc/libpam-modules/changelog.gz, because No such file or directory
set_attributes: failed to set time on ./fsroot-vs/usr/share/doc/libpam-modules/copyright, because No such file or directory
set_attributes: failed to set time on ./fsroot-vs/usr/share/doc/libpam-modules/examples/upperLOWER.c, because No such file or directory
set_attributes: failed to set time on ./fsroot-vs/usr/share/doc/libpam-modules/examples, because No such file or directory
set_attributes: failed to set time on ./fsroot-vs/usr/share/doc/libpam-modules, because No such file or directory
set_attributes: failed to set time on ./fsroot-vs/usr/share/doc/libpam-runtime/NEWS.Debian.gz, because No such file or directory
set_attributes: failed to set time on ./fsroot-vs/usr/share/doc/libpam-runtime/changelog.Debian.gz, because No such file or directory
set_attributes: failed to set time on ./fsroot-vs/usr/share/doc/libpam-runtime/changelog.gz, because No such file or directory
set_attributes: failed to set time on ./fsroot-vs/usr/share/doc/libpam-runtime/copyright, because No such file or directory
set_attributes: failed to set time on ./fsroot-vs/usr/share/doc/libpam-runtime, because No such file or directory
set_attributes: failed to set time on ./fsroot-vs/usr/share/doc/libpam0g/Debian-PAM-MiniPolicy.gz, because No such file or directory
set_attributes: failed to set time on ./fsroot-vs/usr/share/doc/libpam0g/NEWS.Debian.gz, because No such file or directory
set_attributes: failed to set time on ./fsroot-vs/usr/share/doc/libpam0g/README, because No such file or directory
set_attributes: failed to set time on ./fsroot-vs/usr/share/doc/libpam0g/README.Debian, because No such file or directory
set_attributes: failed to set time on ./fsroot-vs/usr/share/doc/libpam0g/TODO.Debian, because No such file or directory
set_attributes: failed to set time on ./fsroot-vs/usr/share/doc/libpam0g/changelog.Debian.gz, because No such file or directory
set_attributes: failed to set time on ./fsroot-vs/usr/share/doc/libpam0g/changelog.gz, because No such file or directory
set_attributes: failed to set time on ./fsroot-vs/usr/share/doc/libpam0g/copyright, because No such file or directory
set_attributes: failed to set time on ./fsroot-vs/usr/share/doc/libpam0g, because No such file or directory
set_attributes: failed to set time on ./fsroot-vs/usr/share/doc/libpci3/changelog.Debian.gz, because No such file or directory
set_attributes: failed to set time on ./fsroot-vs/usr/share/doc/libpci3/changelog.gz, because No such file or directory
set_attributes: failed to set time on ./fsroot-vs/usr/share/doc/libpci3/copyright, because No such file or directory
set_attributes: failed to set time on ./fsroot-vs/usr/share/doc/libpci3, because No such file or directory
set_attributes: failed to set time on ./fsroot-vs/usr/share/doc/libperl5.36/changelog.Debian.gz, because No such file or directory
set_attributes: failed to set time on ./fsroot-vs/usr/share/doc/libperl5.36/changelog.gz, because No such file or directory
set_attributes: failed to set time on ./fsroot-vs/usr/share/doc/libperl5.36/copyright, because No such file or directory
set_attributes: failed to set time on ./fsroot-vs/usr/share/doc/libperl5.36, because No such file or directory
set_attributes: failed to set time on ./fsroot-vs/usr/share/doc/libpng16-16/ANNOUNCE, because No such file or directory
set_attributes: failed to set time on ./fsroot-vs/usr/share/doc/libpng16-16/README.gz, because No such file or directory
set_attributes: failed to set time on ./fsroot-vs/usr/share/doc/libpng16-16/TODO, because No such file or directory
set_attributes: failed to set time on ./fsroot-vs/usr/share/doc/libpng16-16/changelog.Debian.gz, because No such file or directory
set_attributes: failed to set time on ./fsroot-vs/usr/share/doc/libpng16-16/changelog.gz, because No such file or directory
set_attributes: failed to set time on ./fsroot-vs/usr/share/doc/libpng16-16/copyright, because No such file or directory
set_attributes: failed to set time on ./fsroot-vs/usr/share/doc/libpng16-16/libpng-manual.txt.gz, because No such file or directory
set_attributes: failed to set time on ./fsroot-vs/usr/share/doc/libpng16-16, because No such file or directory
set_attributes: failed to set time on ./fsroot-vs/usr/share/doc/libpopt0/README, because No such file or directory
set_attributes: failed to set time on ./fsroot-vs/usr/share/doc/libpopt0/changelog.Debian.gz, because No such file or directory
set_attributes: failed to set time on ./fsroot-vs/usr/share/doc/libpopt0/copyright, because No such file or directory
set_attributes: failed to set time on ./fsroot-vs/usr/share/doc/libpopt0, because No such file or directory
set_attributes: failed to set time on ./fsroot-vs/usr/share/doc/libproc2-0/NEWS.Debian.gz, because No such file or directory
set_attributes: failed to set time on ./fsroot-vs/usr/share/doc/libproc2-0/changelog.Debian.gz, because No such file or directory
set_attributes: failed to set time on ./fsroot-vs/usr/share/doc/libproc2-0/changelog.gz, because No such file or directory
set_attributes: failed to set time on ./fsroot-vs/usr/share/doc/libproc2-0/copyright, because No such file or directory
set_attributes: failed to set time on ./fsroot-vs/usr/share/doc/libproc2-0, because No such file or directory
set_attributes: failed to set time on ./fsroot-vs/usr/share/doc/libprotobuf32/changelog.Debian.gz, because No such file or directory
set_attributes: failed to set time on ./fsroot-vs/usr/share/doc/libprotobuf32/changelog.gz, because No such file or directory
set_attributes: failed to set time on ./fsroot-vs/usr/share/doc/libprotobuf32/copyright, because No such file or directory
set_attributes: failed to set time on ./fsroot-vs/usr/share/doc/libprotobuf32, because No such file or directory
set_attributes: failed to set time on ./fsroot-vs/usr/share/doc/libpython3-stdlib/README.Debian, because No such file or directory
set_attributes: failed to set time on ./fsroot-vs/usr/share/doc/libpython3-stdlib/changelog.Debian.amd64.gz, because No such file or directory
set_attributes: failed to set time on ./fsroot-vs/usr/share/doc/libpython3-stdlib/changelog.Debian.gz, because No such file or directory
set_attributes: failed to set time on ./fsroot-vs/usr/share/doc/libpython3-stdlib/copyright, because No such file or directory
set_attributes: failed to set time on ./fsroot-vs/usr/share/doc/libpython3-stdlib, because No such file or directory
set_attributes: failed to set time on ./fsroot-vs/usr/share/doc/libpython3.11-minimal/README.Debian, because No such file or directory
set_attributes: failed to set time on ./fsroot-vs/usr/share/doc/libpython3.11-minimal/changelog.Debian.gz, because No such file or directory
set_attributes: failed to set time on ./fsroot-vs/usr/share/doc/libpython3.11-minimal/copyright, because No such file or directory
set_attributes: failed to set time on ./fsroot-vs/usr/share/doc/libpython3.11-minimal, because No such file or directory
set_attributes: failed to set time on ./fsroot-vs/usr/share/doc/libre2-9/changelog.Debian.amd64.gz, because No such file or directory
set_attributes: failed to set time on ./fsroot-vs/usr/share/doc/libre2-9/changelog.Debian.gz, because No such file or directory
set_attributes: failed to set time on ./fsroot-vs/usr/share/doc/libre2-9/copyright, because No such file or directory
set_attributes: failed to set time on ./fsroot-vs/usr/share/doc/libre2-9, because No such file or directory
set_attributes: failed to set time on ./fsroot-vs/usr/share/doc/libreadline8/README.Debian, because No such file or directory
set_attributes: failed to set time on ./fsroot-vs/usr/share/doc/libreadline8/USAGE, because No such file or directory
set_attributes: failed to set time on ./fsroot-vs/usr/share/doc/libreadline8/changelog.Debian.gz, because No such file or directory
set_attributes: failed to set time on ./fsroot-vs/usr/share/doc/libreadline8/changelog.gz, because No such file or directory
set_attributes: failed to set time on ./fsroot-vs/usr/share/doc/libreadline8/copyright, because No such file or directory
set_attributes: failed to set time on ./fsroot-vs/usr/share/doc/libreadline8/examples/Inputrc, because No such file or directory
set_attributes: failed to set time on ./fsroot-vs/usr/share/doc/libreadline8/examples, because No such file or directory
set_attributes: failed to set time on ./fsroot-vs/usr/share/doc/libreadline8/inputrc.arrows, because No such file or directory
set_attributes: failed to set time on ./fsroot-vs/usr/share/doc/libreadline8, because No such file or directory
set_attributes: failed to set time on ./fsroot-vs/usr/share/doc/librtmp1/changelog.Debian.amd64.gz, because No such file or directory
set_attributes: failed to set time on ./fsroot-vs/usr/share/doc/librtmp1/changelog.Debian.gz, because No such file or directory
set_attributes: failed to set time on ./fsroot-vs/usr/share/doc/librtmp1/changelog.gz, because No such file or directory
set_attributes: failed to set time on ./fsroot-vs/usr/share/doc/librtmp1/copyright, because No such file or directory
set_attributes: failed to set time on ./fsroot-vs/usr/share/doc/librtmp1, because No such file or directory
set_attributes: failed to set time on ./fsroot-vs/usr/share/doc/libsasl2-2/NEWS.Debian.gz, because No such file or directory
set_attributes: failed to set time on ./fsroot-vs/usr/share/doc/libsasl2-2/README.Debian, because No such file or directory
set_attributes: failed to set time on ./fsroot-vs/usr/share/doc/libsasl2-2/changelog.Debian.gz, because No such file or directory
set_attributes: failed to set time on ./fsroot-vs/usr/share/doc/libsasl2-2/copyright, because No such file or directory
set_attributes: failed to set time on ./fsroot-vs/usr/share/doc/libsasl2-2, because No such file or directory
set_attributes: failed to set time on ./fsroot-vs/usr/share/doc/libseccomp2/changelog.Debian.gz, because No such file or directory
set_attributes: failed to set time on ./fsroot-vs/usr/share/doc/libseccomp2/changelog.gz, because No such file or directory
set_attributes: failed to set time on ./fsroot-vs/usr/share/doc/libseccomp2/copyright, because No such file or directory
set_attributes: failed to set time on ./fsroot-vs/usr/share/doc/libseccomp2, because No such file or directory
set_attributes: failed to set time on ./fsroot-vs/usr/share/doc/libselinux1/changelog.Debian.amd64.gz, because No such file or directory
set_attributes: failed to set time on ./fsroot-vs/usr/share/doc/libselinux1/changelog.Debian.gz, because No such file or directory
set_attributes: failed to set time on ./fsroot-vs/usr/share/doc/libselinux1/copyright, because No such file or directory
set_attributes: failed to set time on ./fsroot-vs/usr/share/doc/libselinux1, because No such file or directory
set_attributes: failed to set time on ./fsroot-vs/usr/share/doc/libsemanage-common/changelog.Debian.gz, because No such file or directory
set_attributes: failed to set time on ./fsroot-vs/usr/share/doc/libsemanage-common/copyright, because No such file or directory
set_attributes: failed to set time on ./fsroot-vs/usr/share/doc/libsemanage-common, because No such file or directory
set_attributes: failed to set time on ./fsroot-vs/usr/share/doc/libsemanage2/changelog.Debian.amd64.gz, because No such file or directory
set_attributes: failed to set time on ./fsroot-vs/usr/share/doc/libsemanage2/changelog.Debian.gz, because No such file or directory
set_attributes: failed to set time on ./fsroot-vs/usr/share/doc/libsemanage2/copyright, because No such file or directory
set_attributes: failed to set time on ./fsroot-vs/usr/share/doc/libsemanage2, because No such file or directory
set_attributes: failed to set time on ./fsroot-vs/usr/share/doc/libsensors-config/changelog.Debian.gz, because No such file or directory
set_attributes: failed to set time on ./fsroot-vs/usr/share/doc/libsensors-config/changelog.gz, because No such file or directory
set_attributes: failed to set time on ./fsroot-vs/usr/share/doc/libsensors-config/copyright, because No such file or directory
set_attributes: failed to set time on ./fsroot-vs/usr/share/doc/libsensors-config, because No such file or directory
set_attributes: failed to set time on ./fsroot-vs/usr/share/doc/libsepol2/changelog.Debian.gz, because No such file or directory
set_attributes: failed to set time on ./fsroot-vs/usr/share/doc/libsepol2/copyright, because No such file or directory
set_attributes: failed to set time on ./fsroot-vs/usr/share/doc/libsepol2, because No such file or directory
set_attributes: failed to set time on ./fsroot-vs/usr/share/doc/libslang2/NEWS.gz, because No such file or directory
set_attributes: failed to set time on ./fsroot-vs/usr/share/doc/libslang2/README, because No such file or directory
set_attributes: failed to set time on ./fsroot-vs/usr/share/doc/libslang2/changelog.Debian.gz, because No such file or directory
set_attributes: failed to set time on ./fsroot-vs/usr/share/doc/libslang2/changelog.gz, because No such file or directory
set_attributes: failed to set time on ./fsroot-vs/usr/share/doc/libslang2/copyright, because No such file or directory
set_attributes: failed to set time on ./fsroot-vs/usr/share/doc/libslang2/slang.txt.gz, because No such file or directory
set_attributes: failed to set time on ./fsroot-vs/usr/share/doc/libslang2/slangfun.txt.gz, because No such file or directory
set_attributes: failed to set time on ./fsroot-vs/usr/share/doc/libslang2, because No such file or directory
set_attributes: failed to set time on ./fsroot-vs/usr/share/doc/libsmartcols1/changelog.Debian.gz, because No such file or directory
set_attributes: failed to set time on ./fsroot-vs/usr/share/doc/libsmartcols1/changelog.gz, because No such file or directory
set_attributes: failed to set time on ./fsroot-vs/usr/share/doc/libsmartcols1/copyright, because No such file or directory
set_attributes: failed to set time on ./fsroot-vs/usr/share/doc/libsmartcols1, because No such file or directory
set_attributes: failed to set time on ./fsroot-vs/usr/share/doc/libsodium23/AUTHORS.gz, because No such file or directory
set_attributes: failed to set time on ./fsroot-vs/usr/share/doc/libsodium23/README.markdown, because No such file or directory
set_attributes: failed to set time on ./fsroot-vs/usr/share/doc/libsodium23/THANKS, because No such file or directory
set_attributes: failed to set time on ./fsroot-vs/usr/share/doc/libsodium23/changelog.Debian.gz, because No such file or directory
set_attributes: failed to set time on ./fsroot-vs/usr/share/doc/libsodium23/changelog.gz, because No such file or directory
set_attributes: failed to set time on ./fsroot-vs/usr/share/doc/libsodium23/copyright, because No such file or directory
set_attributes: failed to set time on ./fsroot-vs/usr/share/doc/libsodium23, because No such file or directory
set_attributes: failed to set time on ./fsroot-vs/usr/share/doc/libsqlite3-0/README.Debian, because No such file or directory
set_attributes: failed to set time on ./fsroot-vs/usr/share/doc/libsqlite3-0/changelog.Debian.gz, because No such file or directory
set_attributes: failed to set time on ./fsroot-vs/usr/share/doc/libsqlite3-0/changelog.gz, because No such file or directory
set_attributes: failed to set time on ./fsroot-vs/usr/share/doc/libsqlite3-0/changelog.html.gz, because No such file or directory
set_attributes: failed to set time on ./fsroot-vs/usr/share/doc/libsqlite3-0/copyright, because No such file or directory
set_attributes: failed to set time on ./fsroot-vs/usr/share/doc/libsqlite3-0, because No such file or directory
set_attributes: failed to set time on ./fsroot-vs/usr/share/doc/libss2/changelog.Debian.amd64.gz, because No such file or directory
set_attributes: failed to set time on ./fsroot-vs/usr/share/doc/libss2/changelog.Debian.gz, because No such file or directory
set_attributes: failed to set time on ./fsroot-vs/usr/share/doc/libss2/copyright, because No such file or directory
set_attributes: failed to set time on ./fsroot-vs/usr/share/doc/libss2, because No such file or directory
set_attributes: failed to set time on ./fsroot-vs/usr/share/doc/libssl3/changelog.Debian.gz, because No such file or directory
set_attributes: failed to set time on ./fsroot-vs/usr/share/doc/libssl3/changelog.gz, because No such file or directory
set_attributes: failed to set time on ./fsroot-vs/usr/share/doc/libssl3/copyright, because No such file or directory
set_attributes: failed to set time on ./fsroot-vs/usr/share/doc/libssl3, because No such file or directory
set_attributes: failed to set time on ./fsroot-vs/usr/share/doc/libsysfs2/changelog.Debian.gz, because No such file or directory
set_attributes: failed to set time on ./fsroot-vs/usr/share/doc/libsysfs2/copyright, because No such file or directory
set_attributes: failed to set time on ./fsroot-vs/usr/share/doc/libsysfs2, because No such file or directory
set_attributes: failed to set time on ./fsroot-vs/usr/share/doc/libsystemd-shared/NEWS.Debian.gz, because No such file or directory
set_attributes: failed to set time on ./fsroot-vs/usr/share/doc/libsystemd-shared/changelog.Debian.gz, because No such file or directory
set_attributes: failed to set time on ./fsroot-vs/usr/share/doc/libsystemd-shared/copyright, because No such file or directory
set_attributes: failed to set time on ./fsroot-vs/usr/share/doc/libsystemd-shared, because No such file or directory
set_attributes: failed to set time on ./fsroot-vs/usr/share/doc/libsystemd0/NEWS.Debian.gz, because No such file or directory
set_attributes: failed to set time on ./fsroot-vs/usr/share/doc/libsystemd0/changelog.Debian.gz, because No such file or directory
set_attributes: failed to set time on ./fsroot-vs/usr/share/doc/libsystemd0/copyright, because No such file or directory
set_attributes: failed to set time on ./fsroot-vs/usr/share/doc/libsystemd0, because No such file or directory
set_attributes: failed to set time on ./fsroot-vs/usr/share/doc/libtasn1-6/AUTHORS, because No such file or directory
set_attributes: failed to set time on ./fsroot-vs/usr/share/doc/libtasn1-6/README.md, because No such file or directory
set_attributes: failed to set time on ./fsroot-vs/usr/share/doc/libtasn1-6/THANKS, because No such file or directory
set_attributes: failed to set time on ./fsroot-vs/usr/share/doc/libtasn1-6/changelog.Debian.gz, because No such file or directory
set_attributes: failed to set time on ./fsroot-vs/usr/share/doc/libtasn1-6/changelog.gz, because No such file or directory
set_attributes: failed to set time on ./fsroot-vs/usr/share/doc/libtasn1-6/copyright, because No such file or directory
set_attributes: failed to set time on ./fsroot-vs/usr/share/doc/libtasn1-6, because No such file or directory
set_attributes: failed to set time on ./fsroot-vs/usr/share/doc/libtcl8.6/changelog.Debian.gz, because No such file or directory
set_attributes: failed to set time on ./fsroot-vs/usr/share/doc/libtcl8.6/changelog.gz, because No such file or directory
set_attributes: failed to set time on ./fsroot-vs/usr/share/doc/libtcl8.6/copyright, because No such file or directory
set_attributes: failed to set time on ./fsroot-vs/usr/share/doc/libtcl8.6, because No such file or directory
set_attributes: failed to set time on ./fsroot-vs/usr/share/doc/libtinfo6/changelog.Debian.gz, because No such file or directory
set_attributes: failed to set time on ./fsroot-vs/usr/share/doc/libtinfo6/changelog.gz, because No such file or directory
set_attributes: failed to set time on ./fsroot-vs/usr/share/doc/libtinfo6/copyright, because No such file or directory
set_attributes: failed to set time on ./fsroot-vs/usr/share/doc/libtinfo6, because No such file or directory
set_attributes: failed to set time on ./fsroot-vs/usr/share/doc/libtirpc-common/NEWS.Debian.gz, because No such file or directory
set_attributes: failed to set time on ./fsroot-vs/usr/share/doc/libtirpc-common/changelog.Debian.gz, because No such file or directory
set_attributes: failed to set time on ./fsroot-vs/usr/share/doc/libtirpc-common/changelog.gz, because No such file or directory
set_attributes: failed to set time on ./fsroot-vs/usr/share/doc/libtirpc-common/copyright, because No such file or directory
set_attributes: failed to set time on ./fsroot-vs/usr/share/doc/libtirpc-common, because No such file or directory
set_attributes: failed to set time on ./fsroot-vs/usr/share/doc/libtirpc3/NEWS.Debian.gz, because No such file or directory
set_attributes: failed to set time on ./fsroot-vs/usr/share/doc/libtirpc3/changelog.Debian.gz, because No such file or directory
set_attributes: failed to set time on ./fsroot-vs/usr/share/doc/libtirpc3/changelog.gz, because No such file or directory
set_attributes: failed to set time on ./fsroot-vs/usr/share/doc/libtirpc3/copyright, because No such file or directory
set_attributes: failed to set time on ./fsroot-vs/usr/share/doc/libtirpc3, because No such file or directory
set_attributes: failed to set time on ./fsroot-vs/usr/share/doc/libubootenv-tool/changelog.Debian.gz, because No such file or directory
set_attributes: failed to set time on ./fsroot-vs/usr/share/doc/libubootenv-tool/copyright, because No such file or directory
set_attributes: failed to set time on ./fsroot-vs/usr/share/doc/libubootenv-tool, because No such file or directory
set_attributes: failed to set time on ./fsroot-vs/usr/share/doc/libubootenv0.1/changelog.Debian.gz, because No such file or directory
set_attributes: failed to set time on ./fsroot-vs/usr/share/doc/libubootenv0.1/copyright, because No such file or directory
set_attributes: failed to set time on ./fsroot-vs/usr/share/doc/libubootenv0.1, because No such file or directory
set_attributes: failed to set time on ./fsroot-vs/usr/share/doc/libudev1/NEWS.Debian.gz, because No such file or directory
set_attributes: failed to set time on ./fsroot-vs/usr/share/doc/libudev1/changelog.Debian.gz, because No such file or directory
set_attributes: failed to set time on ./fsroot-vs/usr/share/doc/libudev1/copyright, because No such file or directory
set_attributes: failed to set time on ./fsroot-vs/usr/share/doc/libudev1, because No such file or directory
set_attributes: failed to set time on ./fsroot-vs/usr/share/doc/libunistring2/changelog.Debian.gz, because No such file or directory
set_attributes: failed to set time on ./fsroot-vs/usr/share/doc/libunistring2/changelog.gz, because No such file or directory
set_attributes: failed to set time on ./fsroot-vs/usr/share/doc/libunistring2/copyright, because No such file or directory
set_attributes: failed to set time on ./fsroot-vs/usr/share/doc/libunistring2, because No such file or directory
set_attributes: failed to set time on ./fsroot-vs/usr/share/doc/libunwind8/changelog.Debian.gz, because No such file or directory
set_attributes: failed to set time on ./fsroot-vs/usr/share/doc/libunwind8/changelog.gz, because No such file or directory
set_attributes: failed to set time on ./fsroot-vs/usr/share/doc/libunwind8/copyright, because No such file or directory
set_attributes: failed to set time on ./fsroot-vs/usr/share/doc/libunwind8, because No such file or directory
set_attributes: failed to set time on ./fsroot-vs/usr/share/doc/libusb-1.0-0/README, because No such file or directory
set_attributes: failed to set time on ./fsroot-vs/usr/share/doc/libusb-1.0-0/changelog.Debian.gz, because No such file or directory
set_attributes: failed to set time on ./fsroot-vs/usr/share/doc/libusb-1.0-0/changelog.gz, because No such file or directory
set_attributes: failed to set time on ./fsroot-vs/usr/share/doc/libusb-1.0-0/copyright, because No such file or directory
set_attributes: failed to set time on ./fsroot-vs/usr/share/doc/libusb-1.0-0, because No such file or directory
set_attributes: failed to set time on ./fsroot-vs/usr/share/doc/libutempter0/changelog.Debian.gz, because No such file or directory
set_attributes: failed to set time on ./fsroot-vs/usr/share/doc/libutempter0/copyright, because No such file or directory
set_attributes: failed to set time on ./fsroot-vs/usr/share/doc/libutempter0, because No such file or directory
set_attributes: failed to set time on ./fsroot-vs/usr/share/doc/libuuid1/changelog.Debian.gz, because No such file or directory
set_attributes: failed to set time on ./fsroot-vs/usr/share/doc/libuuid1/changelog.gz, because No such file or directory
set_attributes: failed to set time on ./fsroot-vs/usr/share/doc/libuuid1/copyright, because No such file or directory
set_attributes: failed to set time on ./fsroot-vs/usr/share/doc/libuuid1, because No such file or directory
set_attributes: failed to set time on ./fsroot-vs/usr/share/doc/libwrap0/README.Debian, because No such file or directory
set_attributes: failed to set time on ./fsroot-vs/usr/share/doc/libwrap0/README.gz, because No such file or directory
set_attributes: failed to set time on ./fsroot-vs/usr/share/doc/libwrap0/changelog.Debian.gz, because No such file or directory
set_attributes: failed to set time on ./fsroot-vs/usr/share/doc/libwrap0/changelog.gz, because No such file or directory
set_attributes: failed to set time on ./fsroot-vs/usr/share/doc/libwrap0/copyright, because No such file or directory
set_attributes: failed to set time on ./fsroot-vs/usr/share/doc/libwrap0, because No such file or directory
set_attributes: failed to set time on ./fsroot-vs/usr/share/doc/libxencall1/changelog.Debian.gz, because No such file or directory
set_attributes: failed to set time on ./fsroot-vs/usr/share/doc/libxencall1/changelog.gz, because No such file or directory
set_attributes: failed to set time on ./fsroot-vs/usr/share/doc/libxencall1/copyright, because No such file or directory
set_attributes: failed to set time on ./fsroot-vs/usr/share/doc/libxencall1, because No such file or directory
set_attributes: failed to set time on ./fsroot-vs/usr/share/doc/libxendevicemodel1/changelog.Debian.gz, because No such file or directory
set_attributes: failed to set time on ./fsroot-vs/usr/share/doc/libxendevicemodel1/changelog.gz, because No such file or directory
set_attributes: failed to set time on ./fsroot-vs/usr/share/doc/libxendevicemodel1/copyright, because No such file or directory
set_attributes: failed to set time on ./fsroot-vs/usr/share/doc/libxendevicemodel1, because No such file or directory
set_attributes: failed to set time on ./fsroot-vs/usr/share/doc/libxenevtchn1/changelog.Debian.gz, because No such file or directory
set_attributes: failed to set time on ./fsroot-vs/usr/share/doc/libxenevtchn1/changelog.gz, because No such file or directory
set_attributes: failed to set time on ./fsroot-vs/usr/share/doc/libxenevtchn1/copyright, because No such file or directory
set_attributes: failed to set time on ./fsroot-vs/usr/share/doc/libxenevtchn1, because No such file or directory
set_attributes: failed to set time on ./fsroot-vs/usr/share/doc/libxenforeignmemory1/changelog.Debian.gz, because No such file or directory
set_attributes: failed to set time on ./fsroot-vs/usr/share/doc/libxenforeignmemory1/changelog.gz, because No such file or directory
set_attributes: failed to set time on ./fsroot-vs/usr/share/doc/libxenforeignmemory1/copyright, because No such file or directory
set_attributes: failed to set time on ./fsroot-vs/usr/share/doc/libxenforeignmemory1, because No such file or directory
set_attributes: failed to set time on ./fsroot-vs/usr/share/doc/libxengnttab1/changelog.Debian.gz, because No such file or directory
set_attributes: failed to set time on ./fsroot-vs/usr/share/doc/libxengnttab1/changelog.gz, because No such file or directory
set_attributes: failed to set time on ./fsroot-vs/usr/share/doc/libxengnttab1/copyright, because No such file or directory
set_attributes: failed to set time on ./fsroot-vs/usr/share/doc/libxengnttab1, because No such file or directory
set_attributes: failed to set time on ./fsroot-vs/usr/share/doc/libxenhypfs1/changelog.Debian.gz, because No such file or directory
set_attributes: failed to set time on ./fsroot-vs/usr/share/doc/libxenhypfs1/changelog.gz, because No such file or directory
set_attributes: failed to set time on ./fsroot-vs/usr/share/doc/libxenhypfs1/copyright, because No such file or directory
set_attributes: failed to set time on ./fsroot-vs/usr/share/doc/libxenhypfs1, because No such file or directory
set_attributes: failed to set time on ./fsroot-vs/usr/share/doc/libxenmisc4.17/changelog.Debian.gz, because No such file or directory
set_attributes: failed to set time on ./fsroot-vs/usr/share/doc/libxenmisc4.17/changelog.gz, because No such file or directory
set_attributes: failed to set time on ./fsroot-vs/usr/share/doc/libxenmisc4.17/copyright, because No such file or directory
set_attributes: failed to set time on ./fsroot-vs/usr/share/doc/libxenmisc4.17, because No such file or directory
set_attributes: failed to set time on ./fsroot-vs/usr/share/doc/libxenstore4/changelog.Debian.gz, because No such file or directory
set_attributes: failed to set time on ./fsroot-vs/usr/share/doc/libxenstore4/changelog.gz, because No such file or directory
set_attributes: failed to set time on ./fsroot-vs/usr/share/doc/libxenstore4/copyright, because No such file or directory
set_attributes: failed to set time on ./fsroot-vs/usr/share/doc/libxenstore4, because No such file or directory
set_attributes: failed to set time on ./fsroot-vs/usr/share/doc/libxentoolcore1/changelog.Debian.gz, because No such file or directory
set_attributes: failed to set time on ./fsroot-vs/usr/share/doc/libxentoolcore1/changelog.gz, because No such file or directory
set_attributes: failed to set time on ./fsroot-vs/usr/share/doc/libxentoolcore1/copyright, because No such file or directory
set_attributes: failed to set time on ./fsroot-vs/usr/share/doc/libxentoolcore1, because No such file or directory
[=======================================================- ] 64160/67775 94%
[===========================================================-] 67775/67775 100%
created 25922 files
created 3484 directories
created 2373 symlinks
created 5351 devices
created 0 fifos
created 0 sockets
created 5 hardlinks
[ FAIL LOG END ] [ target/sonic-vs.bin ]
make: *** [slave.mk:1435: target/sonic-vs.bin] Error 1
make: *** Waiting for unfinished jobs....
[ finished ] [ target/sonic-vs.img.gz ]
[ FAIL LOG START ] [ target/sonic-vs.img.gz ]
Build start time: Sun Sep 27 15:31:15 UTC 2026
++ '[' -f .arch ']'
++ cat .arch
+ CONFIGURED_ARCH=amd64
+ DOCKER_VERSION=5:24.0.2-1~debian.12~bookworm
+ CONTAINERD_IO_VERSION=1.6.21-1
+ LINUX_KERNEL_VERSION=6.1.0-29-2
+ FILESYSTEM_ROOT=./fsroot
+ PLATFORM_DIR=platform
+ HOSTNAME=sonic
+ DEFAULT_USERINFO='Default admin user,,,'
+ BUILD_TOOL_PATH=src/sonic-build-hooks/buildinfo
+ TRUSTED_GPG_DIR=src/sonic-build-hooks/buildinfo/trusted.gpg.d
+ . ./onie-image.conf
++ : 32768
++ : x86_64
++ : vs
++ ONIEIMAGE_VERSION=r0
++ FILESYSTEM_ROOT=./fsroot-vs
++ FILESYSTEM_SQUASHFS=fs.squashfs
++ INSTALLER_PAYLOAD=fs.zip
++ FILESYSTEM_DOCKERFS=dockerfs.tar.gz
++ DOCKERFS_DIR=docker
++ DOCKER_RAMFS_SIZE=3500M
++ OUTPUT_ONIE_IMAGE=target/sonic-vs.bin
++ OUTPUT_RAW_IMAGE=target/sonic-vs.raw
++ RAW_IMAGE_DISK_SIZE=1700
++ OUTPUT_KVM_IMAGE=target/sonic-vs.img
++ KVM_IMAGE_DISK_SIZE=16
++ OUTPUT_ABOOT_IMAGE=target/sonic-aboot-vs.swi
++ ABOOT_BOOT_IMAGE=.sonic-boot.swi
++ OUTPUT_KVM_4ASIC_IMAGE=target/sonic-4asic-vs.img
++ OUTPUT_KVM_6ASIC_IMAGE=target/sonic-6asic-vs.img
++ OUTPUT_DSC_IMAGE=target/sonic-vs.tar
+ '[' -n 32768 ']'
+ '[' -n fs.zip ']'
+ '[' -n fs.squashfs ']'
+ '[' kvm = aboot ']'
+ [[ y != y ]]
+ [[ n == y ]]
+ [[ y == y ]]
+ echo '[INFO] RFS build: second stage'
[INFO] RFS build: second stage
+ sudo mount proc /proc -t proc
+ sudo fuser -vm ./fsroot-vs
USER PID ACCESS COMMAND
/sonic/fsroot-vs: root kernel mount /usr/sbin/docker-init
jenkins 1 ..ce. docker-init
jenkins 7 ..c.. bash
jenkins 8 ..c.. make
jenkins 6229 ..c.. bash
jenkins 6494 ..c.. bash
root 6683 ....m dockerd
root 6773 ....m containerd
jenkins 7255 ..c.. bash
jenkins 7475 ..c.. docker
jenkins 7476 ..c.. process_log.sh
jenkins 12980 ..c.. build_debian.sh
jenkins 12981 ..c.. process_log.sh
root 12994 ..c.. sudo
root 12995 F.c.. unsquashfs
jenkins 13115 ..c.. build_debian.sh
jenkins 13116 ..c.. process_log.sh
root 13125 ..c.. sudo
+ sudo rm -rf ./fsroot-vs
rm: cannot remove './fsroot-vs/usr/share/doc': Directory not empty
[ FAIL LOG END ] [ target/sonic-vs.img.gz ]
make: *** [slave.mk:1435: target/sonic-vs.img.gz] Error 1
[ finished ] [ target/docker-sonic-vs.gz ]
make[1]: *** [Makefile.work:611: all] Error 2
make[1]: Leaving directory '/var/lib/jenkins/workspace/DevOps-test2/platform-vs'
make: *** [Makefile:53: all] Error 2
|