+++ --- Applying local submodule patches --- +++
already applied: sonic-utilities
already applied: sonic-swss
already applied: sonic-swss-new
already applied: sonic-sairedis-vslib
already applied: sonic-sairedis-meta
already applied: sonic-sairedis-SAI
already applied: sonic-sairedis-SAI-apidef
already applied: sonic-mgmt-framework
+++ --- Making all --- +++
./scripts/run_with_retry make BLDENV=bookworm -f Makefile.work all
make[1]: Entering directory '/var/lib/jenkins/workspace/DevOps-test2/platform-broadcom'
"SECURE_UPGRADE_PROD_SIGNING_TOOL": ""
~/workspace/DevOps-test2/platform-broadcom/src/sonic-build-hooks ~/workspace/DevOps-test2/platform-broadcom
make[2]: Entering directory '/var/lib/jenkins/workspace/DevOps-test2/platform-broadcom/src/sonic-build-hooks'
dpkg-deb: building package 'sonic-build-hooks' in 'buildinfo/sonic-build-hooks_1.0_all.deb'.
make[2]: Leaving directory '/var/lib/jenkins/workspace/DevOps-test2/platform-broadcom/src/sonic-build-hooks'
~/workspace/DevOps-test2/platform-broadcom
Checking sonic-slave-base image: sonic-slave-bookworm:2f250bfbb4a
Checking sonic-slave-user image: sonic-slave-bookworm-jenkins:65c8aaa3f92
SONiC Build System
Build Configuration
"CONFIGURED_PLATFORM" : "broadcom"
"CONFIGURED_ARCH" : "amd64"
"SONIC_CONFIG_PRINT_DEPENDENCIES" : ""
"SONIC_BUILD_JOBS" : "4"
"SONIC_CONFIG_MAKE_JOBS" : "112"
"USE_NATIVE_DOCKERD_FOR_BUILD" : ""
"SONIC_USE_DOCKER_BUILDKIT" : ""
"USERNAME" : "admin"
"PASSWORD" : "YourPaSsWoRd"
"CHANGE_DEFAULT_PASSWORD" : "n"
"SECURE_UPGRADE_MODE" : "no_sign"
"SECURE_UPGRADE_DEV_SIGNING_KEY" : ""
"SECURE_UPGRADE_SIGNING_CERT" : ""
"SECURE_UPGRADE_PROD_SIGNING_TOOL": ""
"SECURE_UPGRADE_PROD_TOOL_ARGS" : ""
"ONIE_IMAGE_PART_SIZE" : ""
"SHUTDOWN_BGP_ON_START" : ""
"ENABLE_PFCWD_ON_START" : ""
"SONIC_BUFFER_MODEL" : ""
"INSTALL_DEBUG_TOOLS" : ""
"ROUTING_STACK" : "frr"
"FRR_USER_UID" : "300"
"FRR_USER_GID" : "300"
"ENABLE_SYNCD_RPC" : ""
"SAITHRIFT_V2" : ""
"ENABLE_ORGANIZATION_EXTENSIONS" : "y"
"HTTP_PROXY" : ""
"HTTPS_PROXY" : ""
"NO_PROXY" : ""
"ENABLE_ZTP" : ""
"INCLUDE_PDE" : ""
"SONIC_DEBUGGING_ON" : ""
"SONIC_PROFILING_ON" : ""
"KERNEL_PROCURE_METHOD" : "build"
"BUILD_TIMESTAMP" : "20260929.122232"
"BUILD_LOG_TIMESTAMP" : "none"
"SONIC_IMAGE_VERSION" : "etri-202505.24-8610ff460"
"BLDENV" : "bookworm"
"VS_PREPARE_MEM" : "yes"
"INCLUDE_MGMT_FRAMEWORK" : "y"
"INCLUDE_ICCPD" : "n"
"INCLUDE_STP" : "y"
"INCLUDE_SYSTEM_TELEMETRY" : "y"
"INCLUDE_SYSTEM_GNMI" : "y"
"INCLUDE_SYSTEM_BMP" : "y"
"INCLUDE_SYSTEM_EVENTD" : "y"
"ENABLE_HOST_SERVICE_ON_START" : "y"
"INCLUDE_RESTAPI" : "n"
"INCLUDE_SFLOW" : "y"
"INCLUDE_NAT" : "y"
"INCLUDE_DHCP_RELAY" : "y"
"INCLUDE_DHCP_SERVER" : "n"
"INCLUDE_P4RT" : "n"
"INCLUDE_VS_DASH_SAI" : "y"
"INCLUDE_KUBERNETES" : "n"
"INCLUDE_KUBERNETES_MASTER" : "n"
"INCLUDE_MACSEC" : "y"
"INCLUDE_MUX" : "y"
"INCLUDE_TEAMD" : "y"
"INCLUDE_DASH_HA" : "y"
"INCLUDE_ROUTER_ADVERTISER" : "y"
"INCLUDE_BOOTCHART : "y"
"ENABLE_BOOTCHART : "n"
"INCLUDE_FIPS" : "y"
"ENABLE_TRANSLIB_WRITE" : ""
"ENABLE_NATIVE_WRITE" : "y"
"ENABLE_DIALOUT" : ""
"ENABLE_AUTO_TECH_SUPPORT" : "y"
"PDDF_SUPPORT" : "y"
"MULTIARCH_QEMU_ENVIRON" : "n"
"SONIC_VERSION_CONTROL_COMPONENTS": "py2,py3,web,git,docker"
"ENABLE_ASAN" : "n"
"DEFAULT_CONTAINER_REGISTRY" : "publicmirror.azurecr.io/"
"CROSS_BUILD_ENVIRON" : "n"
"LEGACY_SONIC_MGMT_DOCKER" : "y"
"INCLUDE_EXTERNAL_PATCHES" : "n"
"PTF_ENV_PY_VER" : "py3"
"ENABLE_MULTIDB" : ""
mv: cannot move '/etc/apt/sources.list.d/debian.sources' to '/etc/apt/sources.list.d/debian.sources.back': Permission denied
fatal: not a git repository (or any of the parent directories): .git
"SONIC_DPKG_CACHE_METHOD" : "none"
[ building ] [ target/debs/bookworm/libnl-3-200_3.7.0-0.2+b1sonic1_amd64.deb-install ]
[ building ] [ target/debs/bookworm/libyang_1.0.73_amd64.deb-install ]
[ building ] [ target/python-wheels/bookworm/redis_dump_load-1.1-py3-none-any.whl-install ]
[ finished ] [ target/debs/bookworm/libnl-3-200_3.7.0-0.2+b1sonic1_amd64.deb-install ]
[ building ] [ target/python-wheels/bookworm/sonic_yang_models-1.0-py3-none-any.whl-install ]
[ building ] [ target/debs/bookworm/libnl-3-dev_3.7.0-0.2+b1sonic1_amd64.deb-install ]
[ finished ] [ target/debs/bookworm/libnl-3-dev_3.7.0-0.2+b1sonic1_amd64.deb-install ]
[ building ] [ target/debs/bookworm/libnl-genl-3-200_3.7.0-0.2+b1sonic1_amd64.deb-install ]
[ finished ] [ target/debs/bookworm/libnl-genl-3-200_3.7.0-0.2+b1sonic1_amd64.deb-install ]
[ building ] [ target/debs/bookworm/libnl-route-3-200_3.7.0-0.2+b1sonic1_amd64.deb-install ]
[ finished ] [ target/debs/bookworm/libnl-route-3-200_3.7.0-0.2+b1sonic1_amd64.deb-install ]
[ building ] [ target/debs/bookworm/libnl-genl-3-dev_3.7.0-0.2+b1sonic1_amd64.deb-install ]
[ finished ] [ target/python-wheels/bookworm/redis_dump_load-1.1-py3-none-any.whl-install ]
[ building ] [ target/debs/bookworm/libnl-route-3-dev_3.7.0-0.2+b1sonic1_amd64.deb-install ]
[ finished ] [ target/debs/bookworm/libnl-genl-3-dev_3.7.0-0.2+b1sonic1_amd64.deb-install ]
[ building ] [ target/python-wheels/bookworm/swsssdk-2.0.1-py3-none-any.whl-install ]
[ finished ] [ target/python-wheels/bookworm/sonic_yang_models-1.0-py3-none-any.whl-install ]
[ building ] [ target/docker-config-engine-bookworm.gz-load ]
[ finished ] [ target/python-wheels/bookworm/swsssdk-2.0.1-py3-none-any.whl-install ]
[ building ] [ target/python-wheels/bookworm/sonic_yang_mgmt-1.0-py3-none-any.whl-install ]
[ finished ] [ target/python-wheels/bookworm/sonic_yang_mgmt-1.0-py3-none-any.whl-install ]
[ building ] [ target/python-wheels/bookworm/sonic_py_common-1.0-py3-none-any.whl-install ]
[ finished ] [ target/python-wheels/bookworm/sonic_py_common-1.0-py3-none-any.whl-install ]
[ building ] [ target/python-wheels/bookworm/sonic_config_engine-1.0-py3-none-any.whl-install ]
[ finished ] [ target/docker-config-engine-bookworm.gz-load ]
[ building ] [ target/docker-bmp-watchdog.gz ]
[ finished ] [ target/debs/bookworm/libyang_1.0.73_amd64.deb-install ]
[ building ] [ target/docker-gnmi-watchdog.gz ]
[ finished ] [ target/python-wheels/bookworm/sonic_config_engine-1.0-py3-none-any.whl-install ]
[ building ] [ target/docker-ptp.gz ]
[ finished ] [ target/debs/bookworm/libnl-route-3-dev_3.7.0-0.2+b1sonic1_amd64.deb-install ]
[ building ] [ target/docker-router-advertiser.gz ]
[ finished ] [ target/docker-ptp.gz ]
[ building ] [ target/docker-snmp.gz ]
[ finished ] [ target/docker-router-advertiser.gz ]
[ building ] [ target/python-wheels/bookworm/sonic_platform_common-1.0-py3-none-any.whl-install ]
[ finished ] [ target/python-wheels/bookworm/sonic_platform_common-1.0-py3-none-any.whl-install ]
[ building ] [ target/debs/bookworm/libnl-nf-3-200_3.7.0-0.2+b1sonic1_amd64.deb-install ]
[ finished ] [ target/debs/bookworm/libnl-nf-3-200_3.7.0-0.2+b1sonic1_amd64.deb-install ]
[ building ] [ target/debs/bookworm/libyang-dev_1.0.73_amd64.deb-install ]
[ finished ] [ target/debs/bookworm/libyang-dev_1.0.73_amd64.deb-install ]
[ building ] [ target/debs/bookworm/libyang-cpp_1.0.73_amd64.deb-install ]
[ finished ] [ target/debs/bookworm/libyang-cpp_1.0.73_amd64.deb-install ]
[ building ] [ target/python-wheels/bookworm/sonic_utilities-1.2-py3-none-any.whl-install ]
[ finished ] [ target/python-wheels/bookworm/sonic_utilities-1.2-py3-none-any.whl-install ]
[ building ] [ target/debs/bookworm/libnl-nf-3-dev_3.7.0-0.2+b1sonic1_amd64.deb-install ]
[ finished ] [ target/debs/bookworm/libnl-nf-3-dev_3.7.0-0.2+b1sonic1_amd64.deb-install ]
[ building ] [ target/debs/bookworm/python3-yang_1.0.73_amd64.deb-install ]
[ finished ] [ target/debs/bookworm/python3-yang_1.0.73_amd64.deb-install ]
[ building ] [ target/debs/bookworm/libnl-cli-3-200_3.7.0-0.2+b1sonic1_amd64.deb-install ]
[ finished ] [ target/debs/bookworm/libnl-cli-3-200_3.7.0-0.2+b1sonic1_amd64.deb-install ]
[ building ] [ target/debs/bookworm/libnl-cli-3-dev_3.7.0-0.2+b1sonic1_amd64.deb-install ]
[ finished ] [ target/debs/bookworm/libnl-cli-3-dev_3.7.0-0.2+b1sonic1_amd64.deb-install ]
[ building ] [ target/debs/bookworm/libswsscommon_1.0.0_amd64.deb-install ]
[ finished ] [ target/debs/bookworm/libswsscommon_1.0.0_amd64.deb-install ]
[ building ] [ target/debs/bookworm/libswsscommon-dev_1.0.0_amd64.deb-install ]
[ finished ] [ target/debs/bookworm/libswsscommon-dev_1.0.0_amd64.deb-install ]
[ building ] [ target/debs/bookworm/python3-swsscommon_1.0.0_amd64.deb-install ]
[ finished ] [ target/debs/bookworm/python3-swsscommon_1.0.0_amd64.deb-install ]
[ building ] [ target/docker-swss-layer-bookworm.gz ]
[ finished ] [ target/docker-bmp-watchdog.gz ]
[ building ] [ target/docker-sonic-gnmi.gz ]
[ finished ] [ target/docker-swss-layer-bookworm.gz ]
[ building ] [ target/docker-lldp.gz ]
[ finished ] [ target/docker-gnmi-watchdog.gz ]
[ building ] [ target/docker-mux.gz ]
[ finished ] [ target/docker-snmp.gz ]
[ building ] [ target/docker-swss-layer-bookworm.gz-load ]
[ finished ] [ target/docker-swss-layer-bookworm.gz-load ]
[ building ] [ target/docker-platform-monitor.gz ]
[ finished ] [ target/docker-sonic-gnmi.gz ]
[ building ] [ target/docker-sflow.gz ]
[ finished ] [ target/docker-lldp.gz ]
[ building ] [ target/docker-stp.gz ]
[ finished ] [ target/docker-mux.gz ]
[ building ] [ target/docker-teamd.gz ]
[ finished ] [ target/docker-sflow.gz ]
[ building ] [ target/docker-sonic-gnmi.gz-load ]
[ finished ] [ target/docker-sonic-gnmi.gz-load ]
[ building ] [ target/docker-syncd-brcm-dnx.gz ]
[ finished ] [ target/docker-teamd.gz ]
[ building ] [ target/docker-dhcp-relay.gz ]
/sonic/dockers/docker-dhcp-relay/cli-plugin-tests /sonic
[ finished ] [ target/docker-stp.gz ]
[ building ] [ target/docker-macsec.gz ]
/sonic/dockers/docker-macsec/cli-plugin-tests /sonic
/sonic
/sonic
[ finished ] [ target/docker-platform-monitor.gz ]
[ building ] [ target/python-wheels/bookworm/sonic_host_services-1.0-py3-none-any.whl ]
[ finished ] [ target/docker-syncd-brcm-dnx.gz ]
[ building ] [ target/debs/bookworm/sonic-bmp_0.1_amd64.deb-install ]
[ finished ] [ target/debs/bookworm/sonic-bmp_0.1_amd64.deb-install ]
[ building ] [ target/docker-dash-ha.gz ]
[ finished ] [ target/docker-macsec.gz ]
[ building ] [ target/docker-fpm-frr.gz ]
[ finished ] [ target/docker-dhcp-relay.gz ]
[ building ] [ target/docker-nat.gz ]
[ finished ] [ target/docker-dash-ha.gz ]
[ building ] [ target/docker-orchagent.gz ]
[ finished ] [ target/python-wheels/bookworm/sonic_host_services-1.0-py3-none-any.whl ]
[ building ] [ target/docker-sonic-telemetry.gz ]
[ finished ] [ target/docker-fpm-frr.gz ]
[ building ] [ target/docker-sonic-bmp.gz ]
[ finished ] [ target/docker-nat.gz ]
[ finished ] [ target/docker-sonic-bmp.gz ]
[ finished ] [ target/docker-orchagent.gz ]
[ finished ] [ target/docker-sonic-telemetry.gz ]
basename: missing operand
Try 'basename --help' for more information.
basename: missing operand
Try 'basename --help' for more information.
[ building ] [ target/sonic-broadcom.bin ]
[ building ] [ target/sonic-aboot-broadcom.swi ]
[ finished ] [ target/sonic-aboot-broadcom.swi ]
[ FAIL LOG START ] [ target/sonic-aboot-broadcom.swi ]
Build start time: Tue Sep 29 03:37:35 UTC 2026
++ '[' -f .arch ']'
++ cat .arch
+ CONFIGURED_ARCH=amd64
+ DOCKER_VERSION=5:24.0.2-1~debian.12~bookworm
+ CONTAINERD_IO_VERSION=1.6.21-1
+ LINUX_KERNEL_VERSION=6.1.0-29-2
+ FILESYSTEM_ROOT=./fsroot
+ PLATFORM_DIR=platform
+ HOSTNAME=sonic
+ DEFAULT_USERINFO='Default admin user,,,'
+ BUILD_TOOL_PATH=src/sonic-build-hooks/buildinfo
+ TRUSTED_GPG_DIR=src/sonic-build-hooks/buildinfo/trusted.gpg.d
+ . ./onie-image.conf
++ : 32768
++ : x86_64
++ : broadcom
++ ONIEIMAGE_VERSION=r0
++ FILESYSTEM_ROOT=./fsroot-broadcom
++ FILESYSTEM_SQUASHFS=fs.squashfs
++ INSTALLER_PAYLOAD=fs.zip
++ FILESYSTEM_DOCKERFS=dockerfs.tar.gz
++ DOCKERFS_DIR=docker
++ DOCKER_RAMFS_SIZE=3500M
++ OUTPUT_ONIE_IMAGE=target/sonic-broadcom.bin
++ OUTPUT_RAW_IMAGE=target/sonic-broadcom.raw
++ RAW_IMAGE_DISK_SIZE=1700
++ OUTPUT_KVM_IMAGE=target/sonic-broadcom.img
++ KVM_IMAGE_DISK_SIZE=16
++ OUTPUT_ABOOT_IMAGE=target/sonic-aboot-broadcom.swi
++ ABOOT_BOOT_IMAGE=.sonic-boot.swi
++ OUTPUT_KVM_4ASIC_IMAGE=target/sonic-4asic-broadcom.img
++ OUTPUT_KVM_6ASIC_IMAGE=target/sonic-6asic-broadcom.img
++ OUTPUT_DSC_IMAGE=target/sonic-broadcom.tar
+ '[' -n 32768 ']'
+ '[' -n fs.zip ']'
+ '[' -n fs.squashfs ']'
+ '[' aboot = aboot ']'
+ TARGET_BOOTLOADER=aboot
+ [[ y != y ]]
+ [[ n == y ]]
+ [[ y == y ]]
+ echo '[INFO] RFS build: second stage'
[INFO] RFS build: second stage
+ sudo mount proc /proc -t proc
+ sudo fuser -vm ./fsroot-broadcom
USER PID ACCESS COMMAND
/sonic/fsroot-broadcom:
root kernel mount /usr/sbin/docker-init
jenkins 1 ..ce. docker-init
jenkins 7 ..c.. bash
jenkins 8 ..c.. make
root 6897 ....m dockerd
root 6978 ....m containerd
jenkins 156749 ..c.. bash
jenkins 157041 ..c.. bash
jenkins 157237 ..c.. build_debian.sh
jenkins 157238 ..c.. process_log.sh
root 157254 ..c.. sudo
root 157256 F.c.. unsquashfs
jenkins 157376 ..c.. build_debian.sh
jenkins 157377 ..c.. process_log.sh
root 157385 ..c.. sudo
+ sudo rm -rf ./fsroot-broadcom
rm: cannot remove './fsroot-broadcom/usr/lib/modules/6.1.0-29-2-amd64/kernel': Directory not empty
[ FAIL LOG END ] [ target/sonic-aboot-broadcom.swi ]
make: *** [slave.mk:1435: target/sonic-aboot-broadcom.swi] Error 1
make: *** Waiting for unfinished jobs....
[ finished ] [ target/sonic-broadcom.bin ]
[ FAIL LOG START ] [ target/sonic-broadcom.bin ]
Build start time: Tue Sep 29 03:37:34 UTC 2026
++ '[' -f .arch ']'
++ cat .arch
+ CONFIGURED_ARCH=amd64
+ DOCKER_VERSION=5:24.0.2-1~debian.12~bookworm
+ CONTAINERD_IO_VERSION=1.6.21-1
+ LINUX_KERNEL_VERSION=6.1.0-29-2
+ FILESYSTEM_ROOT=./fsroot
+ PLATFORM_DIR=platform
+ HOSTNAME=sonic
+ DEFAULT_USERINFO='Default admin user,,,'
+ BUILD_TOOL_PATH=src/sonic-build-hooks/buildinfo
+ TRUSTED_GPG_DIR=src/sonic-build-hooks/buildinfo/trusted.gpg.d
+ . ./onie-image.conf
++ : 32768
++ : x86_64
++ : broadcom
++ ONIEIMAGE_VERSION=r0
++ FILESYSTEM_ROOT=./fsroot-broadcom
++ FILESYSTEM_SQUASHFS=fs.squashfs
++ INSTALLER_PAYLOAD=fs.zip
++ FILESYSTEM_DOCKERFS=dockerfs.tar.gz
++ DOCKERFS_DIR=docker
++ DOCKER_RAMFS_SIZE=3500M
++ OUTPUT_ONIE_IMAGE=target/sonic-broadcom.bin
++ OUTPUT_RAW_IMAGE=target/sonic-broadcom.raw
++ RAW_IMAGE_DISK_SIZE=1700
++ OUTPUT_KVM_IMAGE=target/sonic-broadcom.img
++ KVM_IMAGE_DISK_SIZE=16
++ OUTPUT_ABOOT_IMAGE=target/sonic-aboot-broadcom.swi
++ ABOOT_BOOT_IMAGE=.sonic-boot.swi
++ OUTPUT_KVM_4ASIC_IMAGE=target/sonic-4asic-broadcom.img
++ OUTPUT_KVM_6ASIC_IMAGE=target/sonic-6asic-broadcom.img
++ OUTPUT_DSC_IMAGE=target/sonic-broadcom.tar
+ '[' -n 32768 ']'
+ '[' -n fs.zip ']'
+ '[' -n fs.squashfs ']'
+ '[' onie = aboot ']'
+ [[ y != y ]]
+ [[ n == y ]]
+ [[ y == y ]]
+ echo '[INFO] RFS build: second stage'
[INFO] RFS build: second stage
+ sudo mount proc /proc -t proc
+ sudo fuser -vm ./fsroot-broadcom
USER PID ACCESS COMMAND
/sonic/fsroot-broadcom:
root kernel mount /usr/sbin/docker-init
jenkins 1 ..ce. docker-init
jenkins 7 ..c.. bash
jenkins 8 ..c.. make
root 6897 ....m dockerd
root 6978 ....m containerd
jenkins 156749 ..c.. bash
jenkins 157041 ..c.. bash
jenkins 157234 ..c.. j2
jenkins 157237 ..c.. build_debian.sh
jenkins 157238 ..c.. process_log.sh
root 157246 ..c.. sudo
+ sudo rm -rf ./fsroot-broadcom
+ sudo unsquashfs -d ./fsroot-broadcom target/sonic-broadcom.bin__broadcom__rfs.squashfs
Parallel unsquashfs: Using 112 processors
33651 inodes (34124 blocks) to write
[======/ ] 7571/67775 11%
[==========- ] 12604/67775 18%
[==================\ ] 20724/67775 30%
set_attributes: failed to set time on ./fsroot-broadcom/usr/lib/modules/6.1.0-29-2-amd64/kernel/drivers/soc/qcom/qmi_helpers.ko, because No such file or directory
set_attributes: failed to set time on ./fsroot-broadcom/usr/lib/modules/6.1.0-29-2-amd64/kernel/drivers/soc/qcom, because No such file or directory
set_attributes: failed to set time on ./fsroot-broadcom/usr/lib/modules/6.1.0-29-2-amd64/kernel/drivers/soc, because No such file or directory
set_attributes: failed to set time on ./fsroot-broadcom/usr/lib/modules/6.1.0-29-2-amd64/kernel/drivers/soundwire/soundwire-bus.ko, because No such file or directory
set_attributes: failed to set time on ./fsroot-broadcom/usr/lib/modules/6.1.0-29-2-amd64/kernel/drivers/soundwire/soundwire-cadence.ko, because No such file or directory
set_attributes: failed to set time on ./fsroot-broadcom/usr/lib/modules/6.1.0-29-2-amd64/kernel/drivers/soundwire/soundwire-generic-allocation.ko, because No such file or directory
set_attributes: failed to set time on ./fsroot-broadcom/usr/lib/modules/6.1.0-29-2-amd64/kernel/drivers/soundwire/soundwire-intel.ko, because No such file or directory
set_attributes: failed to set time on ./fsroot-broadcom/usr/lib/modules/6.1.0-29-2-amd64/kernel/drivers/soundwire/soundwire-qcom.ko, because No such file or directory
set_attributes: failed to set time on ./fsroot-broadcom/usr/lib/modules/6.1.0-29-2-amd64/kernel/drivers/soundwire, because No such file or directory
set_attributes: failed to set time on ./fsroot-broadcom/usr/lib/modules/6.1.0-29-2-amd64/kernel/drivers/ssb/ssb.ko, because No such file or directory
set_attributes: failed to set time on ./fsroot-broadcom/usr/lib/modules/6.1.0-29-2-amd64/kernel/drivers/ssb, because No such file or directory
set_attributes: failed to set time on ./fsroot-broadcom/usr/lib/modules/6.1.0-29-2-amd64/kernel/drivers/target/iscsi/cxgbit/cxgbit.ko, because No such file or directory
set_attributes: failed to set time on ./fsroot-broadcom/usr/lib/modules/6.1.0-29-2-amd64/kernel/drivers/target/iscsi/cxgbit, because No such file or directory
set_attributes: failed to set time on ./fsroot-broadcom/usr/lib/modules/6.1.0-29-2-amd64/kernel/drivers/target/iscsi/iscsi_target_mod.ko, because No such file or directory
set_attributes: failed to set time on ./fsroot-broadcom/usr/lib/modules/6.1.0-29-2-amd64/kernel/drivers/target/iscsi, because No such file or directory
set_attributes: failed to set time on ./fsroot-broadcom/usr/lib/modules/6.1.0-29-2-amd64/kernel/drivers/target/loopback/tcm_loop.ko, because No such file or directory
set_attributes: failed to set time on ./fsroot-broadcom/usr/lib/modules/6.1.0-29-2-amd64/kernel/drivers/target/loopback, because No such file or directory
set_attributes: failed to set time on ./fsroot-broadcom/usr/lib/modules/6.1.0-29-2-amd64/kernel/drivers/target/sbp/sbp_target.ko, because No such file or directory
set_attributes: failed to set time on ./fsroot-broadcom/usr/lib/modules/6.1.0-29-2-amd64/kernel/drivers/target/sbp, because No such file or directory
set_attributes: failed to set time on ./fsroot-broadcom/usr/lib/modules/6.1.0-29-2-amd64/kernel/drivers/target/target_core_file.ko, because No such file or directory
set_attributes: failed to set time on ./fsroot-broadcom/usr/lib/modules/6.1.0-29-2-amd64/kernel/drivers/target/target_core_iblock.ko, because No such file or directory
set_attributes: failed to set time on ./fsroot-broadcom/usr/lib/modules/6.1.0-29-2-amd64/kernel/drivers/target/target_core_mod.ko, because No such file or directory
set_attributes: failed to set time on ./fsroot-broadcom/usr/lib/modules/6.1.0-29-2-amd64/kernel/drivers/target/target_core_pscsi.ko, because No such file or directory
set_attributes: failed to set time on ./fsroot-broadcom/usr/lib/modules/6.1.0-29-2-amd64/kernel/drivers/target/target_core_user.ko, because No such file or directory
set_attributes: failed to set time on ./fsroot-broadcom/usr/lib/modules/6.1.0-29-2-amd64/kernel/drivers/target/tcm_fc/tcm_fc.ko, because No such file or directory
set_attributes: failed to set time on ./fsroot-broadcom/usr/lib/modules/6.1.0-29-2-amd64/kernel/drivers/target/tcm_fc, because No such file or directory
set_attributes: failed to set time on ./fsroot-broadcom/usr/lib/modules/6.1.0-29-2-amd64/kernel/drivers/target, because No such file or directory
set_attributes: failed to set time on ./fsroot-broadcom/usr/lib/modules/6.1.0-29-2-amd64/kernel/drivers/ufs/core/ufshcd-core.ko, because No such file or directory
set_attributes: failed to set time on ./fsroot-broadcom/usr/lib/modules/6.1.0-29-2-amd64/kernel/drivers/ufs/core, because No such file or directory
set_attributes: failed to set time on ./fsroot-broadcom/usr/lib/modules/6.1.0-29-2-amd64/kernel/drivers/ufs/host/ufshcd-pci.ko, because No such file or directory
set_attributes: failed to set time on ./fsroot-broadcom/usr/lib/modules/6.1.0-29-2-amd64/kernel/drivers/ufs/host, because No such file or directory
set_attributes: failed to set time on ./fsroot-broadcom/usr/lib/modules/6.1.0-29-2-amd64/kernel/drivers/ufs, because No such file or directory
set_attributes: failed to set time on ./fsroot-broadcom/usr/lib/modules/6.1.0-29-2-amd64/kernel/drivers/uio/uio.ko, because No such file or directory
set_attributes: failed to set time on ./fsroot-broadcom/usr/lib/modules/6.1.0-29-2-amd64/kernel/drivers/uio/uio_aec.ko, because No such file or directory
set_attributes: failed to set time on ./fsroot-broadcom/usr/lib/modules/6.1.0-29-2-amd64/kernel/drivers/uio/uio_cif.ko, because No such file or directory
set_attributes: failed to set time on ./fsroot-broadcom/usr/lib/modules/6.1.0-29-2-amd64/kernel/drivers/uio/uio_hv_generic.ko, because No such file or directory
set_attributes: failed to set time on ./fsroot-broadcom/usr/lib/modules/6.1.0-29-2-amd64/kernel/drivers/uio/uio_mf624.ko, because No such file or directory
set_attributes: failed to set time on ./fsroot-broadcom/usr/lib/modules/6.1.0-29-2-amd64/kernel/drivers/uio/uio_netx.ko, because No such file or directory
set_attributes: failed to set time on ./fsroot-broadcom/usr/lib/modules/6.1.0-29-2-amd64/kernel/drivers/uio/uio_pci_generic.ko, because No such file or directory
set_attributes: failed to set time on ./fsroot-broadcom/usr/lib/modules/6.1.0-29-2-amd64/kernel/drivers/uio/uio_sercos3.ko, because No such file or directory
set_attributes: failed to set time on ./fsroot-broadcom/usr/lib/modules/6.1.0-29-2-amd64/kernel/drivers/uio, because No such file or directory
set_attributes: failed to set time on ./fsroot-broadcom/usr/lib/modules/6.1.0-29-2-amd64/kernel/drivers/w1/masters/ds2482.ko, because No such file or directory
set_attributes: failed to set time on ./fsroot-broadcom/usr/lib/modules/6.1.0-29-2-amd64/kernel/drivers/w1/masters/ds2490.ko, because No such file or directory
set_attributes: failed to set time on ./fsroot-broadcom/usr/lib/modules/6.1.0-29-2-amd64/kernel/drivers/w1/masters/w1-gpio.ko, because No such file or directory
set_attributes: failed to set time on ./fsroot-broadcom/usr/lib/modules/6.1.0-29-2-amd64/kernel/drivers/w1/masters, because No such file or directory
set_attributes: failed to set time on ./fsroot-broadcom/usr/lib/modules/6.1.0-29-2-amd64/kernel/drivers/w1/slaves/w1_ds2405.ko, because No such file or directory
set_attributes: failed to set time on ./fsroot-broadcom/usr/lib/modules/6.1.0-29-2-amd64/kernel/drivers/w1/slaves/w1_ds2406.ko, because No such file or directory
set_attributes: failed to set time on ./fsroot-broadcom/usr/lib/modules/6.1.0-29-2-amd64/kernel/drivers/w1/slaves/w1_ds2408.ko, because No such file or directory
set_attributes: failed to set time on ./fsroot-broadcom/usr/lib/modules/6.1.0-29-2-amd64/kernel/drivers/w1/slaves/w1_ds2413.ko, because No such file or directory
set_attributes: failed to set time on ./fsroot-broadcom/usr/lib/modules/6.1.0-29-2-amd64/kernel/drivers/w1/slaves/w1_ds2423.ko, because No such file or directory
set_attributes: failed to set time on ./fsroot-broadcom/usr/lib/modules/6.1.0-29-2-amd64/kernel/drivers/w1/slaves/w1_ds2431.ko, because No such file or directory
set_attributes: failed to set time on ./fsroot-broadcom/usr/lib/modules/6.1.0-29-2-amd64/kernel/drivers/w1/slaves/w1_ds2433.ko, because No such file or directory
set_attributes: failed to set time on ./fsroot-broadcom/usr/lib/modules/6.1.0-29-2-amd64/kernel/drivers/w1/slaves/w1_ds2438.ko, because No such file or directory
set_attributes: failed to set time on ./fsroot-broadcom/usr/lib/modules/6.1.0-29-2-amd64/kernel/drivers/w1/slaves/w1_ds2780.ko, because No such file or directory
set_attributes: failed to set time on ./fsroot-broadcom/usr/lib/modules/6.1.0-29-2-amd64/kernel/drivers/w1/slaves/w1_ds2781.ko, because No such file or directory
set_attributes: failed to set time on ./fsroot-broadcom/usr/lib/modules/6.1.0-29-2-amd64/kernel/drivers/w1/slaves/w1_ds2805.ko, because No such file or directory
set_attributes: failed to set time on ./fsroot-broadcom/usr/lib/modules/6.1.0-29-2-amd64/kernel/drivers/w1/slaves/w1_ds28e04.ko, because No such file or directory
set_attributes: failed to set time on ./fsroot-broadcom/usr/lib/modules/6.1.0-29-2-amd64/kernel/drivers/w1/slaves/w1_ds28e17.ko, because No such file or directory
set_attributes: failed to set time on ./fsroot-broadcom/usr/lib/modules/6.1.0-29-2-amd64/kernel/drivers/w1/slaves/w1_smem.ko, because No such file or directory
set_attributes: failed to set time on ./fsroot-broadcom/usr/lib/modules/6.1.0-29-2-amd64/kernel/drivers/w1/slaves/w1_therm.ko, because No such file or directory
set_attributes: failed to set time on ./fsroot-broadcom/usr/lib/modules/6.1.0-29-2-amd64/kernel/drivers/w1/slaves, because No such file or directory
set_attributes: failed to set time on ./fsroot-broadcom/usr/lib/modules/6.1.0-29-2-amd64/kernel/drivers/w1/wire.ko, because No such file or directory
set_attributes: failed to set time on ./fsroot-broadcom/usr/lib/modules/6.1.0-29-2-amd64/kernel/drivers/w1, because No such file or directory
set_attributes: failed to set time on ./fsroot-broadcom/usr/lib/modules/6.1.0-29-2-amd64/kernel/fs/9p/9p.ko, because No such file or directory
set_attributes: failed to set time on ./fsroot-broadcom/usr/lib/modules/6.1.0-29-2-amd64/kernel/fs/9p, because No such file or directory
set_attributes: failed to set time on ./fsroot-broadcom/usr/lib/modules/6.1.0-29-2-amd64/kernel/fs/adfs/adfs.ko, because No such file or directory
set_attributes: failed to set time on ./fsroot-broadcom/usr/lib/modules/6.1.0-29-2-amd64/kernel/fs/adfs, because No such file or directory
set_attributes: failed to set time on ./fsroot-broadcom/usr/lib/modules/6.1.0-29-2-amd64/kernel/fs/affs/affs.ko, because No such file or directory
set_attributes: failed to set time on ./fsroot-broadcom/usr/lib/modules/6.1.0-29-2-amd64/kernel/fs/affs, because No such file or directory
set_attributes: failed to set time on ./fsroot-broadcom/usr/lib/modules/6.1.0-29-2-amd64/kernel/fs/afs/kafs.ko, because No such file or directory
set_attributes: failed to set time on ./fsroot-broadcom/usr/lib/modules/6.1.0-29-2-amd64/kernel/fs/afs, because No such file or directory
set_attributes: failed to set time on ./fsroot-broadcom/usr/lib/modules/6.1.0-29-2-amd64/kernel/fs/autofs/autofs4.ko, because No such file or directory
set_attributes: failed to set time on ./fsroot-broadcom/usr/lib/modules/6.1.0-29-2-amd64/kernel/fs/autofs, because No such file or directory
set_attributes: failed to set time on ./fsroot-broadcom/usr/lib/modules/6.1.0-29-2-amd64/kernel/fs/befs/befs.ko, because No such file or directory
set_attributes: failed to set time on ./fsroot-broadcom/usr/lib/modules/6.1.0-29-2-amd64/kernel/fs/befs, because No such file or directory
set_attributes: failed to set time on ./fsroot-broadcom/usr/lib/modules/6.1.0-29-2-amd64/kernel/fs/bfs/bfs.ko, because No such file or directory
set_attributes: failed to set time on ./fsroot-broadcom/usr/lib/modules/6.1.0-29-2-amd64/kernel/fs/bfs, because No such file or directory
set_attributes: failed to set time on ./fsroot-broadcom/usr/lib/modules/6.1.0-29-2-amd64/kernel/fs/binfmt_misc.ko, because No such file or directory
set_attributes: failed to set time on ./fsroot-broadcom/usr/lib/modules/6.1.0-29-2-amd64/kernel/fs/btrfs/btrfs.ko, because No such file or directory
set_attributes: failed to set time on ./fsroot-broadcom/usr/lib/modules/6.1.0-29-2-amd64/kernel/fs/btrfs, because No such file or directory
set_attributes: failed to set time on ./fsroot-broadcom/usr/lib/modules/6.1.0-29-2-amd64/kernel/fs/cachefiles/cachefiles.ko, because No such file or directory
set_attributes: failed to set time on ./fsroot-broadcom/usr/lib/modules/6.1.0-29-2-amd64/kernel/fs/cachefiles, because No such file or directory
set_attributes: failed to set time on ./fsroot-broadcom/usr/lib/modules/6.1.0-29-2-amd64/kernel/fs/ceph/ceph.ko, because No such file or directory
set_attributes: failed to set time on ./fsroot-broadcom/usr/lib/modules/6.1.0-29-2-amd64/kernel/fs/ceph, because No such file or directory
set_attributes: failed to set time on ./fsroot-broadcom/usr/lib/modules/6.1.0-29-2-amd64/kernel/fs/coda/coda.ko, because No such file or directory
set_attributes: failed to set time on ./fsroot-broadcom/usr/lib/modules/6.1.0-29-2-amd64/kernel/fs/coda, because No such file or directory
set_attributes: failed to set time on ./fsroot-broadcom/usr/lib/modules/6.1.0-29-2-amd64/kernel/fs/configfs/configfs.ko, because No such file or directory
set_attributes: failed to set time on ./fsroot-broadcom/usr/lib/modules/6.1.0-29-2-amd64/kernel/fs/configfs, because No such file or directory
set_attributes: failed to set time on ./fsroot-broadcom/usr/lib/modules/6.1.0-29-2-amd64/kernel/fs/dlm/dlm.ko, because No such file or directory
set_attributes: failed to set time on ./fsroot-broadcom/usr/lib/modules/6.1.0-29-2-amd64/kernel/fs/dlm, because No such file or directory
set_attributes: failed to set time on ./fsroot-broadcom/usr/lib/modules/6.1.0-29-2-amd64/kernel/fs/ecryptfs/ecryptfs.ko, because No such file or directory
set_attributes: failed to set time on ./fsroot-broadcom/usr/lib/modules/6.1.0-29-2-amd64/kernel/fs/ecryptfs, because No such file or directory
set_attributes: failed to set time on ./fsroot-broadcom/usr/lib/modules/6.1.0-29-2-amd64/kernel/fs/efivarfs/efivarfs.ko, because No such file or directory
set_attributes: failed to set time on ./fsroot-broadcom/usr/lib/modules/6.1.0-29-2-amd64/kernel/fs/efivarfs, because No such file or directory
set_attributes: failed to set time on ./fsroot-broadcom/usr/lib/modules/6.1.0-29-2-amd64/kernel/fs/efs/efs.ko, because No such file or directory
set_attributes: failed to set time on ./fsroot-broadcom/usr/lib/modules/6.1.0-29-2-amd64/kernel/fs/efs, because No such file or directory
set_attributes: failed to set time on ./fsroot-broadcom/usr/lib/modules/6.1.0-29-2-amd64/kernel/fs/erofs/erofs.ko, because No such file or directory
set_attributes: failed to set time on ./fsroot-broadcom/usr/lib/modules/6.1.0-29-2-amd64/kernel/fs/erofs, because No such file or directory
set_attributes: failed to set time on ./fsroot-broadcom/usr/lib/modules/6.1.0-29-2-amd64/kernel/fs/exfat/exfat.ko, because No such file or directory
set_attributes: failed to set time on ./fsroot-broadcom/usr/lib/modules/6.1.0-29-2-amd64/kernel/fs/exfat, because No such file or directory
set_attributes: failed to set time on ./fsroot-broadcom/usr/lib/modules/6.1.0-29-2-amd64/kernel/fs/ext4/ext4.ko, because No such file or directory
set_attributes: failed to set time on ./fsroot-broadcom/usr/lib/modules/6.1.0-29-2-amd64/kernel/fs/ext4, because No such file or directory
set_attributes: failed to set time on ./fsroot-broadcom/usr/lib/modules/6.1.0-29-2-amd64/kernel/fs/f2fs/f2fs.ko, because No such file or directory
set_attributes: failed to set time on ./fsroot-broadcom/usr/lib/modules/6.1.0-29-2-amd64/kernel/fs/f2fs, because No such file or directory
set_attributes: failed to set time on ./fsroot-broadcom/usr/lib/modules/6.1.0-29-2-amd64/kernel/fs/fat/fat.ko, because No such file or directory
set_attributes: failed to set time on ./fsroot-broadcom/usr/lib/modules/6.1.0-29-2-amd64/kernel/fs/fat/msdos.ko, because No such file or directory
set_attributes: failed to set time on ./fsroot-broadcom/usr/lib/modules/6.1.0-29-2-amd64/kernel/fs/fat/vfat.ko, because No such file or directory
set_attributes: failed to set time on ./fsroot-broadcom/usr/lib/modules/6.1.0-29-2-amd64/kernel/fs/fat, because No such file or directory
set_attributes: failed to set time on ./fsroot-broadcom/usr/lib/modules/6.1.0-29-2-amd64/kernel/fs/freevxfs/freevxfs.ko, because No such file or directory
set_attributes: failed to set time on ./fsroot-broadcom/usr/lib/modules/6.1.0-29-2-amd64/kernel/fs/freevxfs, because No such file or directory
set_attributes: failed to set time on ./fsroot-broadcom/usr/lib/modules/6.1.0-29-2-amd64/kernel/fs/fscache/fscache.ko, because No such file or directory
set_attributes: failed to set time on ./fsroot-broadcom/usr/lib/modules/6.1.0-29-2-amd64/kernel/fs/fscache, because No such file or directory
set_attributes: failed to set time on ./fsroot-broadcom/usr/lib/modules/6.1.0-29-2-amd64/kernel/fs/fuse/cuse.ko, because No such file or directory
set_attributes: failed to set time on ./fsroot-broadcom/usr/lib/modules/6.1.0-29-2-amd64/kernel/fs/fuse/fuse.ko, because No such file or directory
set_attributes: failed to set time on ./fsroot-broadcom/usr/lib/modules/6.1.0-29-2-amd64/kernel/fs/fuse/virtiofs.ko, because No such file or directory
set_attributes: failed to set time on ./fsroot-broadcom/usr/lib/modules/6.1.0-29-2-amd64/kernel/fs/fuse, because No such file or directory
set_attributes: failed to set time on ./fsroot-broadcom/usr/lib/modules/6.1.0-29-2-amd64/kernel/fs/gfs2/gfs2.ko, because No such file or directory
set_attributes: failed to set time on ./fsroot-broadcom/usr/lib/modules/6.1.0-29-2-amd64/kernel/fs/gfs2, because No such file or directory
set_attributes: failed to set time on ./fsroot-broadcom/usr/lib/modules/6.1.0-29-2-amd64/kernel/fs/hfs/hfs.ko, because No such file or directory
set_attributes: failed to set time on ./fsroot-broadcom/usr/lib/modules/6.1.0-29-2-amd64/kernel/fs/hfs, because No such file or directory
set_attributes: failed to set time on ./fsroot-broadcom/usr/lib/modules/6.1.0-29-2-amd64/kernel/fs/hfsplus/hfsplus.ko, because No such file or directory
set_attributes: failed to set time on ./fsroot-broadcom/usr/lib/modules/6.1.0-29-2-amd64/kernel/fs/hfsplus, because No such file or directory
set_attributes: failed to set time on ./fsroot-broadcom/usr/lib/modules/6.1.0-29-2-amd64/kernel/fs/hpfs/hpfs.ko, because No such file or directory
set_attributes: failed to set time on ./fsroot-broadcom/usr/lib/modules/6.1.0-29-2-amd64/kernel/fs/hpfs, because No such file or directory
set_attributes: failed to set time on ./fsroot-broadcom/usr/lib/modules/6.1.0-29-2-amd64/kernel/fs/isofs/isofs.ko, because No such file or directory
set_attributes: failed to set time on ./fsroot-broadcom/usr/lib/modules/6.1.0-29-2-amd64/kernel/fs/isofs, because No such file or directory
set_attributes: failed to set time on ./fsroot-broadcom/usr/lib/modules/6.1.0-29-2-amd64/kernel/fs/jbd2/jbd2.ko, because No such file or directory
set_attributes: failed to set time on ./fsroot-broadcom/usr/lib/modules/6.1.0-29-2-amd64/kernel/fs/jbd2, because No such file or directory
set_attributes: failed to set time on ./fsroot-broadcom/usr/lib/modules/6.1.0-29-2-amd64/kernel/fs/jffs2/jffs2.ko, because No such file or directory
set_attributes: failed to set time on ./fsroot-broadcom/usr/lib/modules/6.1.0-29-2-amd64/kernel/fs/jffs2, because No such file or directory
set_attributes: failed to set time on ./fsroot-broadcom/usr/lib/modules/6.1.0-29-2-amd64/kernel/fs/jfs/jfs.ko, because No such file or directory
set_attributes: failed to set time on ./fsroot-broadcom/usr/lib/modules/6.1.0-29-2-amd64/kernel/fs/jfs, because No such file or directory
set_attributes: failed to set time on ./fsroot-broadcom/usr/lib/modules/6.1.0-29-2-amd64/kernel/fs/lockd/lockd.ko, because No such file or directory
set_attributes: failed to set time on ./fsroot-broadcom/usr/lib/modules/6.1.0-29-2-amd64/kernel/fs/lockd, because No such file or directory
set_attributes: failed to set time on ./fsroot-broadcom/usr/lib/modules/6.1.0-29-2-amd64/kernel/fs/mbcache.ko, because No such file or directory
set_attributes: failed to set time on ./fsroot-broadcom/usr/lib/modules/6.1.0-29-2-amd64/kernel/fs/minix/minix.ko, because No such file or directory
set_attributes: failed to set time on ./fsroot-broadcom/usr/lib/modules/6.1.0-29-2-amd64/kernel/fs/minix, because No such file or directory
set_attributes: failed to set time on ./fsroot-broadcom/usr/lib/modules/6.1.0-29-2-amd64/kernel/fs/netfs/netfs.ko, because No such file or directory
set_attributes: failed to set time on ./fsroot-broadcom/usr/lib/modules/6.1.0-29-2-amd64/kernel/fs/netfs, because No such file or directory
set_attributes: failed to set time on ./fsroot-broadcom/usr/lib/modules/6.1.0-29-2-amd64/kernel/fs/nfs/blocklayout/blocklayoutdriver.ko, because No such file or directory
set_attributes: failed to set time on ./fsroot-broadcom/usr/lib/modules/6.1.0-29-2-amd64/kernel/fs/nfs/blocklayout, because No such file or directory
set_attributes: failed to set time on ./fsroot-broadcom/usr/lib/modules/6.1.0-29-2-amd64/kernel/fs/nfs/filelayout/nfs_layout_nfsv41_files.ko, because No such file or directory
set_attributes: failed to set time on ./fsroot-broadcom/usr/lib/modules/6.1.0-29-2-amd64/kernel/fs/nfs/filelayout, because No such file or directory
set_attributes: failed to set time on ./fsroot-broadcom/usr/lib/modules/6.1.0-29-2-amd64/kernel/fs/nfs/flexfilelayout/nfs_layout_flexfiles.ko, because No such file or directory
set_attributes: failed to set time on ./fsroot-broadcom/usr/lib/modules/6.1.0-29-2-amd64/kernel/fs/nfs/flexfilelayout, because No such file or directory
set_attributes: failed to set time on ./fsroot-broadcom/usr/lib/modules/6.1.0-29-2-amd64/kernel/fs/nfs/nfs.ko, because No such file or directory
set_attributes: failed to set time on ./fsroot-broadcom/usr/lib/modules/6.1.0-29-2-amd64/kernel/fs/nfs/nfsv2.ko, because No such file or directory
set_attributes: failed to set time on ./fsroot-broadcom/usr/lib/modules/6.1.0-29-2-amd64/kernel/fs/nfs/nfsv3.ko, because No such file or directory
set_attributes: failed to set time on ./fsroot-broadcom/usr/lib/modules/6.1.0-29-2-amd64/kernel/fs/nfs/nfsv4.ko, because No such file or directory
set_attributes: failed to set time on ./fsroot-broadcom/usr/lib/modules/6.1.0-29-2-amd64/kernel/fs/nfs, because No such file or directory
set_attributes: failed to set time on ./fsroot-broadcom/usr/lib/modules/6.1.0-29-2-amd64/kernel/fs/nfs_common/grace.ko, because No such file or directory
set_attributes: failed to set time on ./fsroot-broadcom/usr/lib/modules/6.1.0-29-2-amd64/kernel/fs/nfs_common/nfs_acl.ko, because No such file or directory
set_attributes: failed to set time on ./fsroot-broadcom/usr/lib/modules/6.1.0-29-2-amd64/kernel/fs/nfs_common, because No such file or directory
set_attributes: failed to set time on ./fsroot-broadcom/usr/lib/modules/6.1.0-29-2-amd64/kernel/fs/nfsd/nfsd.ko, because No such file or directory
set_attributes: failed to set time on ./fsroot-broadcom/usr/lib/modules/6.1.0-29-2-amd64/kernel/fs/nfsd, because No such file or directory
set_attributes: failed to set time on ./fsroot-broadcom/usr/lib/modules/6.1.0-29-2-amd64/kernel/fs/nilfs2/nilfs2.ko, because No such file or directory
set_attributes: failed to set time on ./fsroot-broadcom/usr/lib/modules/6.1.0-29-2-amd64/kernel/fs/nilfs2, because No such file or directory
set_attributes: failed to set time on ./fsroot-broadcom/usr/lib/modules/6.1.0-29-2-amd64/kernel/fs/nls/mac-celtic.ko, because No such file or directory
set_attributes: failed to set time on ./fsroot-broadcom/usr/lib/modules/6.1.0-29-2-amd64/kernel/fs/nls/mac-centeuro.ko, because No such file or directory
set_attributes: failed to set time on ./fsroot-broadcom/usr/lib/modules/6.1.0-29-2-amd64/kernel/fs/nls/mac-croatian.ko, because No such file or directory
set_attributes: failed to set time on ./fsroot-broadcom/usr/lib/modules/6.1.0-29-2-amd64/kernel/fs/nls/mac-cyrillic.ko, because No such file or directory
set_attributes: failed to set time on ./fsroot-broadcom/usr/lib/modules/6.1.0-29-2-amd64/kernel/fs/nls/mac-gaelic.ko, because No such file or directory
set_attributes: failed to set time on ./fsroot-broadcom/usr/lib/modules/6.1.0-29-2-amd64/kernel/fs/nls/mac-greek.ko, because No such file or directory
set_attributes: failed to set time on ./fsroot-broadcom/usr/lib/modules/6.1.0-29-2-amd64/kernel/fs/nls/mac-iceland.ko, because No such file or directory
set_attributes: failed to set time on ./fsroot-broadcom/usr/lib/modules/6.1.0-29-2-amd64/kernel/fs/nls/mac-inuit.ko, because No such file or directory
set_attributes: failed to set time on ./fsroot-broadcom/usr/lib/modules/6.1.0-29-2-amd64/kernel/fs/nls/mac-roman.ko, because No such file or directory
set_attributes: failed to set time on ./fsroot-broadcom/usr/lib/modules/6.1.0-29-2-amd64/kernel/fs/nls/mac-romanian.ko, because No such file or directory
set_attributes: failed to set time on ./fsroot-broadcom/usr/lib/modules/6.1.0-29-2-amd64/kernel/fs/nls/mac-turkish.ko, because No such file or directory
set_attributes: failed to set time on ./fsroot-broadcom/usr/lib/modules/6.1.0-29-2-amd64/kernel/fs/nls/nls_ascii.ko, because No such file or directory
set_attributes: failed to set time on ./fsroot-broadcom/usr/lib/modules/6.1.0-29-2-amd64/kernel/fs/nls/nls_cp1250.ko, because No such file or directory
set_attributes: failed to set time on ./fsroot-broadcom/usr/lib/modules/6.1.0-29-2-amd64/kernel/fs/nls/nls_cp1251.ko, because No such file or directory
set_attributes: failed to set time on ./fsroot-broadcom/usr/lib/modules/6.1.0-29-2-amd64/kernel/fs/nls/nls_cp1255.ko, because No such file or directory
set_attributes: failed to set time on ./fsroot-broadcom/usr/lib/modules/6.1.0-29-2-amd64/kernel/fs/nls/nls_cp437.ko, because No such file or directory
set_attributes: failed to set time on ./fsroot-broadcom/usr/lib/modules/6.1.0-29-2-amd64/kernel/fs/nls/nls_cp737.ko, because No such file or directory
set_attributes: failed to set time on ./fsroot-broadcom/usr/lib/modules/6.1.0-29-2-amd64/kernel/fs/nls/nls_cp775.ko, because No such file or directory
set_attributes: failed to set time on ./fsroot-broadcom/usr/lib/modules/6.1.0-29-2-amd64/kernel/fs/nls/nls_cp850.ko, because No such file or directory
set_attributes: failed to set time on ./fsroot-broadcom/usr/lib/modules/6.1.0-29-2-amd64/kernel/fs/nls/nls_cp852.ko, because No such file or directory
set_attributes: failed to set time on ./fsroot-broadcom/usr/lib/modules/6.1.0-29-2-amd64/kernel/fs/nls/nls_cp855.ko, because No such file or directory
set_attributes: failed to set time on ./fsroot-broadcom/usr/lib/modules/6.1.0-29-2-amd64/kernel/fs/nls/nls_cp857.ko, because No such file or directory
set_attributes: failed to set time on ./fsroot-broadcom/usr/lib/modules/6.1.0-29-2-amd64/kernel/fs/nls/nls_cp860.ko, because No such file or directory
set_attributes: failed to set time on ./fsroot-broadcom/usr/lib/modules/6.1.0-29-2-amd64/kernel/fs/nls/nls_cp861.ko, because No such file or directory
set_attributes: failed to set time on ./fsroot-broadcom/usr/lib/modules/6.1.0-29-2-amd64/kernel/fs/nls/nls_cp862.ko, because No such file or directory
set_attributes: failed to set time on ./fsroot-broadcom/usr/lib/modules/6.1.0-29-2-amd64/kernel/fs/nls/nls_cp863.ko, because No such file or directory
set_attributes: failed to set time on ./fsroot-broadcom/usr/lib/modules/6.1.0-29-2-amd64/kernel/fs/nls/nls_cp864.ko, because No such file or directory
set_attributes: failed to set time on ./fsroot-broadcom/usr/lib/modules/6.1.0-29-2-amd64/kernel/fs/nls/nls_cp865.ko, because No such file or directory
set_attributes: failed to set time on ./fsroot-broadcom/usr/lib/modules/6.1.0-29-2-amd64/kernel/fs/nls/nls_cp866.ko, because No such file or directory
set_attributes: failed to set time on ./fsroot-broadcom/usr/lib/modules/6.1.0-29-2-amd64/kernel/fs/nls/nls_cp869.ko, because No such file or directory
set_attributes: failed to set time on ./fsroot-broadcom/usr/lib/modules/6.1.0-29-2-amd64/kernel/fs/nls/nls_cp874.ko, because No such file or directory
set_attributes: failed to set time on ./fsroot-broadcom/usr/lib/modules/6.1.0-29-2-amd64/kernel/fs/nls/nls_cp932.ko, because No such file or directory
set_attributes: failed to set time on ./fsroot-broadcom/usr/lib/modules/6.1.0-29-2-amd64/kernel/fs/nls/nls_cp936.ko, because No such file or directory
set_attributes: failed to set time on ./fsroot-broadcom/usr/lib/modules/6.1.0-29-2-amd64/kernel/fs/nls/nls_cp949.ko, because No such file or directory
set_attributes: failed to set time on ./fsroot-broadcom/usr/lib/modules/6.1.0-29-2-amd64/kernel/fs/nls/nls_cp950.ko, because No such file or directory
set_attributes: failed to set time on ./fsroot-broadcom/usr/lib/modules/6.1.0-29-2-amd64/kernel/fs/nls/nls_euc-jp.ko, because No such file or directory
set_attributes: failed to set time on ./fsroot-broadcom/usr/lib/modules/6.1.0-29-2-amd64/kernel/fs/nls/nls_iso8859-1.ko, because No such file or directory
set_attributes: failed to set time on ./fsroot-broadcom/usr/lib/modules/6.1.0-29-2-amd64/kernel/fs/nls/nls_iso8859-13.ko, because No such file or directory
set_attributes: failed to set time on ./fsroot-broadcom/usr/lib/modules/6.1.0-29-2-amd64/kernel/fs/nls/nls_iso8859-14.ko, because No such file or directory
set_attributes: failed to set time on ./fsroot-broadcom/usr/lib/modules/6.1.0-29-2-amd64/kernel/fs/nls/nls_iso8859-15.ko, because No such file or directory
set_attributes: failed to set time on ./fsroot-broadcom/usr/lib/modules/6.1.0-29-2-amd64/kernel/fs/nls/nls_iso8859-2.ko, because No such file or directory
set_attributes: failed to set time on ./fsroot-broadcom/usr/lib/modules/6.1.0-29-2-amd64/kernel/fs/nls/nls_iso8859-3.ko, because No such file or directory
set_attributes: failed to set time on ./fsroot-broadcom/usr/lib/modules/6.1.0-29-2-amd64/kernel/fs/nls/nls_iso8859-4.ko, because No such file or directory
set_attributes: failed to set time on ./fsroot-broadcom/usr/lib/modules/6.1.0-29-2-amd64/kernel/fs/nls/nls_iso8859-5.ko, because No such file or directory
set_attributes: failed to set time on ./fsroot-broadcom/usr/lib/modules/6.1.0-29-2-amd64/kernel/fs/nls/nls_iso8859-6.ko, because No such file or directory
set_attributes: failed to set time on ./fsroot-broadcom/usr/lib/modules/6.1.0-29-2-amd64/kernel/fs/nls/nls_iso8859-7.ko, because No such file or directory
set_attributes: failed to set time on ./fsroot-broadcom/usr/lib/modules/6.1.0-29-2-amd64/kernel/fs/nls/nls_iso8859-9.ko, because No such file or directory
set_attributes: failed to set time on ./fsroot-broadcom/usr/lib/modules/6.1.0-29-2-amd64/kernel/fs/nls/nls_koi8-r.ko, because No such file or directory
set_attributes: failed to set time on ./fsroot-broadcom/usr/lib/modules/6.1.0-29-2-amd64/kernel/fs/nls/nls_koi8-ru.ko, because No such file or directory
set_attributes: failed to set time on ./fsroot-broadcom/usr/lib/modules/6.1.0-29-2-amd64/kernel/fs/nls/nls_koi8-u.ko, because No such file or directory
set_attributes: failed to set time on ./fsroot-broadcom/usr/lib/modules/6.1.0-29-2-amd64/kernel/fs/nls/nls_utf8.ko, because No such file or directory
set_attributes: failed to set time on ./fsroot-broadcom/usr/lib/modules/6.1.0-29-2-amd64/kernel/fs/nls, because No such file or directory
set_attributes: failed to set time on ./fsroot-broadcom/usr/lib/modules/6.1.0-29-2-amd64/kernel/fs/ocfs2/cluster/ocfs2_nodemanager.ko, because No such file or directory
set_attributes: failed to set time on ./fsroot-broadcom/usr/lib/modules/6.1.0-29-2-amd64/kernel/fs/ocfs2/cluster, because No such file or directory
set_attributes: failed to set time on ./fsroot-broadcom/usr/lib/modules/6.1.0-29-2-amd64/kernel/fs/ocfs2/dlm/ocfs2_dlm.ko, because No such file or directory
set_attributes: failed to set time on ./fsroot-broadcom/usr/lib/modules/6.1.0-29-2-amd64/kernel/fs/ocfs2/dlm, because No such file or directory
set_attributes: failed to set time on ./fsroot-broadcom/usr/lib/modules/6.1.0-29-2-amd64/kernel/fs/ocfs2/dlmfs/ocfs2_dlmfs.ko, because No such file or directory
set_attributes: failed to set time on ./fsroot-broadcom/usr/lib/modules/6.1.0-29-2-amd64/kernel/fs/ocfs2/dlmfs, because No such file or directory
set_attributes: failed to set time on ./fsroot-broadcom/usr/lib/modules/6.1.0-29-2-amd64/kernel/fs/ocfs2/ocfs2.ko, because No such file or directory
set_attributes: failed to set time on ./fsroot-broadcom/usr/lib/modules/6.1.0-29-2-amd64/kernel/fs/ocfs2/ocfs2_stack_o2cb.ko, because No such file or directory
set_attributes: failed to set time on ./fsroot-broadcom/usr/lib/modules/6.1.0-29-2-amd64/kernel/fs/ocfs2/ocfs2_stack_user.ko, because No such file or directory
set_attributes: failed to set time on ./fsroot-broadcom/usr/lib/modules/6.1.0-29-2-amd64/kernel/fs/ocfs2/ocfs2_stackglue.ko, because No such file or directory
set_attributes: failed to set time on ./fsroot-broadcom/usr/lib/modules/6.1.0-29-2-amd64/kernel/fs/ocfs2, because No such file or directory
set_attributes: failed to set time on ./fsroot-broadcom/usr/lib/modules/6.1.0-29-2-amd64/kernel/fs/omfs/omfs.ko, because No such file or directory
set_attributes: failed to set time on ./fsroot-broadcom/usr/lib/modules/6.1.0-29-2-amd64/kernel/fs/omfs, because No such file or directory
set_attributes: failed to set time on ./fsroot-broadcom/usr/lib/modules/6.1.0-29-2-amd64/kernel/fs/orangefs/orangefs.ko, because No such file or directory
set_attributes: failed to set time on ./fsroot-broadcom/usr/lib/modules/6.1.0-29-2-amd64/kernel/fs/orangefs, because No such file or directory
set_attributes: failed to set time on ./fsroot-broadcom/usr/lib/modules/6.1.0-29-2-amd64/kernel/fs/overlayfs/overlay.ko, because No such file or directory
set_attributes: failed to set time on ./fsroot-broadcom/usr/lib/modules/6.1.0-29-2-amd64/kernel/fs/overlayfs, because No such file or directory
set_attributes: failed to set time on ./fsroot-broadcom/usr/lib/modules/6.1.0-29-2-amd64/kernel/fs/pstore/pstore_blk.ko, because No such file or directory
set_attributes: failed to set time on ./fsroot-broadcom/usr/lib/modules/6.1.0-29-2-amd64/kernel/fs/pstore/pstore_zone.ko, because No such file or directory
set_attributes: failed to set time on ./fsroot-broadcom/usr/lib/modules/6.1.0-29-2-amd64/kernel/fs/pstore/ramoops.ko, because No such file or directory
set_attributes: failed to set time on ./fsroot-broadcom/usr/lib/modules/6.1.0-29-2-amd64/kernel/fs/pstore, because No such file or directory
set_attributes: failed to set time on ./fsroot-broadcom/usr/lib/modules/6.1.0-29-2-amd64/kernel/fs/qnx4/qnx4.ko, because No such file or directory
set_attributes: failed to set time on ./fsroot-broadcom/usr/lib/modules/6.1.0-29-2-amd64/kernel/fs/qnx4, because No such file or directory
set_attributes: failed to set time on ./fsroot-broadcom/usr/lib/modules/6.1.0-29-2-amd64/kernel/fs/qnx6/qnx6.ko, because No such file or directory
set_attributes: failed to set time on ./fsroot-broadcom/usr/lib/modules/6.1.0-29-2-amd64/kernel/fs/qnx6, because No such file or directory
set_attributes: failed to set time on ./fsroot-broadcom/usr/lib/modules/6.1.0-29-2-amd64/kernel/fs/quota/quota_tree.ko, because No such file or directory
set_attributes: failed to set time on ./fsroot-broadcom/usr/lib/modules/6.1.0-29-2-amd64/kernel/fs/quota/quota_v1.ko, because No such file or directory
set_attributes: failed to set time on ./fsroot-broadcom/usr/lib/modules/6.1.0-29-2-amd64/kernel/fs/quota/quota_v2.ko, because No such file or directory
set_attributes: failed to set time on ./fsroot-broadcom/usr/lib/modules/6.1.0-29-2-amd64/kernel/fs/quota, because No such file or directory
set_attributes: failed to set time on ./fsroot-broadcom/usr/lib/modules/6.1.0-29-2-amd64/kernel/fs/reiserfs/reiserfs.ko, because No such file or directory
set_attributes: failed to set time on ./fsroot-broadcom/usr/lib/modules/6.1.0-29-2-amd64/kernel/fs/reiserfs, because No such file or directory
set_attributes: failed to set time on ./fsroot-broadcom/usr/lib/modules/6.1.0-29-2-amd64/kernel/fs/romfs/romfs.ko, because No such file or directory
set_attributes: failed to set time on ./fsroot-broadcom/usr/lib/modules/6.1.0-29-2-amd64/kernel/fs/romfs, because No such file or directory
set_attributes: failed to set time on ./fsroot-broadcom/usr/lib/modules/6.1.0-29-2-amd64/kernel/fs/smb/client/cifs.ko, because No such file or directory
set_attributes: failed to set time on ./fsroot-broadcom/usr/lib/modules/6.1.0-29-2-amd64/kernel/fs/smb/client, because No such file or directory
set_attributes: failed to set time on ./fsroot-broadcom/usr/lib/modules/6.1.0-29-2-amd64/kernel/fs/smb/common/cifs_arc4.ko, because No such file or directory
set_attributes: failed to set time on ./fsroot-broadcom/usr/lib/modules/6.1.0-29-2-amd64/kernel/fs/smb/common/cifs_md4.ko, because No such file or directory
set_attributes: failed to set time on ./fsroot-broadcom/usr/lib/modules/6.1.0-29-2-amd64/kernel/fs/smb/common, because No such file or directory
set_attributes: failed to set time on ./fsroot-broadcom/usr/lib/modules/6.1.0-29-2-amd64/kernel/fs/smb/server/ksmbd.ko, because No such file or directory
set_attributes: failed to set time on ./fsroot-broadcom/usr/lib/modules/6.1.0-29-2-amd64/kernel/fs/smb/server, because No such file or directory
set_attributes: failed to set time on ./fsroot-broadcom/usr/lib/modules/6.1.0-29-2-amd64/kernel/fs/smb, because No such file or directory
set_attributes: failed to set time on ./fsroot-broadcom/usr/lib/modules/6.1.0-29-2-amd64/kernel/fs/squashfs/squashfs.ko, because No such file or directory
set_attributes: failed to set time on ./fsroot-broadcom/usr/lib/modules/6.1.0-29-2-amd64/kernel/fs/squashfs, because No such file or directory
set_attributes: failed to set time on ./fsroot-broadcom/usr/lib/modules/6.1.0-29-2-amd64/kernel/fs/sysv/sysv.ko, because No such file or directory
set_attributes: failed to set time on ./fsroot-broadcom/usr/lib/modules/6.1.0-29-2-amd64/kernel/fs/sysv, because No such file or directory
set_attributes: failed to set time on ./fsroot-broadcom/usr/lib/modules/6.1.0-29-2-amd64/kernel/fs/ubifs/ubifs.ko, because No such file or directory
set_attributes: failed to set time on ./fsroot-broadcom/usr/lib/modules/6.1.0-29-2-amd64/kernel/fs/ubifs, because No such file or directory
set_attributes: failed to set time on ./fsroot-broadcom/usr/lib/modules/6.1.0-29-2-amd64/kernel/fs/udf/udf.ko, because No such file or directory
set_attributes: failed to set time on ./fsroot-broadcom/usr/lib/modules/6.1.0-29-2-amd64/kernel/fs/udf, because No such file or directory
set_attributes: failed to set time on ./fsroot-broadcom/usr/lib/modules/6.1.0-29-2-amd64/kernel/fs/ufs/ufs.ko, because No such file or directory
set_attributes: failed to set time on ./fsroot-broadcom/usr/lib/modules/6.1.0-29-2-amd64/kernel/fs/ufs, because No such file or directory
set_attributes: failed to set time on ./fsroot-broadcom/usr/lib/modules/6.1.0-29-2-amd64/kernel/fs/vboxsf/vboxsf.ko, because No such file or directory
set_attributes: failed to set time on ./fsroot-broadcom/usr/lib/modules/6.1.0-29-2-amd64/kernel/fs/vboxsf, because No such file or directory
set_attributes: failed to set time on ./fsroot-broadcom/usr/lib/modules/6.1.0-29-2-amd64/kernel/fs/xfs/xfs.ko, because No such file or directory
set_attributes: failed to set time on ./fsroot-broadcom/usr/lib/modules/6.1.0-29-2-amd64/kernel/fs/xfs, because No such file or directory
set_attributes: failed to set time on ./fsroot-broadcom/usr/lib/modules/6.1.0-29-2-amd64/kernel/fs/zonefs/zonefs.ko, because No such file or directory
set_attributes: failed to set time on ./fsroot-broadcom/usr/lib/modules/6.1.0-29-2-amd64/kernel/fs/zonefs, because No such file or directory
set_attributes: failed to set time on ./fsroot-broadcom/usr/lib/modules/6.1.0-29-2-amd64/kernel/fs, because No such file or directory
set_attributes: failed to set time on ./fsroot-broadcom/usr/lib/modules/6.1.0-29-2-amd64/kernel/net/tipc/diag.ko, because No such file or directory
set_attributes: failed to set time on ./fsroot-broadcom/usr/lib/modules/6.1.0-29-2-amd64/kernel/net/tipc/tipc.ko, because No such file or directory
set_attributes: failed to set time on ./fsroot-broadcom/usr/lib/modules/6.1.0-29-2-amd64/kernel/net/tipc, because No such file or directory
set_attributes: failed to set time on ./fsroot-broadcom/usr/lib/modules/6.1.0-29-2-amd64/kernel/net/tls/tls.ko, because No such file or directory
set_attributes: failed to set time on ./fsroot-broadcom/usr/lib/modules/6.1.0-29-2-amd64/kernel/net/tls, because No such file or directory
set_attributes: failed to set time on ./fsroot-broadcom/usr/lib/modules/6.1.0-29-2-amd64/kernel/net/unix/unix_diag.ko, because No such file or directory
set_attributes: failed to set time on ./fsroot-broadcom/usr/lib/modules/6.1.0-29-2-amd64/kernel/net/unix, because No such file or directory
set_attributes: failed to set time on ./fsroot-broadcom/usr/lib/modules/6.1.0-29-2-amd64/kernel/net/wireless/cfg80211.ko, because No such file or directory
set_attributes: failed to set time on ./fsroot-broadcom/usr/lib/modules/6.1.0-29-2-amd64/kernel/net/wireless/lib80211.ko, because No such file or directory
set_attributes: failed to set time on ./fsroot-broadcom/usr/lib/modules/6.1.0-29-2-amd64/kernel/net/wireless/lib80211_crypt_ccmp.ko, because No such file or directory
set_attributes: failed to set time on ./fsroot-broadcom/usr/lib/modules/6.1.0-29-2-amd64/kernel/net/wireless/lib80211_crypt_tkip.ko, because No such file or directory
set_attributes: failed to set time on ./fsroot-broadcom/usr/lib/modules/6.1.0-29-2-amd64/kernel/net/wireless/lib80211_crypt_wep.ko, because No such file or directory
set_attributes: failed to set time on ./fsroot-broadcom/usr/lib/modules/6.1.0-29-2-amd64/kernel/net/wireless, because No such file or directory
set_attributes: failed to set time on ./fsroot-broadcom/usr/lib/modules/6.1.0-29-2-amd64/kernel/net/xfrm/xfrm_algo.ko, because No such file or directory
set_attributes: failed to set time on ./fsroot-broadcom/usr/lib/modules/6.1.0-29-2-amd64/kernel/net/xfrm/xfrm_interface.ko, because No such file or directory
set_attributes: failed to set time on ./fsroot-broadcom/usr/lib/modules/6.1.0-29-2-amd64/kernel/net/xfrm/xfrm_ipcomp.ko, because No such file or directory
set_attributes: failed to set time on ./fsroot-broadcom/usr/lib/modules/6.1.0-29-2-amd64/kernel/net/xfrm/xfrm_user.ko, because No such file or directory
set_attributes: failed to set time on ./fsroot-broadcom/usr/lib/modules/6.1.0-29-2-amd64/kernel/net/xfrm, because No such file or directory
[==========================| ] 30524/67775 45%
[====================================/ ] 42311/67775 62%
[=======================================================- ] 64274/67775 94%
[===========================================================-] 67775/67775 100%
created 25922 files
created 3484 directories
created 2373 symlinks
created 5351 devices
created 0 fifos
created 0 sockets
created 5 hardlinks
[ FAIL LOG END ] [ target/sonic-broadcom.bin ]
make: *** [slave.mk:1435: target/sonic-broadcom.bin] Error 1
make[1]: *** [Makefile.work:611: all] Error 2
make[1]: Leaving directory '/var/lib/jenkins/workspace/DevOps-test2/platform-broadcom'
make: *** [Makefile:53: all] Error 2
|