+++ --- Applying local submodule patches --- +++
already applied: sonic-utilities
already applied: sonic-swss
already applied: sonic-swss-new
already applied: sonic-sairedis-vslib
already applied: sonic-sairedis-meta
already applied: sonic-sairedis-SAI
already applied: sonic-sairedis-SAI-apidef
already applied: sonic-mgmt-framework
+++ --- Making all --- +++
./scripts/run_with_retry make BLDENV=bookworm -f Makefile.work all
make[1]: Entering directory '/var/lib/jenkins/workspace/DevOps-test2/platform-vs'
"SECURE_UPGRADE_PROD_SIGNING_TOOL": ""
~/workspace/DevOps-test2/platform-vs/src/sonic-build-hooks ~/workspace/DevOps-test2/platform-vs
make[2]: Entering directory '/var/lib/jenkins/workspace/DevOps-test2/platform-vs/src/sonic-build-hooks'
dpkg-deb: building package 'sonic-build-hooks' in 'buildinfo/sonic-build-hooks_1.0_all.deb'.
make[2]: Leaving directory '/var/lib/jenkins/workspace/DevOps-test2/platform-vs/src/sonic-build-hooks'
~/workspace/DevOps-test2/platform-vs
Checking sonic-slave-base image: sonic-slave-bookworm:2f250bfbb4a
Checking sonic-slave-user image: sonic-slave-bookworm-jenkins:d05b1641d68
SONiC Build System
Build Configuration
"CONFIGURED_PLATFORM" : "vs"
"CONFIGURED_ARCH" : "amd64"
"SONIC_CONFIG_PRINT_DEPENDENCIES" : ""
"SONIC_BUILD_JOBS" : "4"
"SONIC_CONFIG_MAKE_JOBS" : "112"
"USE_NATIVE_DOCKERD_FOR_BUILD" : ""
"SONIC_USE_DOCKER_BUILDKIT" : ""
"USERNAME" : "admin"
"PASSWORD" : "YourPaSsWoRd"
"CHANGE_DEFAULT_PASSWORD" : "n"
"SECURE_UPGRADE_MODE" : "no_sign"
"SECURE_UPGRADE_DEV_SIGNING_KEY" : ""
"SECURE_UPGRADE_SIGNING_CERT" : ""
"SECURE_UPGRADE_PROD_SIGNING_TOOL": ""
"SECURE_UPGRADE_PROD_TOOL_ARGS" : ""
"ONIE_IMAGE_PART_SIZE" : ""
"SHUTDOWN_BGP_ON_START" : ""
"ENABLE_PFCWD_ON_START" : ""
"SONIC_BUFFER_MODEL" : ""
"INSTALL_DEBUG_TOOLS" : ""
"ROUTING_STACK" : "frr"
"FRR_USER_UID" : "300"
"FRR_USER_GID" : "300"
"ENABLE_SYNCD_RPC" : ""
"SAITHRIFT_V2" : ""
"ENABLE_ORGANIZATION_EXTENSIONS" : "y"
"HTTP_PROXY" : ""
"HTTPS_PROXY" : ""
"NO_PROXY" : ""
"ENABLE_ZTP" : ""
"INCLUDE_PDE" : ""
"SONIC_DEBUGGING_ON" : ""
"SONIC_PROFILING_ON" : ""
"KERNEL_PROCURE_METHOD" : "build"
"BUILD_TIMESTAMP" : "20260929.124627"
"BUILD_LOG_TIMESTAMP" : "none"
"SONIC_IMAGE_VERSION" : "etri-202505.24-8610ff460"
"BLDENV" : "bookworm"
"VS_PREPARE_MEM" : "yes"
"INCLUDE_MGMT_FRAMEWORK" : "y"
"INCLUDE_ICCPD" : "n"
"INCLUDE_STP" : "y"
"INCLUDE_SYSTEM_TELEMETRY" : "y"
"INCLUDE_SYSTEM_GNMI" : "y"
"INCLUDE_SYSTEM_BMP" : "y"
"INCLUDE_SYSTEM_EVENTD" : "y"
"ENABLE_HOST_SERVICE_ON_START" : "y"
"INCLUDE_RESTAPI" : "n"
"INCLUDE_SFLOW" : "y"
"INCLUDE_NAT" : "y"
"INCLUDE_DHCP_RELAY" : "y"
"INCLUDE_DHCP_SERVER" : "n"
"INCLUDE_P4RT" : "n"
"INCLUDE_VS_DASH_SAI" : "y"
"INCLUDE_KUBERNETES" : "n"
"INCLUDE_KUBERNETES_MASTER" : "n"
"INCLUDE_MACSEC" : "y"
"INCLUDE_MUX" : "y"
"INCLUDE_TEAMD" : "y"
"INCLUDE_DASH_HA" : "y"
"INCLUDE_ROUTER_ADVERTISER" : "y"
"INCLUDE_BOOTCHART : "y"
"ENABLE_BOOTCHART : "n"
"INCLUDE_FIPS" : "y"
"ENABLE_TRANSLIB_WRITE" : ""
"ENABLE_NATIVE_WRITE" : "y"
"ENABLE_DIALOUT" : ""
"ENABLE_AUTO_TECH_SUPPORT" : "y"
"PDDF_SUPPORT" : "y"
"MULTIARCH_QEMU_ENVIRON" : "n"
"SONIC_VERSION_CONTROL_COMPONENTS": "py2,py3,web,git,docker"
"ENABLE_ASAN" : "n"
"DEFAULT_CONTAINER_REGISTRY" : "publicmirror.azurecr.io/"
"BUILD_MULTIASIC_KVM" : "n"
"CROSS_BUILD_ENVIRON" : "n"
"LEGACY_SONIC_MGMT_DOCKER" : "y"
"INCLUDE_EXTERNAL_PATCHES" : "n"
"PTF_ENV_PY_VER" : "py3"
"ENABLE_MULTIDB" : ""
mv: cannot move '/etc/apt/sources.list.d/debian.sources' to '/etc/apt/sources.list.d/debian.sources.back': Permission denied
fatal: not a git repository (or any of the parent directories): .git
"SONIC_DPKG_CACHE_METHOD" : "none"
basename: missing operand
Try 'basename --help' for more information.
[ building ] [ target/sonic-vs.img.gz ]
[ building ] [ target/files/bookworm/sonic_version.yml ]
[ building ] [ target/docker-swss-layer-bookworm.gz-load ]
[ finished ] [ target/files/bookworm/sonic_version.yml ]
[ finished ] [ target/docker-swss-layer-bookworm.gz-load ]
[ building ] [ target/docker-sonic-vs.gz ]
[ finished ] [ target/docker-sonic-vs.gz ]
[ finished ] [ target/sonic-vs.img.gz ]
[ FAIL LOG START ] [ target/sonic-vs.img.gz ]
Build start time: Tue Sep 29 03:46:59 UTC 2026
++ '[' -f .arch ']'
++ cat .arch
+ CONFIGURED_ARCH=amd64
+ DOCKER_VERSION=5:24.0.2-1~debian.12~bookworm
+ CONTAINERD_IO_VERSION=1.6.21-1
+ LINUX_KERNEL_VERSION=6.1.0-29-2
+ FILESYSTEM_ROOT=./fsroot
+ PLATFORM_DIR=platform
+ HOSTNAME=sonic
+ DEFAULT_USERINFO='Default admin user,,,'
+ BUILD_TOOL_PATH=src/sonic-build-hooks/buildinfo
+ TRUSTED_GPG_DIR=src/sonic-build-hooks/buildinfo/trusted.gpg.d
+ . ./onie-image.conf
++ : 32768
++ : x86_64
++ : vs
++ ONIEIMAGE_VERSION=r0
++ FILESYSTEM_ROOT=./fsroot-vs
++ FILESYSTEM_SQUASHFS=fs.squashfs
++ INSTALLER_PAYLOAD=fs.zip
++ FILESYSTEM_DOCKERFS=dockerfs.tar.gz
++ DOCKERFS_DIR=docker
++ DOCKER_RAMFS_SIZE=3500M
++ OUTPUT_ONIE_IMAGE=target/sonic-vs.bin
++ OUTPUT_RAW_IMAGE=target/sonic-vs.raw
++ RAW_IMAGE_DISK_SIZE=1700
++ OUTPUT_KVM_IMAGE=target/sonic-vs.img
++ KVM_IMAGE_DISK_SIZE=16
++ OUTPUT_ABOOT_IMAGE=target/sonic-aboot-vs.swi
++ ABOOT_BOOT_IMAGE=.sonic-boot.swi
++ OUTPUT_KVM_4ASIC_IMAGE=target/sonic-4asic-vs.img
++ OUTPUT_KVM_6ASIC_IMAGE=target/sonic-6asic-vs.img
++ OUTPUT_DSC_IMAGE=target/sonic-vs.tar
+ '[' -n 32768 ']'
+ '[' -n fs.zip ']'
+ '[' -n fs.squashfs ']'
+ '[' kvm = aboot ']'
+ [[ y != y ]]
+ [[ n == y ]]
+ [[ y == y ]]
+ echo '[INFO] RFS build: second stage'
[INFO] RFS build: second stage
+ sudo mount proc /proc -t proc
+ sudo fuser -vm ./fsroot-vs
USER PID ACCESS COMMAND
/sonic/fsroot-vs: root kernel mount /usr/sbin/docker-init
jenkins 1 ..ce. docker-init
jenkins 7 ..c.. bash
jenkins 8 ..c.. make
jenkins 6232 ..c.. bash
root 6419 ....m dockerd
root 6502 ....m containerd
jenkins 6974 ..c.. bash
jenkins 7194 ..c.. docker
jenkins 7195 ..c.. process_log.sh
jenkins 12305 ..c.. build_debian.sh
jenkins 12306 ..c.. process_log.sh
root 12314 ..c.. sudo
+ sudo rm -rf ./fsroot-vs
+ sudo unsquashfs -d ./fsroot-vs target/sonic-vs.img.gz__vs__rfs.squashfs
Parallel unsquashfs: Using 112 processors
33651 inodes (34124 blocks) to write
[=======/ ] 8431/67775 12%
[===========- ] 12844/67775 18%
[==================\ ] 20821/67775 30%
[===========================| ] 31256/67775 46%
[======================================/ ] 43803/67775 64%
[========================================================- ] 65089/67775 96%
[===========================================================-] 67775/67775 100%
created 25922 files
created 3484 directories
created 2373 symlinks
created 5351 devices
created 0 fifos
created 0 sockets
created 5 hardlinks
+ pushd ./fsroot-vs
/sonic/fsroot-vs /sonic
+ sudo mount --bind . .
+ popd
/sonic
+ trap_push 'sudo LANG=C chroot $FILESYSTEM_ROOT umount /proc || true'
+ local oldcmd=true
+ local 'newcmd=sudo LANG=C chroot $FILESYSTEM_ROOT umount /proc || true; true'
+ trap -- 'sudo LANG=C chroot $FILESYSTEM_ROOT umount /proc || true; true' EXIT INT TERM HUP
+ _trap_push 'sudo LANG=C chroot $FILESYSTEM_ROOT umount /proc || true; true'
+ local 'next=sudo LANG=C chroot $FILESYSTEM_ROOT umount /proc || true; true'
++ echo 'sudo LANG=C chroot $FILESYSTEM_ROOT umount /proc || true; true'
++ sed -e 's/'\''/'\''\\'\'''\''/g'
+ eval 'trap_push() {
local oldcmd='\''sudo LANG=C chroot $FILESYSTEM_ROOT umount /proc || true; true'\''
local newcmd="$1; $oldcmd"
trap -- "$newcmd" EXIT INT TERM HUP
_trap_push "$newcmd"
}'
+ sudo LANG=C chroot ./fsroot-vs mount proc /proc -t proc
+ export build_version=etri-202505.24-8610ff460
+ build_version=etri-202505.24-8610ff460
++ cat ./fsroot-vs/etc/debian_version
+ export debian_version=12.15
+ debian_version=12.15
+ export kernel_version=6.1.0-29-2-amd64
+ kernel_version=6.1.0-29-2-amd64
+ export asic_type=vs
+ asic_type=vs
+ export asic_subtype=vs
+ asic_subtype=vs
++ git rev-parse --short HEAD
+ export commit_id=8610ff460
+ commit_id=8610ff460
++ git rev-parse --abbrev-ref HEAD
+ export branch=etri-202505
+ branch=etri-202505
++ '[' -f ./fsroot-vs/etc/sonic/sonic_release ']'
++ cat ./fsroot-vs/etc/sonic/sonic_release
+ export release=202505
+ release=202505
++ date -u
+ export 'build_date=Tue Sep 29 03:47:48 UTC 2026'
+ build_date='Tue Sep 29 03:47:48 UTC 2026'
+ export build_number=24
+ build_number=24
+ export built_by=jenkins@w2sh
+ built_by=jenkins@w2sh
+ export sonic_os_version=12
+ sonic_os_version=12
+ j2 files/build_templates/sonic_version.yml.j2
+ sudo tee ./fsroot-vs/etc/sonic/sonic_version.yml
---
build_version: 'etri-202505.24-8610ff460'
debian_version: '12.15'
kernel_version: '6.1.0-29-2-amd64'
asic_type: vs
asic_subtype: 'vs'
commit_id: '8610ff460'
branch: 'etri-202505'
release: '202505'
build_date: Tue Sep 29 03:47:48 UTC 2026
build_number: 24
built_by: jenkins@w2sh
libswsscommon: 1.0.0
sonic_utilities: 1.2
sonic_os_version: 12
secure_boot_image: 'no'
+ '[' -f sonic_debian_extension.sh ']'
+ ./sonic_debian_extension.sh ./fsroot-vs platform bookworm
++ '[' -f .arch ']'
++ cat .arch
+ CONFIGURED_ARCH=amd64
++ '[' -f .platform ']'
++ cat .platform
+ CONFIGURED_PLATFORM=vs
+ . functions.sh
++ _trap_push true
++ local next=true
+++ echo true
+++ sed -e 's/'\''/'\''\\'\'''\''/g'
++ eval 'trap_push() {
local oldcmd='\''true'\''
local newcmd="$1; $oldcmd"
trap -- "$newcmd" EXIT INT TERM HUP
_trap_push "$newcmd"
}'
+ BUILD_SCRIPTS_DIR=files/build_scripts
+ BUILD_TEMPLATES=files/build_templates
+ IMAGE_CONFIGS=files/image_config
+ SCRIPTS_DIR=files/scripts
+ DOCKER_SCRIPTS_DIR=files/docker
+ DOCKER_CTL_DIR=/usr/lib/docker/
+ DOCKER_CTL_SCRIPT=/usr/lib/docker//docker.sh
+ FILESYSTEM_ROOT_USR=./fsroot-vs/usr
+ FILESYSTEM_ROOT_USR_LIB=./fsroot-vs/usr/lib/
+ FILESYSTEM_ROOT_USR_LIB_SYSTEMD_SYSTEM=./fsroot-vs/usr/lib//systemd/system
+ FILESYSTEM_ROOT_USR_LIB_SYSTEMD_NETWORK=./fsroot-vs/usr/lib//systemd/network
+ FILESYSTEM_ROOT_USR_SHARE=./fsroot-vs/usr/share
+ FILESYSTEM_ROOT_USR_SHARE_SONIC=./fsroot-vs/usr/share/sonic
+ FILESYSTEM_ROOT_USR_SHARE_SONIC_SCRIPTS=./fsroot-vs/usr/share/sonic/scripts
+ FILESYSTEM_ROOT_USR_SHARE_SONIC_TEMPLATES=./fsroot-vs/usr/share/sonic/templates
+ FILESYSTEM_ROOT_USR_SHARE_SONIC_FIRMWARE=./fsroot-vs/usr/share/sonic/firmware
+ FILESYSTEM_ROOT_ETC=./fsroot-vs/etc
+ FILESYSTEM_ROOT_ETC_SONIC=./fsroot-vs/etc/sonic
+ GENERATED_SERVICE_FILE=./fsroot-vs/etc/sonic/generated_services.conf
+ trap_push clean_sys
+ local oldcmd=true
+ local 'newcmd=clean_sys; true'
+ trap -- 'clean_sys; true' EXIT INT TERM HUP
+ _trap_push 'clean_sys; true'
+ local 'next=clean_sys; true'
++ echo 'clean_sys; true'
++ sed -e 's/'\''/'\''\\'\'''\''/g'
+ eval 'trap_push() {
local oldcmd='\''clean_sys; true'\''
local newcmd="$1; $oldcmd"
trap -- "$newcmd" EXIT INT TERM HUP
_trap_push "$newcmd"
}'
+ sudo LANG=C chroot ./fsroot-vs mount sysfs /sys -t sysfs
+ sudo bash -c 'echo "DOCKER_OPTS="--storage-driver=overlay2"" >> ./fsroot-vs/etc/default/docker'
+ sudo mkdir -p ./fsroot-vs//usr/lib/docker/
+ sudo cp files/docker/docker ./fsroot-vs//usr/lib/docker//docker.sh
+ [[ n == y ]]
+ [[ n == y ]]
+ sudo chroot ./fsroot-vs /usr/lib/docker//docker.sh start
Starting Docker: docker.
+ sudo LANG=C DEBIAN_FRONTEND=noninteractive chroot ./fsroot-vs apt-get update
Hit:1 https://download.docker.com/linux/debian bookworm InRelease
Hit:2 http://debian-archive.trafficmanager.net/debian bookworm InRelease
Get:3 http://debian-archive.trafficmanager.net/debian bookworm-updates InRelease [55.4 kB]
Get:4 http://debian-archive.trafficmanager.net/debian bookworm-backports InRelease [59.4 kB]
Hit:5 http://debian-archive.trafficmanager.net/debian-security bookworm-security InRelease
Fetched 115 kB in 5s (25.5 kB/s)
Reading package lists...
+ sudo LANG=C DEBIAN_FRONTEND=noninteractive chroot ./fsroot-vs apt-get -y install efitools
Reading package lists...
Building dependency tree...
Reading state information...
The following additional packages will be installed:
sbsigntool
The following NEW packages will be installed:
efitools sbsigntool
0 upgraded, 2 newly installed, 0 to remove and 5 not upgraded.
Need to get 204 kB of archives.
After this operation, 1480 kB of additional disk space will be used.
Get:1 http://debian-archive.trafficmanager.net/debian bookworm/main amd64 sbsigntool amd64 0.9.4-3.1 [68.4 kB]
Get:2 http://debian-archive.trafficmanager.net/debian bookworm/main amd64 efitools amd64 1.9.2-3 [135 kB]
debconf: delaying package configuration, since apt-utils is not installed
Fetched 204 kB in 2s (88.9 kB/s)
E: Can not write log (Is /dev/pts mounted?) - posix_openpt (19: No such device)
Selecting previously unselected package sbsigntool.
(Reading database ... 26714 files and directories currently installed.)
Preparing to unpack .../sbsigntool_0.9.4-3.1_amd64.deb ...
Unpacking sbsigntool (0.9.4-3.1) ...
Selecting previously unselected package efitools.
Preparing to unpack .../efitools_1.9.2-3_amd64.deb ...
Unpacking efitools (1.9.2-3) ...
Setting up sbsigntool (0.9.4-3.1) ...
Setting up efitools (1.9.2-3) ...
+ sudo LANG=C DEBIAN_FRONTEND=noninteractive chroot ./fsroot-vs apt-get -y install mokutil
Reading package lists...
Building dependency tree...
Reading state information...
The following NEW packages will be installed:
mokutil
0 upgraded, 1 newly installed, 0 to remove and 5 not upgraded.
Need to get 26.9 kB of archives.
After this operation, 81.9 kB of additional disk space will be used.
Get:1 http://debian-archive.trafficmanager.net/debian bookworm/main amd64 mokutil amd64 0.6.0-2 [26.9 kB]
debconf: delaying package configuration, since apt-utils is not installed
Fetched 26.9 kB in 5s (5378 B/s)
E: Can not write log (Is /dev/pts mounted?) - posix_openpt (19: No such device)
Selecting previously unselected package mokutil.
(Reading database ... 26767 files and directories currently installed.)
Preparing to unpack .../mokutil_0.6.0-2_amd64.deb ...
Unpacking mokutil (0.6.0-2) ...
Setting up mokutil (0.6.0-2) ...
+ sudo cp files/image_config/environment/environment ./fsroot-vs/etc/
+ sudo cp files/image_config/environment/motd ./fsroot-vs/etc/
+ sudo cp files/image_config/environment/logout_message ./fsroot-vs/etc/
+ sudo mkdir -p ./fsroot-vs/etc/sonic/
+ sudo mkdir -p ./fsroot-vs/etc/modprobe.d/
+ sudo mkdir -p ./fsroot-vs/var/cache/sonic/
+ sudo mkdir -p ./fsroot-vs/usr/share/sonic/templates/
+ sudo mkdir -p ./fsroot-vs/usr/share/sonic/firmware/
+ sudo mkdir -p ./fsroot-vs/usr/lib//systemd/system
+ install_deb_package target/debs/bookworm/sonic-nettools_0.0.1-0_amd64.deb
+ deb_packages=target/debs/bookworm/sonic-nettools_0.0.1-0_amd64.deb
+ [[ -z target/debs/bookworm/sonic-nettools_0.0.1-0_amd64.deb ]]
+ sudo cp target/debs/bookworm/sonic-nettools_0.0.1-0_amd64.deb ./fsroot-vs/
++ basename -a target/debs/bookworm/sonic-nettools_0.0.1-0_amd64.deb
+ basename_deb_packages=sonic-nettools_0.0.1-0_amd64.deb
+ sudo LANG=C DEBIAN_FRONTEND=noninteractive chroot ./fsroot-vs dpkg -i sonic-nettools_0.0.1-0_amd64.deb
Selecting previously unselected package sonic-nettools.
(Reading database ... 26773 files and directories currently installed.)
Preparing to unpack sonic-nettools_0.0.1-0_amd64.deb ...
Unpacking sonic-nettools (0.0.1-0) ...
Setting up sonic-nettools (0.0.1-0) ...
+ cd ./fsroot-vs
+ sudo rm -f sonic-nettools_0.0.1-0_amd64.deb
+ sudo setcap cap_net_raw=+ep ./fsroot-vs/usr/bin/wol
+ sudo bash -c 'echo "d /dev/shm/monit/ 0755 root root" > ./fsroot-vs/etc/tmpfiles.d/tmpfs-monit.conf'
+ sudo bash -c 'echo "d /dev/shm/logrotate/ 0755 root root" > ./fsroot-vs/etc/tmpfiles.d/tmpfs-logrotate.conf'
+ install_deb_package target/debs/bookworm/ifupdown2_3.0.0-1_all.deb
+ deb_packages=target/debs/bookworm/ifupdown2_3.0.0-1_all.deb
+ [[ -z target/debs/bookworm/ifupdown2_3.0.0-1_all.deb ]]
+ sudo cp target/debs/bookworm/ifupdown2_3.0.0-1_all.deb ./fsroot-vs/
++ basename -a target/debs/bookworm/ifupdown2_3.0.0-1_all.deb
+ basename_deb_packages=ifupdown2_3.0.0-1_all.deb
+ sudo LANG=C DEBIAN_FRONTEND=noninteractive chroot ./fsroot-vs dpkg -i ifupdown2_3.0.0-1_all.deb
Selecting previously unselected package ifupdown2.
(Reading database ... 26776 files and directories currently installed.)
Preparing to unpack ifupdown2_3.0.0-1_all.deb ...
Unpacking ifupdown2 (3.0.0-1) ...
Setting up ifupdown2 (3.0.0-1) ...
ifupdown2.postinst: Warning: No 'iface lo' definition found in /etc/network/interfaces
ifupdown2.postinst: Warning: No 'auto lo' statement found in /etc/network/interfaces
Created symlink /etc/systemd/system/basic.target.wants/networking.service -> /lib/systemd/system/networking.service.
Created symlink /etc/systemd/system/network.target.wants/networking.service -> /lib/systemd/system/networking.service.
Created symlink /etc/systemd/system/shutdown.target.wants/networking.service -> /lib/systemd/system/networking.service.
+ cd ./fsroot-vs
+ sudo rm -f ifupdown2_3.0.0-1_all.deb
+ sudo LANG=C DEBIAN_FRONTEND=noninteractive chroot ./fsroot-vs apt-get -y install python3-dev
Reading package lists...
Building dependency tree...
Reading state information...
The following additional packages will be installed:
libc-dev-bin libc6-dev libcrypt-dev libexpat1-dev libjs-jquery
libjs-sphinxdoc libjs-underscore libnsl-dev libpython3-dev libpython3.11-dev
libtirpc-dev linux-libc-dev python3.11-dev rpcsvc-proto zlib1g-dev
Suggested packages:
glibc-doc manpages-dev
Recommended packages:
manpages manpages-dev libc-devtools javascript-common
The following NEW packages will be installed:
libc-dev-bin libc6-dev libcrypt-dev libexpat1-dev libjs-jquery
libjs-sphinxdoc libjs-underscore libnsl-dev libpython3-dev libpython3.11-dev
libtirpc-dev linux-libc-dev python3-dev python3.11-dev rpcsvc-proto
zlib1g-dev
0 upgraded, 16 newly installed, 0 to remove and 6 not upgraded.
Need to get 11.8 MB of archives.
After this operation, 52.0 MB of additional disk space will be used.
Get:1 http://debian-archive.trafficmanager.net/debian bookworm/main amd64 libc-dev-bin amd64 2.36-9+deb12u14 [48.1 kB]
Get:2 http://debian-archive.trafficmanager.net/debian-security bookworm-security/main amd64 linux-libc-dev amd64 6.1.187-1 [2357 kB]
Get:3 http://debian-archive.trafficmanager.net/debian bookworm/main amd64 libcrypt-dev amd64 1:4.4.33-2 [118 kB]
Get:4 http://debian-archive.trafficmanager.net/debian bookworm/main amd64 libtirpc-dev amd64 1.3.3+ds-1 [191 kB]
Get:5 http://debian-archive.trafficmanager.net/debian bookworm/main amd64 libnsl-dev amd64 1.3.0-2 [66.4 kB]
Get:6 http://debian-archive.trafficmanager.net/debian bookworm/main amd64 rpcsvc-proto amd64 1.4.3-1 [63.3 kB]
Get:7 http://debian-archive.trafficmanager.net/debian bookworm/main amd64 libc6-dev amd64 2.36-9+deb12u14 [1904 kB]
Get:8 http://debian-archive.trafficmanager.net/debian-security bookworm-security/main amd64 libexpat1-dev amd64 2.5.0-1+deb12u3 [155 kB]
Get:9 http://debian-archive.trafficmanager.net/debian bookworm/main amd64 libjs-jquery all 3.6.1+dfsg+~3.5.14-1 [326 kB]
Get:10 http://debian-archive.trafficmanager.net/debian bookworm/main amd64 libjs-underscore all 1.13.4~dfsg+~1.11.4-3 [116 kB]
Get:11 http://debian-archive.trafficmanager.net/debian bookworm/main amd64 libjs-sphinxdoc all 5.3.0-4 [130 kB]
Get:12 http://debian-archive.trafficmanager.net/debian bookworm/main amd64 zlib1g-dev amd64 1:1.2.13.dfsg-1 [916 kB]
Get:13 http://debian-archive.trafficmanager.net/debian bookworm/main amd64 libpython3.11-dev amd64 3.11.2-6+deb12u8 [4738 kB]
Get:14 http://debian-archive.trafficmanager.net/debian bookworm/main amd64 libpython3-dev amd64 3.11.2-1+b1 [9572 B]
Get:15 http://debian-archive.trafficmanager.net/debian bookworm/main amd64 python3.11-dev amd64 3.11.2-6+deb12u8 [619 kB]
Get:16 http://debian-archive.trafficmanager.net/debian bookworm/main amd64 python3-dev amd64 3.11.2-1+b1 [26.2 kB]
debconf: delaying package configuration, since apt-utils is not installed
Fetched 11.8 MB in 6s (1852 kB/s)
E: Can not write log (Is /dev/pts mounted?) - posix_openpt (19: No such device)
Selecting previously unselected package libc-dev-bin.
(Reading database ... 26895 files and directories currently installed.)
Preparing to unpack .../00-libc-dev-bin_2.36-9+deb12u14_amd64.deb ...
Unpacking libc-dev-bin (2.36-9+deb12u14) ...
Selecting previously unselected package linux-libc-dev:amd64.
Preparing to unpack .../01-linux-libc-dev_6.1.187-1_amd64.deb ...
Unpacking linux-libc-dev:amd64 (6.1.187-1) ...
Selecting previously unselected package libcrypt-dev:amd64.
Preparing to unpack .../02-libcrypt-dev_1%3a4.4.33-2_amd64.deb ...
Unpacking libcrypt-dev:amd64 (1:4.4.33-2) ...
Selecting previously unselected package libtirpc-dev:amd64.
Preparing to unpack .../03-libtirpc-dev_1.3.3+ds-1_amd64.deb ...
Unpacking libtirpc-dev:amd64 (1.3.3+ds-1) ...
Selecting previously unselected package libnsl-dev:amd64.
Preparing to unpack .../04-libnsl-dev_1.3.0-2_amd64.deb ...
Unpacking libnsl-dev:amd64 (1.3.0-2) ...
Selecting previously unselected package rpcsvc-proto.
Preparing to unpack .../05-rpcsvc-proto_1.4.3-1_amd64.deb ...
Unpacking rpcsvc-proto (1.4.3-1) ...
Selecting previously unselected package libc6-dev:amd64.
Preparing to unpack .../06-libc6-dev_2.36-9+deb12u14_amd64.deb ...
Unpacking libc6-dev:amd64 (2.36-9+deb12u14) ...
Selecting previously unselected package libexpat1-dev:amd64.
Preparing to unpack .../07-libexpat1-dev_2.5.0-1+deb12u3_amd64.deb ...
Unpacking libexpat1-dev:amd64 (2.5.0-1+deb12u3) ...
Selecting previously unselected package libjs-jquery.
Preparing to unpack .../08-libjs-jquery_3.6.1+dfsg+~3.5.14-1_all.deb ...
Unpacking libjs-jquery (3.6.1+dfsg+~3.5.14-1) ...
Selecting previously unselected package libjs-underscore.
Preparing to unpack .../09-libjs-underscore_1.13.4~dfsg+~1.11.4-3_all.deb ...
Unpacking libjs-underscore (1.13.4~dfsg+~1.11.4-3) ...
Selecting previously unselected package libjs-sphinxdoc.
Preparing to unpack .../10-libjs-sphinxdoc_5.3.0-4_all.deb ...
Unpacking libjs-sphinxdoc (5.3.0-4) ...
Selecting previously unselected package zlib1g-dev:amd64.
Preparing to unpack .../11-zlib1g-dev_1%3a1.2.13.dfsg-1_amd64.deb ...
Unpacking zlib1g-dev:amd64 (1:1.2.13.dfsg-1) ...
Selecting previously unselected package libpython3.11-dev:amd64.
Preparing to unpack .../12-libpython3.11-dev_3.11.2-6+deb12u8_amd64.deb ...
Unpacking libpython3.11-dev:amd64 (3.11.2-6+deb12u8) ...
Selecting previously unselected package libpython3-dev:amd64.
Preparing to unpack .../13-libpython3-dev_3.11.2-1+b1_amd64.deb ...
Unpacking libpython3-dev:amd64 (3.11.2-1+b1) ...
Selecting previously unselected package python3.11-dev.
Preparing to unpack .../14-python3.11-dev_3.11.2-6+deb12u8_amd64.deb ...
Unpacking python3.11-dev (3.11.2-6+deb12u8) ...
Selecting previously unselected package python3-dev.
Preparing to unpack .../15-python3-dev_3.11.2-1+b1_amd64.deb ...
Unpacking python3-dev (3.11.2-1+b1) ...
Setting up linux-libc-dev:amd64 (6.1.187-1) ...
Setting up libtirpc-dev:amd64 (1.3.3+ds-1) ...
Setting up rpcsvc-proto (1.4.3-1) ...
Setting up libnsl-dev:amd64 (1.3.0-2) ...
Setting up libcrypt-dev:amd64 (1:4.4.33-2) ...
Setting up libjs-jquery (3.6.1+dfsg+~3.5.14-1) ...
Setting up libc-dev-bin (2.36-9+deb12u14) ...
Setting up libjs-underscore (1.13.4~dfsg+~1.11.4-3) ...
Setting up libjs-sphinxdoc (5.3.0-4) ...
Setting up libc6-dev:amd64 (2.36-9+deb12u14) ...
Setting up libexpat1-dev:amd64 (2.5.0-1+deb12u3) ...
Setting up zlib1g-dev:amd64 (1:1.2.13.dfsg-1) ...
Setting up libpython3.11-dev:amd64 (3.11.2-6+deb12u8) ...
Setting up libpython3-dev:amd64 (3.11.2-1+b1) ...
Setting up python3.11-dev (3.11.2-6+deb12u8) ...
Setting up python3-dev (3.11.2-1+b1) ...
+ sudo LANG=C DEBIAN_FRONTEND=noninteractive chroot ./fsroot-vs apt-get -y install j2cli
Reading package lists...
Building dependency tree...
Reading state information...
The following additional packages will be installed:
python3-jinja2 python3-markupsafe python3-yaml
Suggested packages:
python-jinja2-doc
Recommended packages:
python3-babel
The following NEW packages will be installed:
j2cli python3-jinja2 python3-markupsafe python3-yaml
0 upgraded, 4 newly installed, 0 to remove and 6 not upgraded.
Need to get 268 kB of archives.
After this operation, 1167 kB of additional disk space will be used.
Get:1 http://debian-archive.trafficmanager.net/debian bookworm/main amd64 python3-markupsafe amd64 2.1.2-1+b1 [13.2 kB]
Get:2 http://debian-archive.trafficmanager.net/debian bookworm/main amd64 python3-jinja2 all 3.1.2-1+deb12u3 [120 kB]
Get:3 http://debian-archive.trafficmanager.net/debian bookworm/main amd64 python3-yaml amd64 6.0-3+b2 [119 kB]
Get:4 http://debian-archive.trafficmanager.net/debian bookworm/main amd64 j2cli all 0.3.12b-4 [15.2 kB]
debconf: delaying package configuration, since apt-utils is not installed
Fetched 268 kB in 4s (76.3 kB/s)
E: Can not write log (Is /dev/pts mounted?) - posix_openpt (19: No such device)
Selecting previously unselected package python3-markupsafe.
(Reading database ... 28942 files and directories currently installed.)
Preparing to unpack .../python3-markupsafe_2.1.2-1+b1_amd64.deb ...
Unpacking python3-markupsafe (2.1.2-1+b1) ...
Selecting previously unselected package python3-jinja2.
Preparing to unpack .../python3-jinja2_3.1.2-1+deb12u3_all.deb ...
Unpacking python3-jinja2 (3.1.2-1+deb12u3) ...
Selecting previously unselected package python3-yaml.
Preparing to unpack .../python3-yaml_6.0-3+b2_amd64.deb ...
Unpacking python3-yaml (6.0-3+b2) ...
Selecting previously unselected package j2cli.
Preparing to unpack .../j2cli_0.3.12b-4_all.deb ...
Unpacking j2cli (0.3.12b-4) ...
Setting up python3-yaml (6.0-3+b2) ...
Setting up python3-markupsafe (2.1.2-1+b1) ...
Setting up python3-jinja2 (3.1.2-1+deb12u3) ...
Setting up j2cli (0.3.12b-4) ...
+ sudo https_proxy= LANG=C chroot ./fsroot-vs pip3 install redis==3.5.3
Collecting redis==3.5.3
Downloading redis-3.5.3-py2.py3-none-any.whl (72 kB)
━━━━━━━━━━━━━━━━━━━━━━━━━━━━━━━━━━━━━━━━ 72.1/72.1 kB 4.5 MB/s eta 0:00:00
Installing collected packages: redis
Successfully installed redis-3.5.3
WARNING: Running pip as the 'root' user can result in broken permissions and conflicting behaviour with the system package manager. It is recommended to use a virtual environment instead: https://pip.pypa.io/warnings/venv
+ install_pip_package target/python-wheels/bookworm/redis_dump_load-1.1-py3-none-any.whl
+ pip_wheel=target/python-wheels/bookworm/redis_dump_load-1.1-py3-none-any.whl
+ [[ -z target/python-wheels/bookworm/redis_dump_load-1.1-py3-none-any.whl ]]
+ sudo cp target/python-wheels/bookworm/redis_dump_load-1.1-py3-none-any.whl ./fsroot-vs/
++ basename -a target/python-wheels/bookworm/redis_dump_load-1.1-py3-none-any.whl
+ basename_pip_wheel=redis_dump_load-1.1-py3-none-any.whl
+ sudo https_proxy= LANG=C chroot ./fsroot-vs pip3 install redis_dump_load-1.1-py3-none-any.whl
Processing /redis_dump_load-1.1-py3-none-any.whl
Requirement already satisfied: redis in /usr/local/lib/python3.11/dist-packages (from redis-dump-load==1.1) (3.5.3)
Installing collected packages: redis-dump-load
Successfully installed redis-dump-load-1.1
WARNING: Running pip as the 'root' user can result in broken permissions and conflicting behaviour with the system package manager. It is recommended to use a virtual environment instead: https://pip.pypa.io/warnings/venv
+ cd ./fsroot-vs
+ sudo rm -f redis_dump_load-1.1-py3-none-any.whl
+ sudo https_proxy= LANG=C chroot ./fsroot-vs pip3 install psutil
Collecting psutil
Downloading psutil-7.0.0-cp36-abi3-manylinux_2_12_x86_64.manylinux2010_x86_64.manylinux_2_17_x86_64.manylinux2014_x86_64.whl (277 kB)
━━━━━━━━━━━━━━━━━━━━━━━━━━━━━━━━━━━━━━━ 278.0/278.0 kB 9.8 MB/s eta 0:00:00
Installing collected packages: psutil
Successfully installed psutil-7.0.0
WARNING: Running pip as the 'root' user can result in broken permissions and conflicting behaviour with the system package manager. It is recommended to use a virtual environment instead: https://pip.pypa.io/warnings/venv
+ sudo https_proxy= LANG=C chroot ./fsroot-vs pip3 install blkinfo
Collecting blkinfo
Downloading blkinfo-0.2.0.tar.gz (7.9 kB)
Preparing metadata (setup.py): started
Preparing metadata (setup.py): finished with status 'done'
Building wheels for collected packages: blkinfo
Building wheel for blkinfo (setup.py): started
Building wheel for blkinfo (setup.py): finished with status 'done'
Created wheel for blkinfo: filename=blkinfo-0.2.0-py3-none-any.whl size=7665 sha256=e7d98d35c5af67fc3ec3fa2206b4b627b89d0bc27e54ef8bacf972fea26744f6
Stored in directory: /root/.cache/pip/wheels/bf/db/4f/2a25c37f82ea2114b3fe37f772b48956834073ddf3c9e6265e
Successfully built blkinfo
Installing collected packages: blkinfo
Successfully installed blkinfo-0.2.0
WARNING: Running pip as the 'root' user can result in broken permissions and conflicting behaviour with the system package manager. It is recommended to use a virtual environment instead: https://pip.pypa.io/warnings/venv
+ sudo https_proxy= LANG=C chroot ./fsroot-vs pip3 install ipaddr
Collecting ipaddr
Downloading ipaddr-2.2.0.tar.gz (26 kB)
Preparing metadata (setup.py): started
Preparing metadata (setup.py): finished with status 'done'
Building wheels for collected packages: ipaddr
Building wheel for ipaddr (setup.py): started
Building wheel for ipaddr (setup.py): finished with status 'done'
Created wheel for ipaddr: filename=ipaddr-2.2.0-py3-none-any.whl size=18281 sha256=500d3ba8d40a9c539493726b34ae5591fd74bc2e98805a89001f78b1986c7dfb
Stored in directory: /root/.cache/pip/wheels/1b/f4/54/ce8b4b51b444da2d12c64f5a99b6e4b526f341f803d4c9f5ac
Successfully built ipaddr
Installing collected packages: ipaddr
Successfully installed ipaddr-2.2.0
WARNING: Running pip as the 'root' user can result in broken permissions and conflicting behaviour with the system package manager. It is recommended to use a virtual environment instead: https://pip.pypa.io/warnings/venv
+ [[ amd64 == amd64 ]]
+ sudo https_proxy= LANG=C chroot ./fsroot-vs pip3 install grpcio==1.58.0
Collecting grpcio==1.58.0
Downloading grpcio-1.58.0-cp311-cp311-manylinux_2_17_x86_64.manylinux2014_x86_64.whl (5.3 MB)
━━━━━━━━━━━━━━━━━━━━━━━━━━━━━━━━━━━━━━━━ 5.3/5.3 MB 48.3 MB/s eta 0:00:00
Installing collected packages: grpcio
Successfully installed grpcio-1.58.0
WARNING: Running pip as the 'root' user can result in broken permissions and conflicting behaviour with the system package manager. It is recommended to use a virtual environment instead: https://pip.pypa.io/warnings/venv
+ sudo https_proxy= LANG=C chroot ./fsroot-vs pip3 install grpcio-tools==1.58.0
Collecting grpcio-tools==1.58.0
Downloading grpcio_tools-1.58.0-cp311-cp311-manylinux_2_17_x86_64.manylinux2014_x86_64.whl (2.6 MB)
━━━━━━━━━━━━━━━━━━━━━━━━━━━━━━━━━━━━━━━━ 2.6/2.6 MB 1.3 MB/s eta 0:00:00
Collecting protobuf<5.0dev,>=4.21.6
Downloading protobuf-4.25.6-cp37-abi3-manylinux2014_x86_64.whl (294 kB)
━━━━━━━━━━━━━━━━━━━━━━━━━━━━━━━━━━━━━ 294.6/294.6 kB 584.7 kB/s eta 0:00:00
Requirement already satisfied: grpcio>=1.58.0 in /usr/local/lib/python3.11/dist-packages (from grpcio-tools==1.58.0) (1.58.0)
Requirement already satisfied: setuptools in /usr/lib/python3/dist-packages (from grpcio-tools==1.58.0) (66.1.1)
Installing collected packages: protobuf, grpcio-tools
Successfully installed grpcio-tools-1.58.0 protobuf-4.25.6
WARNING: Running pip as the 'root' user can result in broken permissions and conflicting behaviour with the system package manager. It is recommended to use a virtual environment instead: https://pip.pypa.io/warnings/venv
+ sudo https_proxy= LANG=C chroot ./fsroot-vs pip3 install smbus2
Collecting smbus2
Downloading smbus2-0.5.0-py2.py3-none-any.whl (11 kB)
Installing collected packages: smbus2
Successfully installed smbus2-0.5.0
WARNING: Running pip as the 'root' user can result in broken permissions and conflicting behaviour with the system package manager. It is recommended to use a virtual environment instead: https://pip.pypa.io/warnings/venv
+ sudo https_proxy= LANG=C chroot ./fsroot-vs pip3 install telnetlib3
Collecting telnetlib3
Downloading telnetlib3-2.0.4-py2.py3-none-any.whl (93 kB)
━━━━━━━━━━━━━━━━━━━━━━━━━━━━━━━━━━━━━━━━ 93.3/93.3 kB 4.8 MB/s eta 0:00:00
Installing collected packages: telnetlib3
Successfully installed telnetlib3-2.0.4
WARNING: Running pip as the 'root' user can result in broken permissions and conflicting behaviour with the system package manager. It is recommended to use a virtual environment instead: https://pip.pypa.io/warnings/venv
+ install_pip_package target/python-wheels/bookworm/sonic_py_common-1.0-py3-none-any.whl
+ pip_wheel=target/python-wheels/bookworm/sonic_py_common-1.0-py3-none-any.whl
+ [[ -z target/python-wheels/bookworm/sonic_py_common-1.0-py3-none-any.whl ]]
+ sudo cp target/python-wheels/bookworm/sonic_py_common-1.0-py3-none-any.whl ./fsroot-vs/
++ basename -a target/python-wheels/bookworm/sonic_py_common-1.0-py3-none-any.whl
+ basename_pip_wheel=sonic_py_common-1.0-py3-none-any.whl
+ sudo https_proxy= LANG=C chroot ./fsroot-vs pip3 install sonic_py_common-1.0-py3-none-any.whl
Processing /sonic_py_common-1.0-py3-none-any.whl
Collecting natsort
Downloading natsort-8.4.0-py3-none-any.whl (38 kB)
Collecting pyyaml
Downloading PyYAML-6.0.1-cp311-cp311-manylinux_2_17_x86_64.manylinux2014_x86_64.whl (757 kB)
━━━━━━━━━━━━━━━━━━━━━━━━━━━━━━━━━━━━━━ 757.7/757.7 kB 47.3 MB/s eta 0:00:00
Requirement already satisfied: redis-dump-load in /usr/local/lib/python3.11/dist-packages (from sonic-py-common==1.0) (1.1)
Requirement already satisfied: redis in /usr/local/lib/python3.11/dist-packages (from redis-dump-load->sonic-py-common==1.0) (3.5.3)
Installing collected packages: pyyaml, natsort, sonic-py-common
Attempting uninstall: pyyaml
Found existing installation: PyYAML 6.0
Not uninstalling pyyaml at /usr/lib/python3/dist-packages, outside environment /usr
Can't uninstall 'PyYAML'. No files were found to uninstall.
Successfully installed natsort-8.4.0 pyyaml-6.0.1 sonic-py-common-1.0
WARNING: Running pip as the 'root' user can result in broken permissions and conflicting behaviour with the system package manager. It is recommended to use a virtual environment instead: https://pip.pypa.io/warnings/venv
+ cd ./fsroot-vs
+ sudo rm -f sonic_py_common-1.0-py3-none-any.whl
+ [[ amd64 == armhf ]]
+ [[ amd64 == arm64 ]]
+ install_deb_package target/debs/bookworm/libyang_1.0.73_amd64.deb target/debs/bookworm/libyang-cpp_1.0.73_amd64.deb target/debs/bookworm/python3-yang_1.0.73_amd64.deb
+ deb_packages='target/debs/bookworm/libyang_1.0.73_amd64.deb target/debs/bookworm/libyang-cpp_1.0.73_amd64.deb target/debs/bookworm/python3-yang_1.0.73_amd64.deb'
+ [[ -z target/debs/bookworm/libyang_1.0.73_amd64.deb target/debs/bookworm/libyang-cpp_1.0.73_amd64.deb target/debs/bookworm/python3-yang_1.0.73_amd64.deb ]]
+ sudo cp target/debs/bookworm/libyang_1.0.73_amd64.deb target/debs/bookworm/libyang-cpp_1.0.73_amd64.deb target/debs/bookworm/python3-yang_1.0.73_amd64.deb ./fsroot-vs/
++ basename -a target/debs/bookworm/libyang_1.0.73_amd64.deb target/debs/bookworm/libyang-cpp_1.0.73_amd64.deb target/debs/bookworm/python3-yang_1.0.73_amd64.deb
+ basename_deb_packages='libyang_1.0.73_amd64.deb
libyang-cpp_1.0.73_amd64.deb
python3-yang_1.0.73_amd64.deb'
+ sudo LANG=C DEBIAN_FRONTEND=noninteractive chroot ./fsroot-vs dpkg -i libyang_1.0.73_amd64.deb libyang-cpp_1.0.73_amd64.deb python3-yang_1.0.73_amd64.deb
Selecting previously unselected package libyang.
(Reading database ... 29060 files and directories currently installed.)
Preparing to unpack libyang_1.0.73_amd64.deb ...
Unpacking libyang (1.0.73) ...
Selecting previously unselected package libyang-cpp.
Preparing to unpack libyang-cpp_1.0.73_amd64.deb ...
Unpacking libyang-cpp (1.0.73) ...
Selecting previously unselected package python3-yang.
Preparing to unpack python3-yang_1.0.73_amd64.deb ...
Unpacking python3-yang (1.0.73) ...
dpkg: dependency problems prevent configuration of libyang:
libyang depends on libpcre3; however:
Package libpcre3 is not installed.
dpkg: error processing package libyang (--install):
dependency problems - leaving unconfigured
dpkg: dependency problems prevent configuration of libyang-cpp:
libyang-cpp depends on libyang (= 1.0.73); however:
Package libyang is not configured yet.
dpkg: error processing package libyang-cpp (--install):
dependency problems - leaving unconfigured
dpkg: dependency problems prevent configuration of python3-yang:
python3-yang depends on libyang (= 1.0.73); however:
Package libyang is not configured yet.
python3-yang depends on libyang-cpp (= 1.0.73); however:
Package libyang-cpp is not configured yet.
dpkg: error processing package python3-yang (--install):
dependency problems - leaving unconfigured
Processing triggers for libc-bin (2.36-9+deb12u14) ...
Errors were encountered while processing:
libyang
libyang-cpp
python3-yang
+ sudo LANG=C DEBIAN_FRONTEND=noninteractive chroot ./fsroot-vs apt-get -y install -f
Reading package lists...
Building dependency tree...
Reading state information...
Correcting dependencies... Done
The following additional packages will be installed:
libpcre3
The following NEW packages will be installed:
libpcre3
0 upgraded, 1 newly installed, 0 to remove and 6 not upgraded.
3 not fully installed or removed.
Need to get 341 kB of archives.
After this operation, 696 kB of additional disk space will be used.
Ign:1 http://debian-archive.trafficmanager.net/debian bookworm/main amd64 libpcre3 amd64 2:8.39-15
Ign:1 http://debian-archive.trafficmanager.net/debian bookworm/main amd64 libpcre3 amd64 2:8.39-15
Ign:1 http://debian-archive.trafficmanager.net/debian bookworm/main amd64 libpcre3 amd64 2:8.39-15
Ign:1 http://debian-archive.trafficmanager.net/debian bookworm/main amd64 libpcre3 amd64 2:8.39-15
Ign:1 http://debian-archive.trafficmanager.net/debian bookworm/main amd64 libpcre3 amd64 2:8.39-15
Ign:1 http://debian-archive.trafficmanager.net/debian bookworm/main amd64 libpcre3 amd64 2:8.39-15
Ign:1 http://debian-archive.trafficmanager.net/debian bookworm/main amd64 libpcre3 amd64 2:8.39-15
Ign:1 http://debian-archive.trafficmanager.net/debian bookworm/main amd64 libpcre3 amd64 2:8.39-15
Ign:1 http://debian-archive.trafficmanager.net/debian bookworm/main amd64 libpcre3 amd64 2:8.39-15
Ign:1 http://debian-archive.trafficmanager.net/debian bookworm/main amd64 libpcre3 amd64 2:8.39-15
Ign:1 http://debian-archive.trafficmanager.net/debian bookworm/main amd64 libpcre3 amd64 2:8.39-15
Ign:1 http://debian-archive.trafficmanager.net/debian bookworm/main amd64 libpcre3 amd64 2:8.39-15
Ign:1 http://debian-archive.trafficmanager.net/debian bookworm/main amd64 libpcre3 amd64 2:8.39-15
Ign:1 http://debian-archive.trafficmanager.net/debian bookworm/main amd64 libpcre3 amd64 2:8.39-15
Ign:1 http://debian-archive.trafficmanager.net/debian bookworm/main amd64 libpcre3 amd64 2:8.39-15
Ign:1 http://debian-archive.trafficmanager.net/debian bookworm/main amd64 libpcre3 amd64 2:8.39-15
Ign:1 http://debian-archive.trafficmanager.net/debian bookworm/main amd64 libpcre3 amd64 2:8.39-15
Ign:1 http://debian-archive.trafficmanager.net/debian bookworm/main amd64 libpcre3 amd64 2:8.39-15
Ign:1 http://debian-archive.trafficmanager.net/debian bookworm/main amd64 libpcre3 amd64 2:8.39-15
Ign:1 http://debian-archive.trafficmanager.net/debian bookworm/main amd64 libpcre3 amd64 2:8.39-15
Err:1 http://debian-archive.trafficmanager.net/debian bookworm/main amd64 libpcre3 amd64 2:8.39-15
Could not connect to debian-archive.trafficmanager.net:80 (2603:1040:2:5::105). - connect (101: Network is unreachable)
E: Failed to fetch http://debian-archive.trafficmanager.net/debian/pool/main/p/pcre3/libpcre3_8.39-15_amd64.deb Could not connect to debian-archive.trafficmanager.net:80 (2603:1040:2:5::105). - connect (101: Network is unreachable)
E: Unable to fetch some archives, maybe run apt-get update or try with --fix-missing?
+ clean_sys
+ sudo chroot ./fsroot-vs umount /sys/fs/cgroup/cgroup.controllers /sys/fs/cgroup/cgroup.events /sys/fs/cgroup/cgroup.freeze /sys/fs/cgroup/cgroup.kill /sys/fs/cgroup/cgroup.max.depth /sys/fs/cgroup/cgroup.max.descendants /sys/fs/cgroup/cgroup.pressure /sys/fs/cgroup/cgroup.procs /sys/fs/cgroup/cgroup.stat /sys/fs/cgroup/cgroup.subtree_control /sys/fs/cgroup/cgroup.threads /sys/fs/cgroup/cgroup.type /sys/fs/cgroup/cpu.idle /sys/fs/cgroup/cpu.max /sys/fs/cgroup/cpu.max.burst /sys/fs/cgroup/cpu.pressure /sys/fs/cgroup/cpu.stat /sys/fs/cgroup/cpu.stat.local /sys/fs/cgroup/cpu.uclamp.max /sys/fs/cgroup/cpu.uclamp.min /sys/fs/cgroup/cpu.weight /sys/fs/cgroup/cpu.weight.nice /sys/fs/cgroup/cpuset.cpus /sys/fs/cgroup/cpuset.cpus.effective /sys/fs/cgroup/cpuset.cpus.exclusive /sys/fs/cgroup/cpuset.cpus.exclusive.effective /sys/fs/cgroup/cpuset.cpus.partition /sys/fs/cgroup/cpuset.mems /sys/fs/cgroup/cpuset.mems.effective /sys/fs/cgroup/docker /sys/fs/cgroup/hugetlb.1GB.current /sys/fs/cgroup/hugetlb.1GB.events /sys/fs/cgroup/hugetlb.1GB.events.local /sys/fs/cgroup/hugetlb.1GB.max /sys/fs/cgroup/hugetlb.1GB.numa_stat /sys/fs/cgroup/hugetlb.1GB.rsvd.current /sys/fs/cgroup/hugetlb.1GB.rsvd.max /sys/fs/cgroup/hugetlb.2MB.current /sys/fs/cgroup/hugetlb.2MB.events /sys/fs/cgroup/hugetlb.2MB.events.local /sys/fs/cgroup/hugetlb.2MB.max /sys/fs/cgroup/hugetlb.2MB.numa_stat /sys/fs/cgroup/hugetlb.2MB.rsvd.current /sys/fs/cgroup/hugetlb.2MB.rsvd.max /sys/fs/cgroup/io.max /sys/fs/cgroup/io.pressure /sys/fs/cgroup/io.prio.class /sys/fs/cgroup/io.stat /sys/fs/cgroup/io.weight /sys/fs/cgroup/memory.current /sys/fs/cgroup/memory.events /sys/fs/cgroup/memory.events.local /sys/fs/cgroup/memory.high /sys/fs/cgroup/memory.low /sys/fs/cgroup/memory.max /sys/fs/cgroup/memory.min /sys/fs/cgroup/memory.numa_stat /sys/fs/cgroup/memory.oom.group /sys/fs/cgroup/memory.peak /sys/fs/cgroup/memory.pressure /sys/fs/cgroup/memory.reclaim /sys/fs/cgroup/memory.stat /sys/fs/cgroup/memory.swap.current /sys/fs/cgroup/memory.swap.events /sys/fs/cgroup/memory.swap.high /sys/fs/cgroup/memory.swap.max /sys/fs/cgroup/memory.swap.peak /sys/fs/cgroup/memory.zswap.current /sys/fs/cgroup/memory.zswap.max /sys/fs/cgroup/memory.zswap.writeback /sys/fs/cgroup/misc.current /sys/fs/cgroup/misc.events /sys/fs/cgroup/misc.max /sys/fs/cgroup/pids.current /sys/fs/cgroup/pids.events /sys/fs/cgroup/pids.max /sys/fs/cgroup/pids.peak /sys/fs/cgroup/rdma.current /sys/fs/cgroup/rdma.max /sys/fs/cgroup /sys
umount: /sys/fs/cgroup/cgroup.controllers: not mounted.
umount: /sys/fs/cgroup/cgroup.events: not mounted.
umount: /sys/fs/cgroup/cgroup.freeze: not mounted.
umount: /sys/fs/cgroup/cgroup.kill: not mounted.
umount: /sys/fs/cgroup/cgroup.max.depth: not mounted.
umount: /sys/fs/cgroup/cgroup.max.descendants: not mounted.
umount: /sys/fs/cgroup/cgroup.pressure: not mounted.
umount: /sys/fs/cgroup/cgroup.procs: not mounted.
umount: /sys/fs/cgroup/cgroup.stat: not mounted.
umount: /sys/fs/cgroup/cgroup.subtree_control: not mounted.
umount: /sys/fs/cgroup/cgroup.threads: not mounted.
umount: /sys/fs/cgroup/cgroup.type: not mounted.
umount: /sys/fs/cgroup/cpu.idle: not mounted.
umount: /sys/fs/cgroup/cpu.max: not mounted.
umount: /sys/fs/cgroup/cpu.max.burst: not mounted.
umount: /sys/fs/cgroup/cpu.pressure: not mounted.
umount: /sys/fs/cgroup/cpu.stat: not mounted.
umount: /sys/fs/cgroup/cpu.stat.local: not mounted.
umount: /sys/fs/cgroup/cpu.uclamp.max: not mounted.
umount: /sys/fs/cgroup/cpu.uclamp.min: not mounted.
umount: /sys/fs/cgroup/cpu.weight: not mounted.
umount: /sys/fs/cgroup/cpu.weight.nice: not mounted.
umount: /sys/fs/cgroup/cpuset.cpus: not mounted.
umount: /sys/fs/cgroup/cpuset.cpus.effective: not mounted.
umount: /sys/fs/cgroup/cpuset.cpus.exclusive: not mounted.
umount: /sys/fs/cgroup/cpuset.cpus.exclusive.effective: not mounted.
umount: /sys/fs/cgroup/cpuset.cpus.partition: not mounted.
umount: /sys/fs/cgroup/cpuset.mems: not mounted.
umount: /sys/fs/cgroup/cpuset.mems.effective: not mounted.
umount: /sys/fs/cgroup/docker: not mounted.
umount: /sys/fs/cgroup/hugetlb.1GB.current: not mounted.
umount: /sys/fs/cgroup/hugetlb.1GB.events: not mounted.
umount: /sys/fs/cgroup/hugetlb.1GB.events.local: not mounted.
umount: /sys/fs/cgroup/hugetlb.1GB.max: not mounted.
umount: /sys/fs/cgroup/hugetlb.1GB.numa_stat: not mounted.
umount: /sys/fs/cgroup/hugetlb.1GB.rsvd.current: not mounted.
umount: /sys/fs/cgroup/hugetlb.1GB.rsvd.max: not mounted.
umount: /sys/fs/cgroup/hugetlb.2MB.current: not mounted.
umount: /sys/fs/cgroup/hugetlb.2MB.events: not mounted.
umount: /sys/fs/cgroup/hugetlb.2MB.events.local: not mounted.
umount: /sys/fs/cgroup/hugetlb.2MB.max: not mounted.
umount: /sys/fs/cgroup/hugetlb.2MB.numa_stat: not mounted.
umount: /sys/fs/cgroup/hugetlb.2MB.rsvd.current: not mounted.
umount: /sys/fs/cgroup/hugetlb.2MB.rsvd.max: not mounted.
umount: /sys/fs/cgroup/io.max: not mounted.
umount: /sys/fs/cgroup/io.pressure: not mounted.
umount: /sys/fs/cgroup/io.prio.class: not mounted.
umount: /sys/fs/cgroup/io.stat: not mounted.
umount: /sys/fs/cgroup/io.weight: not mounted.
umount: /sys/fs/cgroup/memory.current: not mounted.
umount: /sys/fs/cgroup/memory.events: not mounted.
umount: /sys/fs/cgroup/memory.events.local: not mounted.
umount: /sys/fs/cgroup/memory.high: not mounted.
umount: /sys/fs/cgroup/memory.low: not mounted.
umount: /sys/fs/cgroup/memory.max: not mounted.
umount: /sys/fs/cgroup/memory.min: not mounted.
umount: /sys/fs/cgroup/memory.numa_stat: not mounted.
umount: /sys/fs/cgroup/memory.oom.group: not mounted.
umount: /sys/fs/cgroup/memory.peak: not mounted.
umount: /sys/fs/cgroup/memory.pressure: not mounted.
umount: /sys/fs/cgroup/memory.reclaim: not mounted.
umount: /sys/fs/cgroup/memory.stat: not mounted.
umount: /sys/fs/cgroup/memory.swap.current: not mounted.
umount: /sys/fs/cgroup/memory.swap.events: not mounted.
umount: /sys/fs/cgroup/memory.swap.high: not mounted.
umount: /sys/fs/cgroup/memory.swap.max: not mounted.
umount: /sys/fs/cgroup/memory.swap.peak: not mounted.
umount: /sys/fs/cgroup/memory.zswap.current: not mounted.
umount: /sys/fs/cgroup/memory.zswap.max: not mounted.
umount: /sys/fs/cgroup/memory.zswap.writeback: not mounted.
umount: /sys/fs/cgroup/misc.current: not mounted.
umount: /sys/fs/cgroup/misc.events: not mounted.
umount: /sys/fs/cgroup/misc.max: not mounted.
umount: /sys/fs/cgroup/pids.current: not mounted.
umount: /sys/fs/cgroup/pids.events: not mounted.
umount: /sys/fs/cgroup/pids.max: not mounted.
umount: /sys/fs/cgroup/pids.peak: not mounted.
umount: /sys/fs/cgroup/rdma.current: not mounted.
umount: /sys/fs/cgroup/rdma.max: not mounted.
+ true
+ true
+ sudo LANG=C chroot ./fsroot-vs umount /proc
+ true
[ FAIL LOG END ] [ target/sonic-vs.img.gz ]
make: *** [slave.mk:1435: target/sonic-vs.img.gz] Error 1
make[1]: *** [Makefile.work:611: all] Error 2
make[1]: Leaving directory '/var/lib/jenkins/workspace/DevOps-test2/platform-vs'
make: *** [Makefile:53: all] Error 2
|