Content

상위 폴더로 이동
+++ --- Applying local submodule patches --- +++
  already applied: sonic-utilities
  already applied: sonic-swss
  already applied: sonic-swss-new
  already applied: sonic-sairedis-vslib
  already applied: sonic-sairedis-meta
  already applied: sonic-sairedis-SAI
  already applied: sonic-sairedis-SAI-apidef
  already applied: sonic-mgmt-framework
+++ --- Making all --- +++
./scripts/run_with_retry make BLDENV=bookworm -f Makefile.work all
make[1]: Entering directory '/var/lib/jenkins/workspace/DevOps-test2/platform-broadcom'
"SECURE_UPGRADE_PROD_SIGNING_TOOL": ""
~/workspace/DevOps-test2/platform-broadcom/src/sonic-build-hooks ~/workspace/DevOps-test2/platform-broadcom
make[2]: Entering directory '/var/lib/jenkins/workspace/DevOps-test2/platform-broadcom/src/sonic-build-hooks'
dpkg-deb: building package 'sonic-build-hooks' in 'buildinfo/sonic-build-hooks_1.0_all.deb'.
make[2]: Leaving directory '/var/lib/jenkins/workspace/DevOps-test2/platform-broadcom/src/sonic-build-hooks'
~/workspace/DevOps-test2/platform-broadcom
Checking sonic-slave-base image: sonic-slave-bookworm:2f250bfbb4a
Checking sonic-slave-user image: sonic-slave-bookworm-jenkins:65c8aaa3f92
SONiC Build System

Build Configuration
"CONFIGURED_PLATFORM"             : "broadcom"
"CONFIGURED_ARCH"                 : "amd64"
"SONIC_CONFIG_PRINT_DEPENDENCIES" : ""
"SONIC_BUILD_JOBS"                : "4"
"SONIC_CONFIG_MAKE_JOBS"          : "112"
"USE_NATIVE_DOCKERD_FOR_BUILD"    : ""
"SONIC_USE_DOCKER_BUILDKIT"       : ""
"USERNAME"                        : "admin"
"PASSWORD"                        : "YourPaSsWoRd"
"CHANGE_DEFAULT_PASSWORD"         : "n"
"SECURE_UPGRADE_MODE"             : "no_sign"
"SECURE_UPGRADE_DEV_SIGNING_KEY"  : ""
"SECURE_UPGRADE_SIGNING_CERT"     : ""
"SECURE_UPGRADE_PROD_SIGNING_TOOL": ""
"SECURE_UPGRADE_PROD_TOOL_ARGS"   : ""
"ONIE_IMAGE_PART_SIZE"            : ""
"SHUTDOWN_BGP_ON_START"           : ""
"ENABLE_PFCWD_ON_START"           : ""
"SONIC_BUFFER_MODEL"              : ""
"INSTALL_DEBUG_TOOLS"             : ""
"ROUTING_STACK"                   : "frr"
"FRR_USER_UID"                    : "300"
"FRR_USER_GID"                    : "300"
"ENABLE_SYNCD_RPC"                : ""
"SAITHRIFT_V2"                    : ""
"ENABLE_ORGANIZATION_EXTENSIONS"  : "y"
"HTTP_PROXY"                      : ""
"HTTPS_PROXY"                     : ""
"NO_PROXY"                        : ""
"ENABLE_ZTP"                      : ""
"INCLUDE_PDE"                     : ""
"SONIC_DEBUGGING_ON"              : ""
"SONIC_PROFILING_ON"              : ""
"KERNEL_PROCURE_METHOD"           : "build"
"BUILD_TIMESTAMP"                 : "20261001.001515"
"BUILD_LOG_TIMESTAMP"             : "none"
"SONIC_IMAGE_VERSION"             : "etri-202505.27-06c33ab02"
"BLDENV"                          : "bookworm"
"VS_PREPARE_MEM"                  : "yes"
"INCLUDE_MGMT_FRAMEWORK"          : "y"
"INCLUDE_ICCPD"                   : "n"
"INCLUDE_STP"                     : "y"
"INCLUDE_SYSTEM_TELEMETRY"        : "y"
"INCLUDE_SYSTEM_GNMI"             : "y"
"INCLUDE_SYSTEM_BMP"              : "y"
"INCLUDE_SYSTEM_EVENTD"           : "y"
"ENABLE_HOST_SERVICE_ON_START"    : "y"
"INCLUDE_RESTAPI"                 : "n"
"INCLUDE_SFLOW"                   : "y"
"INCLUDE_NAT"                     : "y"
"INCLUDE_DHCP_RELAY"              : "y"
"INCLUDE_DHCP_SERVER"             : "n"
"INCLUDE_P4RT"                    : "n"
"INCLUDE_VS_DASH_SAI"             : "y"
"INCLUDE_KUBERNETES"              : "n"
"INCLUDE_KUBERNETES_MASTER"       : "n"
"INCLUDE_MACSEC"                  : "y"
"INCLUDE_MUX"                     : "y"
"INCLUDE_TEAMD"                   : "y"
"INCLUDE_DASH_HA"                 : "y"
"INCLUDE_ROUTER_ADVERTISER"       : "y"
"INCLUDE_BOOTCHART                : "y"
"ENABLE_BOOTCHART                 : "n"
"INCLUDE_FIPS"                    : "y"
"ENABLE_TRANSLIB_WRITE"           : ""
"ENABLE_NATIVE_WRITE"             : "y"
"ENABLE_DIALOUT"                  : ""
"ENABLE_AUTO_TECH_SUPPORT"        : "y"
"PDDF_SUPPORT"                    : "y"
"MULTIARCH_QEMU_ENVIRON"          : "n"
"SONIC_VERSION_CONTROL_COMPONENTS": "py2,py3,web,git,docker"
"ENABLE_ASAN"                     : "n"
"DEFAULT_CONTAINER_REGISTRY"      : "publicmirror.azurecr.io/"
"CROSS_BUILD_ENVIRON"             : "n"
"LEGACY_SONIC_MGMT_DOCKER"        : "y"
"INCLUDE_EXTERNAL_PATCHES"        : "n"
"PTF_ENV_PY_VER"                  : "py3"
"ENABLE_MULTIDB"                  : ""

mv: cannot move '/etc/apt/sources.list.d/debian.sources' to '/etc/apt/sources.list.d/debian.sources.back': Permission denied
fatal: not a git repository (or any of the parent directories): .git
"SONIC_DPKG_CACHE_METHOD"         : "none"

[ building ] [ target/debs/bookworm/linux-headers-6.1.0-29-2-common_6.1.123-1_all.deb-install ] 
[ building ] [ target/debs/bookworm/libyang-cpp_1.0.73_amd64.deb ] 
[ building ] [ target/debs/bookworm/libyang_1.0.73_amd64.deb-install ] 
[ finished ] [ target/debs/bookworm/libyang-cpp_1.0.73_amd64.deb ] 
[ building ] [ target/debs/bookworm/libnl-3-200_3.7.0-0.2+b1sonic1_amd64.deb-install ] 
[ finished ] [ target/debs/bookworm/linux-headers-6.1.0-29-2-common_6.1.123-1_all.deb-install ] 
[ building ] [ target/python-wheels/bookworm/redis_dump_load-1.1-py3-none-any.whl-install ] 
[ finished ] [ target/python-wheels/bookworm/redis_dump_load-1.1-py3-none-any.whl-install ] 
[ building ] [ target/python-wheels/bookworm/swsssdk-2.0.1-py3-none-any.whl-install ] 
[ finished ] [ target/python-wheels/bookworm/swsssdk-2.0.1-py3-none-any.whl-install ] 
[ building ] [ target/debs/bookworm/libdashapi_1.0.0_amd64.deb-install ] 
[ finished ] [ target/debs/bookworm/libdashapi_1.0.0_amd64.deb-install ] 
[ building ] [ target/docker-base-bookworm.gz-load ] 
[ building ] [ target/debs/bookworm/libyang-dev_1.0.73_amd64.deb ] 
[ finished ] [ target/debs/bookworm/libyang-dev_1.0.73_amd64.deb ] 
[ building ] [ target/debs/bookworm/libsaibcm_13.2.1.7_amd64.deb-install ] 
[ finished ] [ target/debs/bookworm/libsaibcm_13.2.1.7_amd64.deb-install ] 
[ building ] [ target/sonic-broadcom.bin__broadcom-dnx__rfs.squashfs ] 
[ finished ] [ target/debs/bookworm/libyang_1.0.73_amd64.deb-install ] 
[ building ] [ target/debs/bookworm/linux-headers-6.1.0-29-2-amd64_6.1.123-1_amd64.deb-install ] 
[ finished ] [ target/debs/bookworm/linux-headers-6.1.0-29-2-amd64_6.1.123-1_amd64.deb-install ] 
[ building ] [ target/sonic-aboot-broadcom.swi__broadcom__rfs.squashfs ] 
[ finished ] [ target/debs/bookworm/libnl-3-200_3.7.0-0.2+b1sonic1_amd64.deb-install ] 
[ building ] [ target/debs/bookworm/sonic-platform-pddf_1.1_amd64.deb ] 
[ finished ] [ target/docker-base-bookworm.gz-load ] 
[ building ] [ target/debs/bookworm/platform-modules-z9100_1.1_amd64.deb ] 
[ finished ] [ target/debs/bookworm/sonic-platform-pddf_1.1_amd64.deb ] 
[ building ] [ target/debs/bookworm/sonic-platform-quanta-ix1b-32x_1.0_amd64.deb ] 
[ finished ] [ target/debs/bookworm/sonic-platform-quanta-ix1b-32x_1.0_amd64.deb ] 
[ building ] [ target/debs/bookworm/sonic-platform-alphanetworks-snh60a0-320fv2_1.0_amd64.deb ] 
[ finished ] [ target/debs/bookworm/sonic-platform-alphanetworks-snh60a0-320fv2_1.0_amd64.deb ] 
[ building ] [ target/debs/bookworm/sonic-platform-nokia-chassis_1.0_amd64.deb ] 
[ finished ] [ target/debs/bookworm/platform-modules-z9100_1.1_amd64.deb ] 
[ building ] [ target/debs/bookworm/sonic-platform-pddf_1.1_amd64.deb-install ] 
[ finished ] [ target/debs/bookworm/sonic-platform-pddf_1.1_amd64.deb-install ] 
[ building ] [ target/debs/bookworm/opennsl-modules_13.2.1.0_amd64.deb ] 
[ finished ] [ target/debs/bookworm/opennsl-modules_13.2.1.0_amd64.deb ] 
[ building ] [ target/debs/bookworm/python3-yang_1.0.73_amd64.deb ] 
[ finished ] [ target/debs/bookworm/python3-yang_1.0.73_amd64.deb ] 
[ building ] [ target/debs/bookworm/libyang-cpp_1.0.73_amd64.deb-install ] 
[ finished ] [ target/debs/bookworm/libyang-cpp_1.0.73_amd64.deb-install ] 
[ building ] [ target/debs/bookworm/libnl-3-dev_3.7.0-0.2+b1sonic1_amd64.deb-install ] 
[ finished ] [ target/debs/bookworm/libnl-3-dev_3.7.0-0.2+b1sonic1_amd64.deb-install ] 
[ building ] [ target/debs/bookworm/libnl-genl-3-200_3.7.0-0.2+b1sonic1_amd64.deb-install ] 
[ finished ] [ target/debs/bookworm/libnl-genl-3-200_3.7.0-0.2+b1sonic1_amd64.deb-install ] 
[ building ] [ target/debs/bookworm/libnl-route-3-200_3.7.0-0.2+b1sonic1_amd64.deb-install ] 
[ finished ] [ target/debs/bookworm/libnl-route-3-200_3.7.0-0.2+b1sonic1_amd64.deb-install ] 
[ building ] [ target/debs/bookworm/libnl-genl-3-dev_3.7.0-0.2+b1sonic1_amd64.deb-install ] 
[ finished ] [ target/debs/bookworm/libnl-genl-3-dev_3.7.0-0.2+b1sonic1_amd64.deb-install ] 
[ building ] [ target/debs/bookworm/libnl-route-3-dev_3.7.0-0.2+b1sonic1_amd64.deb-install ] 
[ finished ] [ target/debs/bookworm/libnl-route-3-dev_3.7.0-0.2+b1sonic1_amd64.deb-install ] 
[ building ] [ target/debs/bookworm/libyang-dev_1.0.73_amd64.deb-install ] 
[ finished ] [ target/debs/bookworm/libyang-dev_1.0.73_amd64.deb-install ] 
[ building ] [ target/debs/bookworm/python3-yang_1.0.73_amd64.deb-install ] 
[ finished ] [ target/debs/bookworm/python3-yang_1.0.73_amd64.deb-install ] 
[ building ] [ target/debs/bookworm/libnl-nf-3-200_3.7.0-0.2+b1sonic1_amd64.deb-install ] 
[ finished ] [ target/debs/bookworm/libnl-nf-3-200_3.7.0-0.2+b1sonic1_amd64.deb-install ] 
[ building ] [ target/debs/bookworm/libsaibcm-dev_13.2.1.7_amd64.deb-install ] 
dpkg-query: package 'libsaivs-dev' is not installed and no information is available
Use dpkg --info (= dpkg-deb --info) to examine archive files.
[ finished ] [ target/debs/bookworm/libsaibcm-dev_13.2.1.7_amd64.deb-install ] 
[ building ] [ target/debs/bookworm/libnl-nf-3-dev_3.7.0-0.2+b1sonic1_amd64.deb-install ] 
[ finished ] [ target/debs/bookworm/libnl-nf-3-dev_3.7.0-0.2+b1sonic1_amd64.deb-install ] 
[ building ] [ target/debs/bookworm/sonic-platform-arista_1.0_amd64.deb ] 
[ finished ] [ target/sonic-broadcom.bin__broadcom-dnx__rfs.squashfs ] 
[ building ] [ target/debs/bookworm/platform-modules-s6000_1.1_amd64.deb ] 
[ finished ] [ target/debs/bookworm/platform-modules-s6000_1.1_amd64.deb ] 
[ building ] [ target/debs/bookworm/platform-modules-z9264f_1.1_amd64.deb ] 
[ finished ] [ target/debs/bookworm/platform-modules-z9264f_1.1_amd64.deb ] 
[ building ] [ target/debs/bookworm/platform-modules-s5212f_1.1_amd64.deb ] 
[ finished ] [ target/debs/bookworm/platform-modules-s5212f_1.1_amd64.deb ] 
[ building ] [ target/debs/bookworm/platform-modules-s5224f_1.1_amd64.deb ] 
[ finished ] [ target/debs/bookworm/platform-modules-s5224f_1.1_amd64.deb ] 
[ building ] [ target/debs/bookworm/platform-modules-s5232f_1.1_amd64.deb ] 
[ finished ] [ target/debs/bookworm/platform-modules-s5232f_1.1_amd64.deb ] 
[ building ] [ target/debs/bookworm/platform-modules-s5248f_1.1_amd64.deb ] 
[ finished ] [ target/debs/bookworm/platform-modules-s5248f_1.1_amd64.deb ] 
[ building ] [ target/debs/bookworm/platform-modules-z9332f_1.1_amd64.deb ] 
[ finished ] [ target/debs/bookworm/platform-modules-z9332f_1.1_amd64.deb ] 
[ building ] [ target/debs/bookworm/platform-modules-z9432f_1.1_amd64.deb ] 
[ finished ] [ target/debs/bookworm/platform-modules-z9432f_1.1_amd64.deb ] 
[ building ] [ target/debs/bookworm/platform-modules-s5296f_1.1_amd64.deb ] 
[ finished ] [ target/debs/bookworm/platform-modules-s5296f_1.1_amd64.deb ] 
[ building ] [ target/debs/bookworm/platform-modules-s6100_1.1_amd64.deb ] 
[ finished ] [ target/debs/bookworm/platform-modules-s6100_1.1_amd64.deb ] 
[ building ] [ target/debs/bookworm/platform-modules-n3248pxe_1.1_amd64.deb ] 
[ finished ] [ target/debs/bookworm/platform-modules-n3248pxe_1.1_amd64.deb ] 
[ building ] [ target/debs/bookworm/platform-modules-n3248te_1.1_amd64.deb ] 
[ finished ] [ target/debs/bookworm/platform-modules-n3248te_1.1_amd64.deb ] 
[ building ] [ target/debs/bookworm/platform-modules-e3224f_1.1_amd64.deb ] 
[ finished ] [ target/debs/bookworm/platform-modules-e3224f_1.1_amd64.deb ] 
[ building ] [ target/debs/bookworm/platform-modules-z9664f_1.1_amd64.deb ] 
[ finished ] [ target/debs/bookworm/platform-modules-z9664f_1.1_amd64.deb ] 
[ building ] [ target/debs/bookworm/sonic-platform-pddf-sym_1.1_amd64.deb ] 
[ finished ] [ target/debs/bookworm/sonic-platform-pddf-sym_1.1_amd64.deb ] 
[ building ] [ target/debs/bookworm/sonic-platform-quanta-ix7-32x_1.0_amd64.deb ] 
[ finished ] [ target/debs/bookworm/sonic-platform-quanta-ix7-32x_1.0_amd64.deb ] 
[ building ] [ target/debs/bookworm/sonic-platform-quanta-ix7-bwde-32x_1.0_amd64.deb ] 
[ finished ] [ target/debs/bookworm/sonic-platform-quanta-ix7-bwde-32x_1.0_amd64.deb ] 
[ building ] [ target/debs/bookworm/sonic-platform-quanta-ix8-56x_1.0_amd64.deb ] 
[ finished ] [ target/debs/bookworm/sonic-platform-quanta-ix8-56x_1.0_amd64.deb ] 
[ building ] [ target/debs/bookworm/sonic-platform-quanta-ix8a-bwde-56x_1.0_amd64.deb ] 
[ finished ] [ target/debs/bookworm/sonic-platform-quanta-ix8a-bwde-56x_1.0_amd64.deb ] 
[ building ] [ target/debs/bookworm/sonic-platform-quanta-ix8c-56x_1.0_amd64.deb ] 
[ finished ] [ target/debs/bookworm/sonic-platform-quanta-ix8c-56x_1.0_amd64.deb ] 
[ building ] [ target/debs/bookworm/sonic-platform-quanta-ix9-32x_1.0_amd64.deb ] 
[ finished ] [ target/debs/bookworm/sonic-platform-quanta-ix9-32x_1.0_amd64.deb ] 
[ building ] [ target/debs/bookworm/sonic-platform-alphanetworks-snh60b0-640f_1.0_amd64.deb ] 
[ finished ] [ target/debs/bookworm/sonic-platform-alphanetworks-snh60b0-640f_1.0_amd64.deb ] 
[ building ] [ target/debs/bookworm/sonic-platform-alphanetworks-snj60d0-320f_1.0_amd64.deb ] 
[ finished ] [ target/debs/bookworm/sonic-platform-alphanetworks-snj60d0-320f_1.0_amd64.deb ] 
[ building ] [ target/debs/bookworm/sonic-platform-alphanetworks-bes2348t_1.0_amd64.deb ] 
[ finished ] [ target/debs/bookworm/sonic-platform-alphanetworks-bes2348t_1.0_amd64.deb ] 
[ building ] [ target/debs/bookworm/sonic-platform-pddf-sym_1.1_amd64.deb-install ] 
[ finished ] [ target/debs/bookworm/sonic-platform-pddf-sym_1.1_amd64.deb-install ] 
[ building ] [ target/debs/bookworm/platform-modules-micas-m2-w6510-48v8c_1.0_amd64.deb ] 
[ finished ] [ target/sonic-aboot-broadcom.swi__broadcom__rfs.squashfs ] 
[ building ] [ target/debs/bookworm/opennsl-modules-dnx_13.2.1.1_amd64.deb ] 
[ finished ] [ target/debs/bookworm/opennsl-modules-dnx_13.2.1.1_amd64.deb ] 
[ building ] [ target/python-wheels/bookworm/sonic_yang_models-1.0-py3-none-any.whl ] 
[ finished ] [ target/debs/bookworm/sonic-platform-arista_1.0_amd64.deb ] 
[ building ] [ target/debs/bookworm/libnl-cli-3-200_3.7.0-0.2+b1sonic1_amd64.deb-install ] 
[ finished ] [ target/debs/bookworm/libnl-cli-3-200_3.7.0-0.2+b1sonic1_amd64.deb-install ] 
[ building ] [ target/sonic-broadcom.bin__broadcom__rfs.squashfs ] 
[ finished ] [ target/python-wheels/bookworm/sonic_yang_models-1.0-py3-none-any.whl ] 
[ building ] [ target/debs/bookworm/python3-sonic-platform-arista_1.0_all.deb ] 
[ finished ] [ target/debs/bookworm/python3-sonic-platform-arista_1.0_all.deb ] 
[ building ] [ target/debs/bookworm/drivers-sonic-platform-arista_1.0_amd64.deb ] 
[ finished ] [ target/debs/bookworm/drivers-sonic-platform-arista_1.0_amd64.deb ] 
[ building ] [ target/debs/bookworm/sonic-platform-arista-libs_1.0_amd64.deb ] 
[ finished ] [ target/debs/bookworm/sonic-platform-arista-libs_1.0_amd64.deb ] 
[ building ] [ target/debs/bookworm/sonic-platform-accton-as7712-32x_1.1_amd64.deb ] 
[ finished ] [ target/debs/bookworm/platform-modules-micas-m2-w6510-48v8c_1.0_amd64.deb ] 
[ finished ] [ target/debs/bookworm/sonic-platform-nokia-chassis_1.0_amd64.deb ] 
[ building ] [ target/debs/bookworm/platform-modules-dx010_1.0_amd64.deb ] 
[ building ] [ target/debs/bookworm/sonic-platform-ufispace-s9300-32d_1.0.0_amd64.deb ] 
[ finished ] [ target/debs/bookworm/sonic-platform-accton-as7712-32x_1.1_amd64.deb ] 
[ building ] [ target/debs/bookworm/platform-modules-micas-m2-w6510-48gt4v_1.0_amd64.deb ] 
[ finished ] [ target/debs/bookworm/platform-modules-micas-m2-w6510-48gt4v_1.0_amd64.deb ] 
[ building ] [ target/debs/bookworm/platform-modules-micas-m2-w6520-24dc8qc_1.0_amd64.deb ] 
[ finished ] [ target/debs/bookworm/platform-modules-micas-m2-w6520-24dc8qc_1.0_amd64.deb ] 
[ building ] [ target/debs/bookworm/platform-modules-micas-m2-w6940-128qc_1.0_amd64.deb ] 
[ finished ] [ target/debs/bookworm/platform-modules-micas-m2-w6940-128qc_1.0_amd64.deb ] 
[ building ] [ target/debs/bookworm/platform-modules-micas-m2-w6930-64qc_1.0_amd64.deb ] 
[ finished ] [ target/debs/bookworm/platform-modules-micas-m2-w6930-64qc_1.0_amd64.deb ] 
[ building ] [ target/debs/bookworm/platform-modules-micas-m2-w6940-64oc_1.0_amd64.deb ] 
[ finished ] [ target/debs/bookworm/platform-modules-micas-m2-w6940-64oc_1.0_amd64.deb ] 
[ building ] [ target/debs/bookworm/platform-modules-micas-m2-w6920-32qc2x_1.0_amd64.deb ] 
[ finished ] [ target/debs/bookworm/platform-modules-micas-m2-w6920-32qc2x_1.0_amd64.deb ] 
[ building ] [ target/debs/bookworm/platform-modules-micas-m2-w6510-32c_1.0_amd64.deb ] 
[ finished ] [ target/debs/bookworm/platform-modules-micas-m2-w6510-32c_1.0_amd64.deb ] 
[ building ] [ target/debs/bookworm/platform-modules-micas-m2-w6520-48c8qc_1.0_amd64.deb ] 
[ finished ] [ target/debs/bookworm/platform-modules-micas-m2-w6520-48c8qc_1.0_amd64.deb ] 
[ building ] [ target/python-wheels/bookworm/sonic_yang_models-1.0-py3-none-any.whl-install ] 
[ finished ] [ target/python-wheels/bookworm/sonic_yang_models-1.0-py3-none-any.whl-install ] 
[ building ] [ target/debs/bookworm/libnl-cli-3-dev_3.7.0-0.2+b1sonic1_amd64.deb-install ] 
[ finished ] [ target/debs/bookworm/libnl-cli-3-dev_3.7.0-0.2+b1sonic1_amd64.deb-install ] 
[ building ] [ target/debs/bookworm/sonic-mgmt-common_1.0.0_amd64.deb ] 
[ finished ] [ target/debs/bookworm/platform-modules-dx010_1.0_amd64.deb ] 
[ building ] [ target/debs/bookworm/sonic-platform-accton-as5712-54x_1.1_amd64.deb ] 
[ finished ] [ target/debs/bookworm/sonic-platform-accton-as5712-54x_1.1_amd64.deb ] 
[ building ] [ target/debs/bookworm/sonic-platform-accton-as7816-64x_1.1_amd64.deb ] 
[ finished ] [ target/debs/bookworm/sonic-platform-accton-as7816-64x_1.1_amd64.deb ] 
[ building ] [ target/debs/bookworm/sonic-platform-accton-as7716-32x_1.1_amd64.deb ] 
[ finished ] [ target/debs/bookworm/sonic-platform-accton-as7716-32x_1.1_amd64.deb ] 
[ building ] [ target/debs/bookworm/sonic-platform-accton-as7312-54x_1.1_amd64.deb ] 
[ finished ] [ target/debs/bookworm/sonic-platform-accton-as7312-54x_1.1_amd64.deb ] 
[ building ] [ target/debs/bookworm/sonic-platform-accton-as7326-56x_1.1_amd64.deb ] 
[ finished ] [ target/debs/bookworm/sonic-platform-accton-as7326-56x_1.1_amd64.deb ] 
[ building ] [ target/debs/bookworm/sonic-platform-accton-as7716-32xb_1.1_amd64.deb ] 
[ finished ] [ target/debs/bookworm/sonic-platform-accton-as7716-32xb_1.1_amd64.deb ] 
[ building ] [ target/debs/bookworm/sonic-platform-accton-as6712-32x_1.1_amd64.deb ] 
[ finished ] [ target/debs/bookworm/sonic-platform-accton-as6712-32x_1.1_amd64.deb ] 
[ building ] [ target/debs/bookworm/sonic-platform-accton-as7726-32x_1.1_amd64.deb ] 
[ finished ] [ target/debs/bookworm/sonic-platform-accton-as7726-32x_1.1_amd64.deb ] 
[ building ] [ target/debs/bookworm/sonic-platform-accton-as4630-54pe_1.1_amd64.deb ] 
[ finished ] [ target/debs/bookworm/sonic-platform-accton-as4630-54pe_1.1_amd64.deb ] 
[ building ] [ target/debs/bookworm/sonic-platform-accton-as4630-54te_1.1_amd64.deb ] 
[ finished ] [ target/debs/bookworm/sonic-platform-accton-as4630-54te_1.1_amd64.deb ] 
[ building ] [ target/debs/bookworm/sonic-platform-accton-minipack_1.1_amd64.deb ] 
[ finished ] [ target/debs/bookworm/sonic-platform-accton-minipack_1.1_amd64.deb ] 
[ building ] [ target/debs/bookworm/sonic-platform-accton-as5812-54x_1.1_amd64.deb ] 
[ finished ] [ target/debs/bookworm/sonic-platform-accton-as5812-54x_1.1_amd64.deb ] 
[ building ] [ target/debs/bookworm/sonic-platform-accton-as5812-54t_1.1_amd64.deb ] 
[ finished ] [ target/debs/bookworm/sonic-platform-accton-as5812-54t_1.1_amd64.deb ] 
[ building ] [ target/debs/bookworm/sonic-platform-accton-as5835-54x_1.1_amd64.deb ] 
[ finished ] [ target/debs/bookworm/sonic-platform-accton-as5835-54x_1.1_amd64.deb ] 
[ building ] [ target/debs/bookworm/sonic-platform-accton-as9716-32d_1.1_amd64.deb ] 
[ finished ] [ target/debs/bookworm/sonic-platform-accton-as9716-32d_1.1_amd64.deb ] 
[ building ] [ target/debs/bookworm/sonic-platform-accton-as9726-32d_1.1_amd64.deb ] 
[ finished ] [ target/debs/bookworm/sonic-platform-accton-as9726-32d_1.1_amd64.deb ] 
[ building ] [ target/debs/bookworm/sonic-platform-accton-as5835-54t_1.1_amd64.deb ] 
[ finished ] [ target/debs/bookworm/sonic-platform-accton-as5835-54t_1.1_amd64.deb ] 
[ building ] [ target/debs/bookworm/sonic-platform-accton-as7312-54xs_1.1_amd64.deb ] 
[ finished ] [ target/debs/bookworm/sonic-platform-accton-as7312-54xs_1.1_amd64.deb ] 
[ building ] [ target/debs/bookworm/sonic-platform-accton-as7315-27xb_1.1_amd64.deb ] 
[ finished ] [ target/debs/bookworm/sonic-platform-accton-as7315-27xb_1.1_amd64.deb ] 
[ building ] [ target/debs/bookworm/platform-modules-haliburton_1.0_amd64.deb ] 
[ finished ] [ target/debs/bookworm/platform-modules-haliburton_1.0_amd64.deb ] 
[ building ] [ target/debs/bookworm/platform-modules-seastone2_1.0_amd64.deb ] 
[ finished ] [ target/debs/bookworm/platform-modules-seastone2_1.0_amd64.deb ] 
[ building ] [ target/debs/bookworm/platform-modules-ds3000_1.0_amd64.deb ] 
[ finished ] [ target/debs/bookworm/platform-modules-ds3000_1.0_amd64.deb ] 
[ building ] [ target/debs/bookworm/platform-modules-ds1000_1.0_amd64.deb ] 
[ finished ] [ target/debs/bookworm/platform-modules-ds1000_1.0_amd64.deb ] 
[ building ] [ target/debs/bookworm/platform-modules-questone2_1.0_amd64.deb ] 
[ finished ] [ target/debs/bookworm/platform-modules-questone2_1.0_amd64.deb ] 
[ building ] [ target/debs/bookworm/platform-modules-silverstone-v2_1.0_amd64.deb ] 
[ finished ] [ target/debs/bookworm/platform-modules-silverstone-v2_1.0_amd64.deb ] 
[ building ] [ target/debs/bookworm/platform-modules-ds2000_1.0_amd64.deb ] 
[ finished ] [ target/debs/bookworm/platform-modules-ds2000_1.0_amd64.deb ] 
[ building ] [ target/debs/bookworm/platform-modules-silverstone_1.0_amd64.deb ] 
[ finished ] [ target/debs/bookworm/platform-modules-silverstone_1.0_amd64.deb ] 
[ building ] [ target/debs/bookworm/sonic-platform-nokia-ixr7220d4_1.0_amd64.deb ] 
[ finished ] [ target/debs/bookworm/sonic-platform-nokia-ixr7220d4_1.0_amd64.deb ] 
[ building ] [ target/debs/bookworm/sonic-platform-nokia-ixr7220h3_1.0_amd64.deb ] 
[ finished ] [ target/debs/bookworm/sonic-platform-nokia-ixr7220h3_1.0_amd64.deb ] 
[ building ] [ target/debs/bookworm/sonic-platform-nokia-ixr7220h4-32d_1.0_amd64.deb ] 
[ finished ] [ target/debs/bookworm/sonic-platform-nokia-ixr7220h4-32d_1.0_amd64.deb ] 
[ building ] [ target/debs/bookworm/sonic-platform-nokia-ixr7220h4-64d_1.0_amd64.deb ] 
[ finished ] [ target/debs/bookworm/sonic-platform-nokia-ixr7220h4-64d_1.0_amd64.deb ] 
[ building ] [ target/debs/bookworm/sonic-platform-nokia-ixr7220h5-64o_1.0_amd64.deb ] 
[ finished ] [ target/debs/bookworm/sonic-platform-nokia-ixr7220h5-64o_1.0_amd64.deb ] 
[ building ] [ target/debs/bookworm/sonic-platform-nokia-ixr7220h5-64d_1.0_amd64.deb ] 
[ finished ] [ target/debs/bookworm/sonic-platform-nokia-ixr7220h5-64d_1.0_amd64.deb ] 
[ building ] [ target/debs/bookworm/sonic-platform-nokia-ixr7220h5-32d_1.0_amd64.deb ] 
[ finished ] [ target/debs/bookworm/sonic-platform-nokia-ixr7220h5-32d_1.0_amd64.deb ] 
[ building ] [ target/debs/bookworm/sonic-platform-nokia-ixr7250x1b_1.0_amd64.deb ] 
[ finished ] [ target/debs/bookworm/sonic-platform-nokia-ixr7250x1b_1.0_amd64.deb ] 
[ building ] [ target/debs/bookworm/sonic-platform-nokia-ixr7250x3b_1.0_amd64.deb ] 
[ finished ] [ target/debs/bookworm/sonic-platform-nokia-ixr7250x3b_1.0_amd64.deb ] 
[ building ] [ target/python-wheels/bookworm/sonic_yang_mgmt-1.0-py3-none-any.whl ] 
[ finished ] [ target/sonic-broadcom.bin__broadcom__rfs.squashfs ] 
[ building ] [ target/debs/bookworm/libteam5_1.31-1_amd64.deb-install ] 
[ finished ] [ target/debs/bookworm/libteam5_1.31-1_amd64.deb-install ] 
[ building ] [ target/debs/bookworm/libteamdctl0_1.31-1_amd64.deb-install ] 
[ finished ] [ target/debs/bookworm/libteamdctl0_1.31-1_amd64.deb-install ] 
[ building ] [ target/debs/bookworm/libteam-dev_1.31-1_amd64.deb-install ] 
[ finished ] [ target/debs/bookworm/libteam-dev_1.31-1_amd64.deb-install ] 
[ building ] [ target/debs/bookworm/libteam-utils_1.31-1_amd64.deb-install ] 
[ finished ] [ target/debs/bookworm/libteam-utils_1.31-1_amd64.deb-install ] 
[ finished ] [ target/debs/bookworm/sonic-mgmt-common_1.0.0_amd64.deb ] 
[ finished ] [ target/debs/bookworm/sonic-platform-ufispace-s9300-32d_1.0.0_amd64.deb ] 
[ finished ] [ target/python-wheels/bookworm/sonic_yang_mgmt-1.0-py3-none-any.whl ] 
[ building ] [ target/python-wheels/bookworm/sonic_yang_mgmt-1.0-py3-none-any.whl-install ] 
[ finished ] [ target/python-wheels/bookworm/sonic_yang_mgmt-1.0-py3-none-any.whl-install ] 
[ building ] [ target/debs/bookworm/libswsscommon_1.0.0_amd64.deb ] 
[ building ] [ target/debs/bookworm/sonic-mgmt-common-codegen_1.0.0_amd64.deb ] 
[ building ] [ target/debs/bookworm/sonic-mgmt-common_1.0.0_amd64.deb-install ] 
[ finished ] [ target/debs/bookworm/sonic-mgmt-common-codegen_1.0.0_amd64.deb ] 
[ building ] [ target/debs/bookworm/sonic-platform-ufispace-s6301-56st_1.0.0_amd64.deb ] 
[ building ] [ target/debs/bookworm/sonic-platform-ufispace-s7801-54xs_1.0.0_amd64.deb ] 
[ finished ] [ target/debs/bookworm/sonic-platform-ufispace-s6301-56st_1.0.0_amd64.deb ] 
[ finished ] [ target/debs/bookworm/sonic-platform-ufispace-s7801-54xs_1.0.0_amd64.deb ] 
[ building ] [ target/debs/bookworm/sonic-platform-ufispace-s8901-54xc_1.0.0_amd64.deb ] 
[ building ] [ target/debs/bookworm/sonic-platform-ufispace-s9110-32x_1.0.0_amd64.deb ] 
[ finished ] [ target/debs/bookworm/sonic-platform-ufispace-s8901-54xc_1.0.0_amd64.deb ] 
[ finished ] [ target/debs/bookworm/sonic-platform-ufispace-s9110-32x_1.0.0_amd64.deb ] 
[ building ] [ target/debs/bookworm/sonic-platform-ufispace-s9301-32d_1.0.0_amd64.deb ] 
[ building ] [ target/debs/bookworm/sonic-platform-ufispace-s9301-32db_1.0.0_amd64.deb ] 
[ finished ] [ target/debs/bookworm/sonic-platform-ufispace-s9301-32d_1.0.0_amd64.deb ] 
[ finished ] [ target/debs/bookworm/sonic-platform-ufispace-s9301-32db_1.0.0_amd64.deb ] 
[ building ] [ target/debs/bookworm/sonic-platform-ufispace-s9321-64e_1.0.0_amd64.deb ] 
[ building ] [ target/debs/bookworm/sonic-platform-ufispace-s9321-64eo_1.0.0_amd64.deb ] 
[ finished ] [ target/debs/bookworm/sonic-platform-ufispace-s9321-64e_1.0.0_amd64.deb ] 
[ finished ] [ target/debs/bookworm/sonic-platform-ufispace-s9321-64eo_1.0.0_amd64.deb ] 
[ finished ] [ target/debs/bookworm/sonic-mgmt-common_1.0.0_amd64.deb-install ] 
[ building ] [ target/debs/bookworm/sonic-mgmt-common-codegen_1.0.0_amd64.deb-install ] 
[ finished ] [ target/debs/bookworm/sonic-mgmt-common-codegen_1.0.0_amd64.deb-install ] 
[ building ] [ target/debs/bookworm/sonic-mgmt-framework_1.0-01_amd64.deb ] 
[ finished ] [ target/debs/bookworm/sonic-mgmt-framework_1.0-01_amd64.deb ] 
[ finished ] [ target/debs/bookworm/libswsscommon_1.0.0_amd64.deb ] 
[ building ] [ target/debs/bookworm/python3-swsscommon_1.0.0_amd64.deb ] 
[ building ] [ target/debs/bookworm/sonic-db-cli_1.0.0_amd64.deb ] 
[ finished ] [ target/debs/bookworm/python3-swsscommon_1.0.0_amd64.deb ] 
[ finished ] [ target/debs/bookworm/sonic-db-cli_1.0.0_amd64.deb ] 
[ building ] [ target/debs/bookworm/libswsscommon-dev_1.0.0_amd64.deb ] 
[ building ] [ target/debs/bookworm/libswsscommon_1.0.0_amd64.deb-install ] 
[ finished ] [ target/debs/bookworm/libswsscommon-dev_1.0.0_amd64.deb ] 
[ finished ] [ target/debs/bookworm/libswsscommon_1.0.0_amd64.deb-install ] 
[ building ] [ target/debs/bookworm/libswsscommon-dev_1.0.0_amd64.deb-install ] 
[ building ] [ target/debs/bookworm/python3-swsscommon_1.0.0_amd64.deb-install ] 
[ finished ] [ target/debs/bookworm/libswsscommon-dev_1.0.0_amd64.deb-install ] 
[ building ] [ target/debs/bookworm/sonic-eventd_1.0.0-0_amd64.deb ] 
[ building ] [ target/debs/bookworm/sonic-bmp_0.1_amd64.deb ] 
[ building ] [ target/debs/bookworm/dash-ha_1.0.0_amd64.deb ] 
[ finished ] [ target/debs/bookworm/python3-swsscommon_1.0.0_amd64.deb-install ] 
[ building ] [ target/debs/bookworm/libsairedis_1.0.0_amd64.deb ] 
[ finished ] [ target/debs/bookworm/sonic-eventd_1.0.0-0_amd64.deb ] 
[ building ] [ target/debs/bookworm/stp_1.0.0_amd64.deb ] 
[ finished ] [ target/debs/bookworm/dash-ha_1.0.0_amd64.deb ] 
[ building ] [ target/debs/bookworm/sonic-gnmi_0.1_amd64.deb ] 
[ finished ] [ target/debs/bookworm/stp_1.0.0_amd64.deb ] 
[ building ] [ target/debs/bookworm/sonic-linkmgrd_1.0.0-1_amd64.deb ] 
[ finished ] [ target/debs/bookworm/sonic-bmp_0.1_amd64.deb ] 
[ building ] [ target/debs/bookworm/sysmgr_1.0.0_amd64.deb ] 
[ finished ] [ target/debs/bookworm/sonic-gnmi_0.1_amd64.deb ] 
[ building ] [ target/debs/bookworm/sonic-dhcpmon_1.0.0-0_amd64.deb ] 
[ finished ] [ target/debs/bookworm/sonic-dhcpmon_1.0.0-0_amd64.deb ] 
[ building ] [ target/debs/bookworm/sonic-dhcp6relay_1.0.0-0_amd64.deb ] 
[ finished ] [ target/debs/bookworm/sysmgr_1.0.0_amd64.deb ] 
[ building ] [ target/debs/bookworm/wpasupplicant_2.9.0-14_amd64.deb ] 
[ finished ] [ target/debs/bookworm/sonic-dhcp6relay_1.0.0-0_amd64.deb ] 
[ building ] [ target/debs/bookworm/sonic-rsyslog-plugin_1.0.0-0_amd64.deb ] 
[ finished ] [ target/debs/bookworm/sonic-rsyslog-plugin_1.0.0-0_amd64.deb ] 
[ building ] [ target/python-wheels/bookworm/sonic_py_common-1.0-py3-none-any.whl ] 
[ finished ] [ target/python-wheels/bookworm/sonic_py_common-1.0-py3-none-any.whl ] 
[ building ] [ target/debs/bookworm/sonic-bmp_0.1_amd64.deb-install ] 
[ finished ] [ target/debs/bookworm/sonic-bmp_0.1_amd64.deb-install ] 
[ building ] [ target/debs/bookworm/stp_1.0.0_amd64.deb-install ] 
[ finished ] [ target/debs/bookworm/stp_1.0.0_amd64.deb-install ] 
[ building ] [ target/python-wheels/bookworm/sonic_py_common-1.0-py3-none-any.whl-install ] 
[ finished ] [ target/python-wheels/bookworm/sonic_py_common-1.0-py3-none-any.whl-install ] 
[ building ] [ target/python-wheels/bookworm/sonic_containercfgd-1.0-py3-none-any.whl ] 
[ finished ] [ target/debs/bookworm/libsairedis_1.0.0_amd64.deb ] 
[ building ] [ target/python-wheels/bookworm/sonic_config_engine-1.0-py3-none-any.whl ] 
[ finished ] [ target/python-wheels/bookworm/sonic_containercfgd-1.0-py3-none-any.whl ] 
[ building ] [ target/debs/bookworm/libsairedis-dev_1.0.0_amd64.deb ] 
[ finished ] [ target/debs/bookworm/libsairedis-dev_1.0.0_amd64.deb ] 
[ building ] [ target/debs/bookworm/libsaimetadata_1.0.0_amd64.deb ] 
[ finished ] [ target/debs/bookworm/libsaimetadata_1.0.0_amd64.deb ] 
[ building ] [ target/debs/bookworm/libsaivs_1.0.0_amd64.deb ] 
[ finished ] [ target/debs/bookworm/libsaivs_1.0.0_amd64.deb ] 
[ building ] [ target/debs/bookworm/libsairedis_1.0.0_amd64.deb-install ] 
[ finished ] [ target/debs/bookworm/libsairedis_1.0.0_amd64.deb-install ] 
[ building ] [ target/python-wheels/bookworm/sonic_d-2.0.0-py3-none-any.whl ] 
[ finished ] [ target/debs/bookworm/wpasupplicant_2.9.0-14_amd64.deb ] 
[ building ] [ target/python-wheels/bookworm/sonic_ledd-1.1-py3-none-any.whl ] 
[ finished ] [ target/python-wheels/bookworm/sonic_ledd-1.1-py3-none-any.whl ] 
[ building ] [ target/python-wheels/bookworm/sonic_pcied-1.0-py3-none-any.whl ] 
[ finished ] [ target/python-wheels/bookworm/sonic_d-2.0.0-py3-none-any.whl ] 
[ building ] [ target/python-wheels/bookworm/sonic_stormond-1.0-py3-none-any.whl ] 
[ finished ] [ target/python-wheels/bookworm/sonic_pcied-1.0-py3-none-any.whl ] 
[ building ] [ target/debs/bookworm/syncd_1.0.0_amd64.deb ] 
[ finished ] [ target/python-wheels/bookworm/sonic_stormond-1.0-py3-none-any.whl ] 
[ building ] [ target/python-wheels/bookworm/sonic_dhcp_utilities-1.0-py3-none-any.whl ] 
[ finished ] [ target/python-wheels/bookworm/sonic_dhcp_utilities-1.0-py3-none-any.whl ] 
[ building ] [ target/python-wheels/bookworm/sonic_ctrmgrd-1.0.0-py3-none-any.whl ] 
[ finished ] [ target/python-wheels/bookworm/sonic_ctrmgrd-1.0.0-py3-none-any.whl ] 
[ building ] [ target/debs/bookworm/libsaimetadata-dev_1.0.0_amd64.deb ] 
[ finished ] [ target/debs/bookworm/libsaimetadata-dev_1.0.0_amd64.deb ] 
[ building ] [ target/debs/bookworm/libsaivs-dev_1.0.0_amd64.deb ] 
[ finished ] [ target/debs/bookworm/libsaivs-dev_1.0.0_amd64.deb ] 
[ building ] [ target/debs/bookworm/libsairedis-dev_1.0.0_amd64.deb-install ] 
[ finished ] [ target/debs/bookworm/libsairedis-dev_1.0.0_amd64.deb-install ] 
[ building ] [ target/debs/bookworm/libsaimetadata_1.0.0_amd64.deb-install ] 
[ finished ] [ target/debs/bookworm/libsaimetadata_1.0.0_amd64.deb-install ] 
[ building ] [ target/debs/bookworm/libsaivs_1.0.0_amd64.deb-install ] 
[ finished ] [ target/debs/bookworm/libsaivs_1.0.0_amd64.deb-install ] 
[ building ] [ target/debs/bookworm/libsaimetadata-dev_1.0.0_amd64.deb-install ] 
[ finished ] [ target/debs/bookworm/libsaimetadata-dev_1.0.0_amd64.deb-install ] 
[ building ] [ target/debs/bookworm/libsaivs-dev_1.0.0_amd64.deb-install ] 
[ finished ] [ target/debs/bookworm/sonic-linkmgrd_1.0.0-1_amd64.deb ] 
[ finished ] [ target/python-wheels/bookworm/sonic_config_engine-1.0-py3-none-any.whl ] 
[ building ] [ target/docker-config-engine-bookworm.gz ] 
[ building ] [ target/python-wheels/bookworm/sonic_config_engine-1.0-py3-none-any.whl-install ] 
[ finished ] [ target/python-wheels/bookworm/sonic_config_engine-1.0-py3-none-any.whl-install ] 
[ building ] [ target/python-wheels/bookworm/sonic_platform_common-1.0-py3-none-any.whl ] 
[ finished ] [ target/python-wheels/bookworm/sonic_platform_common-1.0-py3-none-any.whl ] 
[ building ] [ target/python-wheels/bookworm/sonic_bgpcfgd-1.0-py3-none-any.whl ] 
[ finished ] [ target/debs/bookworm/syncd_1.0.0_amd64.deb ] 
[ building ] [ target/python-wheels/bookworm/sonic_frr_mgmt_framework-1.0-py3-none-any.whl ] 
dpkg-query: package 'libsaibcm-dev' is not installed and no information is available
Use dpkg --info (= dpkg-deb --info) to examine archive files.
[ finished ] [ target/debs/bookworm/libsaivs-dev_1.0.0_amd64.deb-install ] 
[ building ] [ target/python-wheels/bookworm/sonic_platform_common-1.0-py3-none-any.whl-install ] 
[ finished ] [ target/python-wheels/bookworm/sonic_platform_common-1.0-py3-none-any.whl-install ] 
[ building ] [ target/python-wheels/bookworm/system_health-1.0-py3-none-any.whl ] 
[ finished ] [ target/docker-config-engine-bookworm.gz ] 
[ building ] [ target/docker-config-engine-bookworm.gz-load ] 
[ finished ] [ target/python-wheels/bookworm/sonic_frr_mgmt_framework-1.0-py3-none-any.whl ] 
[ building ] [ target/python-wheels/bookworm/sonic_utilities-1.2-py3-none-any.whl ] 
[ finished ] [ target/docker-config-engine-bookworm.gz-load ] 
[ building ] [ target/debs/bookworm/swss_1.0.0_amd64.deb ] 
[ finished ] [ target/python-wheels/bookworm/sonic_bgpcfgd-1.0-py3-none-any.whl ] 
[ building ] [ target/docker-database.gz ] 
[ finished ] [ target/python-wheels/bookworm/system_health-1.0-py3-none-any.whl ] 
[ building ] [ target/docker-gnmi-watchdog.gz ] 
[ finished ] [ target/python-wheels/bookworm/sonic_utilities-1.2-py3-none-any.whl ] 
[ building ] [ target/docker-sonic-gnmi.gz ] 
[ finished ] [ target/docker-database.gz ] 
[ building ] [ target/docker-lldp.gz ] 
[ finished ] [ target/docker-sonic-gnmi.gz ] 
[ building ] [ target/docker-mux.gz ] 
[ finished ] [ target/docker-gnmi-watchdog.gz ] 
[ building ] [ target/python-wheels/bookworm/sonic_psud-1.0-py3-none-any.whl ] 
[ finished ] [ target/docker-mux.gz ] 
[ building ] [ target/python-wheels/bookworm/sonic_syseepromd-1.0-py3-none-any.whl ] 
[ finished ] [ target/python-wheels/bookworm/sonic_psud-1.0-py3-none-any.whl ] 
[ building ] [ target/python-wheels/bookworm/sonic_thermalctld-1.0-py3-none-any.whl ] 
[ finished ] [ target/docker-lldp.gz ] 
[ building ] [ target/python-wheels/bookworm/sonic_sensormond-1.0-py3-none-any.whl ] 
[ finished ] [ target/python-wheels/bookworm/sonic_syseepromd-1.0-py3-none-any.whl ] 
[ building ] [ target/python-wheels/bookworm/sonic_xcvrd-1.0-py3-none-any.whl ] 
[ finished ] [ target/debs/bookworm/swss_1.0.0_amd64.deb ] 
[ building ] [ target/python-wheels/bookworm/sonic_ycabled-1.0-py3-none-any.whl ] 
[ finished ] [ target/python-wheels/bookworm/sonic_thermalctld-1.0-py3-none-any.whl ] 
[ building ] [ target/python-wheels/bookworm/sonic_chassisd-1.0-py3-none-any.whl ] 
[ finished ] [ target/python-wheels/bookworm/sonic_sensormond-1.0-py3-none-any.whl ] 
[ building ] [ target/docker-ptp.gz ] 
[ finished ] [ target/python-wheels/bookworm/sonic_ycabled-1.0-py3-none-any.whl ] 
[ building ] [ target/docker-router-advertiser.gz ] 
[ finished ] [ target/python-wheels/bookworm/sonic_xcvrd-1.0-py3-none-any.whl ] 
[ building ] [ target/python-wheels/bookworm/asyncsnmp-2.1.0-py3-none-any.whl ] 
[ finished ] [ target/python-wheels/bookworm/sonic_chassisd-1.0-py3-none-any.whl ] 
[ building ] [ target/docker-sonic-mgmt-framework.gz ] 
[ finished ] [ target/python-wheels/bookworm/asyncsnmp-2.1.0-py3-none-any.whl ] 
[ building ] [ target/docker-stp.gz ] 
[ finished ] [ target/docker-ptp.gz ] 
[ building ] [ target/docker-sysmgr.gz ] 
[ finished ] [ target/docker-router-advertiser.gz ] 
[ building ] [ target/docker-sonic-gnmi.gz-load ] 
[ finished ] [ target/docker-sonic-gnmi.gz-load ] 
[ building ] [ target/docker-syncd-brcm.gz ] 
[ finished ] [ target/docker-stp.gz ] 
[ building ] [ target/docker-gbsyncd-credo.gz ] 
[ finished ] [ target/docker-sonic-mgmt-framework.gz ] 
[ building ] [ target/docker-gbsyncd-broncos.gz ] 
[ finished ] [ target/docker-sysmgr.gz ] 
[ building ] [ target/python-wheels/bookworm/sonic_utilities-1.2-py3-none-any.whl-install ] 
[ finished ] [ target/python-wheels/bookworm/sonic_utilities-1.2-py3-none-any.whl-install ] 
[ building ] [ target/docker-auditd-watchdog.gz ] 
[ finished ] [ target/docker-gbsyncd-credo.gz ] 
[ building ] [ target/docker-auditd.gz ] 
[ finished ] [ target/docker-syncd-brcm.gz ] 
[ building ] [ target/docker-bmp-watchdog.gz ] 
[ finished ] [ target/docker-gbsyncd-broncos.gz ] 
[ building ] [ target/python-wheels/bookworm/sonic_bmpcfgd_services-1.0-py3-none-any.whl ] 
[ finished ] [ target/docker-auditd.gz ] 
[ building ] [ target/docker-swss-layer-bookworm.gz ] 
[ finished ] [ target/python-wheels/bookworm/sonic_bmpcfgd_services-1.0-py3-none-any.whl ] 
[ building ] [ target/docker-eventd.gz ] 
[ finished ] [ target/docker-eventd.gz ] 
[ building ] [ target/docker-platform-monitor.gz ] 
[ finished ] [ target/docker-swss-layer-bookworm.gz ] 
[ building ] [ target/docker-snmp.gz ] 
[ finished ] [ target/docker-auditd-watchdog.gz ] 
[ building ] [ target/docker-swss-layer-bookworm.gz-load ] 
[ finished ] [ target/docker-swss-layer-bookworm.gz-load ] 
[ building ] [ target/docker-sonic-telemetry.gz ] 
[ finished ] [ target/docker-bmp-watchdog.gz ] 
[ building ] [ target/docker-syncd-brcm-dnx.gz ] 
[ finished ] [ target/docker-snmp.gz ] 
[ building ] [ target/docker-dhcp-relay.gz ] 
/sonic/dockers/docker-dhcp-relay/cli-plugin-tests /sonic
[ finished ] [ target/docker-sonic-telemetry.gz ] 
[ building ] [ target/docker-macsec.gz ] 
/sonic/dockers/docker-macsec/cli-plugin-tests /sonic
/sonic
/sonic
[ finished ] [ target/docker-syncd-brcm-dnx.gz ] 
[ building ] [ target/python-wheels/bookworm/sonic_host_services-1.0-py3-none-any.whl ] 
[ finished ] [ target/docker-platform-monitor.gz ] 
[ building ] [ target/docker-sonic-bmp.gz ] 
[ finished ] [ target/docker-macsec.gz ] 
[ building ] [ target/docker-dash-ha.gz ] 
[ finished ] [ target/docker-sonic-bmp.gz ] 
[ building ] [ target/docker-fpm-frr.gz ] 
[ finished ] [ target/docker-dash-ha.gz ] 
[ building ] [ target/docker-nat.gz ] 
[ finished ] [ target/docker-dhcp-relay.gz ] 
[ building ] [ target/docker-orchagent.gz ] 
[ finished ] [ target/python-wheels/bookworm/sonic_host_services-1.0-py3-none-any.whl ] 
[ building ] [ target/docker-sflow.gz ] 
[ finished ] [ target/docker-nat.gz ] 
[ building ] [ target/docker-teamd.gz ] 
[ finished ] [ target/docker-fpm-frr.gz ] 
[ finished ] [ target/docker-sflow.gz ] 
[ finished ] [ target/docker-teamd.gz ] 
[ finished ] [ target/docker-orchagent.gz ] 
basename: missing operand
Try 'basename --help' for more information.
basename: missing operand
Try 'basename --help' for more information.
[ building ] [ target/sonic-broadcom.bin ] 
[ building ] [ target/sonic-aboot-broadcom.swi ] 
[ finished ] [ target/sonic-aboot-broadcom.swi ] 
[ FAIL LOG START ] [ target/sonic-aboot-broadcom.swi ]
Build start time: Wed Sep 30 16:08:57 UTC 2026
++ '[' -f .arch ']'
++ cat .arch
+ CONFIGURED_ARCH=amd64
+ DOCKER_VERSION=5:24.0.2-1~debian.12~bookworm
+ CONTAINERD_IO_VERSION=1.6.21-1
+ LINUX_KERNEL_VERSION=6.1.0-29-2
+ FILESYSTEM_ROOT=./fsroot
+ PLATFORM_DIR=platform
+ HOSTNAME=sonic
+ DEFAULT_USERINFO='Default admin user,,,'
+ BUILD_TOOL_PATH=src/sonic-build-hooks/buildinfo
+ TRUSTED_GPG_DIR=src/sonic-build-hooks/buildinfo/trusted.gpg.d
+ . ./onie-image.conf
++ : 32768
++ : x86_64
++ : broadcom
++ ONIEIMAGE_VERSION=r0
++ FILESYSTEM_ROOT=./fsroot-broadcom
++ FILESYSTEM_SQUASHFS=fs.squashfs
++ INSTALLER_PAYLOAD=fs.zip
++ FILESYSTEM_DOCKERFS=dockerfs.tar.gz
++ DOCKERFS_DIR=docker
++ DOCKER_RAMFS_SIZE=3500M
++ OUTPUT_ONIE_IMAGE=target/sonic-broadcom.bin
++ OUTPUT_RAW_IMAGE=target/sonic-broadcom.raw
++ RAW_IMAGE_DISK_SIZE=1700
++ OUTPUT_KVM_IMAGE=target/sonic-broadcom.img
++ KVM_IMAGE_DISK_SIZE=16
++ OUTPUT_ABOOT_IMAGE=target/sonic-aboot-broadcom.swi
++ ABOOT_BOOT_IMAGE=.sonic-boot.swi
++ OUTPUT_KVM_4ASIC_IMAGE=target/sonic-4asic-broadcom.img
++ OUTPUT_KVM_6ASIC_IMAGE=target/sonic-6asic-broadcom.img
++ OUTPUT_DSC_IMAGE=target/sonic-broadcom.tar
+ '[' -n 32768 ']'
+ '[' -n fs.zip ']'
+ '[' -n fs.squashfs ']'
+ '[' aboot = aboot ']'
+ TARGET_BOOTLOADER=aboot
+ [[ y != y ]]
+ [[ n == y ]]
+ [[ y == y ]]
+ echo '[INFO] RFS build: second stage'
[INFO] RFS build: second stage
+ sudo mount proc /proc -t proc
+ sudo fuser -vm ./fsroot-broadcom
                     USER        PID ACCESS COMMAND
/sonic/fsroot-broadcom:
                     root     kernel mount /usr/sbin/docker-init
                     jenkins       1 ..ce. docker-init
                     jenkins       7 ..c.. bash
                     jenkins       8 ..c.. make
                     root       7000 ....m dockerd
                     root       7087 ....m containerd
                     jenkins   784747 ..c.. bash
                     jenkins   785037 ..c.. bash
                     jenkins   785236 ..c.. build_debian.sh
                     jenkins   785237 ..c.. process_log.sh
                     root      785253 ..c.. sudo
                     root      785254 ..c.. unsquashfs
                     jenkins   785374 ..c.. build_debian.sh
                     jenkins   785375 ..c.. process_log.sh
                     root      785383 ..c.. sudo
+ sudo rm -rf ./fsroot-broadcom
rm: cannot remove './fsroot-broadcom/dev/rd': Directory not empty
[  FAIL LOG END  ] [ target/sonic-aboot-broadcom.swi ]
make: *** [slave.mk:1435: target/sonic-aboot-broadcom.swi] Error 1
make: *** Waiting for unfinished jobs....
[ finished ] [ target/sonic-broadcom.bin ] 
[ FAIL LOG START ] [ target/sonic-broadcom.bin ]
Build start time: Wed Sep 30 16:08:56 UTC 2026
++ '[' -f .arch ']'
++ cat .arch
+ CONFIGURED_ARCH=amd64
+ DOCKER_VERSION=5:24.0.2-1~debian.12~bookworm
+ CONTAINERD_IO_VERSION=1.6.21-1
+ LINUX_KERNEL_VERSION=6.1.0-29-2
+ FILESYSTEM_ROOT=./fsroot
+ PLATFORM_DIR=platform
+ HOSTNAME=sonic
+ DEFAULT_USERINFO='Default admin user,,,'
+ BUILD_TOOL_PATH=src/sonic-build-hooks/buildinfo
+ TRUSTED_GPG_DIR=src/sonic-build-hooks/buildinfo/trusted.gpg.d
+ . ./onie-image.conf
++ : 32768
++ : x86_64
++ : broadcom
++ ONIEIMAGE_VERSION=r0
++ FILESYSTEM_ROOT=./fsroot-broadcom
++ FILESYSTEM_SQUASHFS=fs.squashfs
++ INSTALLER_PAYLOAD=fs.zip
++ FILESYSTEM_DOCKERFS=dockerfs.tar.gz
++ DOCKERFS_DIR=docker
++ DOCKER_RAMFS_SIZE=3500M
++ OUTPUT_ONIE_IMAGE=target/sonic-broadcom.bin
++ OUTPUT_RAW_IMAGE=target/sonic-broadcom.raw
++ RAW_IMAGE_DISK_SIZE=1700
++ OUTPUT_KVM_IMAGE=target/sonic-broadcom.img
++ KVM_IMAGE_DISK_SIZE=16
++ OUTPUT_ABOOT_IMAGE=target/sonic-aboot-broadcom.swi
++ ABOOT_BOOT_IMAGE=.sonic-boot.swi
++ OUTPUT_KVM_4ASIC_IMAGE=target/sonic-4asic-broadcom.img
++ OUTPUT_KVM_6ASIC_IMAGE=target/sonic-6asic-broadcom.img
++ OUTPUT_DSC_IMAGE=target/sonic-broadcom.tar
+ '[' -n 32768 ']'
+ '[' -n fs.zip ']'
+ '[' -n fs.squashfs ']'
+ '[' onie = aboot ']'
+ [[ y != y ]]
+ [[ n == y ]]
+ [[ y == y ]]
+ echo '[INFO] RFS build: second stage'
[INFO] RFS build: second stage
+ sudo mount proc /proc -t proc
+ sudo fuser -vm ./fsroot-broadcom
                     USER        PID ACCESS COMMAND
/sonic/fsroot-broadcom:
                     root     kernel mount /usr/sbin/docker-init
                     jenkins       1 ..ce. docker-init
                     jenkins       7 ..c.. bash
                     jenkins       8 ..c.. make
                     root       7000 ....m dockerd
                     root       7087 ....m containerd
                     jenkins   784747 ..c.. bash
                     jenkins   785037 ..c.. bash
                     jenkins   785233 ..c.. j2
                     jenkins   785236 ..c.. build_debian.sh
                     jenkins   785237 ..c.. process_log.sh
                     root      785245 ..c.. sudo
+ sudo rm -rf ./fsroot-broadcom
+ sudo unsquashfs -d ./fsroot-broadcom target/sonic-broadcom.bin__broadcom__rfs.squashfs
Parallel unsquashfs: Using 112 processors
33651 inodes (34125 blocks) to write


[==|                                                         ]  2943/67776   4%
[===\                                                        ]  4449/67776   6%
[========\                                                   ]  9581/67776  14%
[=========/                                                  ] 10598/67776  15%
[============-                                               ] 14682/67776  21%
[==============-                                             ] 16737/67776  24%
[===============\                                            ] 17928/67776  26%
[=================/                                          ] 20141/67776  29%
[====================\                                       ] 23581/67776  34%
[=========================|                                  ] 29143/67776  42%
[==============================/                             ] 35156/67776  51%
[===================================-                        ] 40723/67776  60%
[=================================================\          ] 56695/67776  83%
[====================================================\       ] 60301/67776  88%
[===========================================================|] 67776/67776 100%

created 25922 files
created 3484 directories
created 2373 symlinks
created 5351 devices
created 0 fifos
created 0 sockets
created 5 hardlinks
+ pushd ./fsroot-broadcom
/sonic/fsroot-broadcom /sonic
+ sudo mount --bind . .
+ popd
/sonic
+ trap_push 'sudo LANG=C chroot $FILESYSTEM_ROOT umount /proc || true'
+ local oldcmd=true
+ local 'newcmd=sudo LANG=C chroot $FILESYSTEM_ROOT umount /proc || true; true'
+ trap -- 'sudo LANG=C chroot $FILESYSTEM_ROOT umount /proc || true; true' EXIT INT TERM HUP
+ _trap_push 'sudo LANG=C chroot $FILESYSTEM_ROOT umount /proc || true; true'
+ local 'next=sudo LANG=C chroot $FILESYSTEM_ROOT umount /proc || true; true'
++ echo 'sudo LANG=C chroot $FILESYSTEM_ROOT umount /proc || true; true'
++ sed -e 's/'\''/'\''\\'\'''\''/g'
+ eval 'trap_push() {
        local oldcmd='\''sudo LANG=C chroot $FILESYSTEM_ROOT umount /proc || true; true'\''
        local newcmd="$1; $oldcmd"
        trap -- "$newcmd" EXIT INT TERM HUP
        _trap_push "$newcmd"
    }'
+ sudo LANG=C chroot ./fsroot-broadcom mount proc /proc -t proc
+ export build_version=etri-202505.27-06c33ab02
+ build_version=etri-202505.27-06c33ab02
++ cat ./fsroot-broadcom/etc/debian_version
+ export debian_version=12.15
+ debian_version=12.15
+ export kernel_version=6.1.0-29-2-amd64
+ kernel_version=6.1.0-29-2-amd64
+ export asic_type=broadcom
+ asic_type=broadcom
+ export asic_subtype=broadcom
+ asic_subtype=broadcom
++ git rev-parse --short HEAD
+ export commit_id=06c33ab02
+ commit_id=06c33ab02
++ git rev-parse --abbrev-ref HEAD
+ export branch=etri-202505
+ branch=etri-202505
++ '[' -f ./fsroot-broadcom/etc/sonic/sonic_release ']'
++ cat ./fsroot-broadcom/etc/sonic/sonic_release
+ export release=202505
+ release=202505
++ date -u
+ export 'build_date=Wed Sep 30 16:09:32 UTC 2026'
+ build_date='Wed Sep 30 16:09:32 UTC 2026'
+ export build_number=27
+ build_number=27
+ export built_by=jenkins@w2sh
+ built_by=jenkins@w2sh
+ export sonic_os_version=12
+ sonic_os_version=12
+ j2 files/build_templates/sonic_version.yml.j2
+ sudo tee ./fsroot-broadcom/etc/sonic/sonic_version.yml
---
build_version: 'etri-202505.27-06c33ab02'
debian_version: '12.15'
kernel_version: '6.1.0-29-2-amd64'
asic_type: broadcom
asic_subtype: 'broadcom'
commit_id: '06c33ab02'
branch: 'etri-202505'
release: '202505'
build_date: Wed Sep 30 16:09:32 UTC 2026
build_number: 27
built_by: jenkins@w2sh
libswsscommon: 1.0.0
sonic_utilities: 1.2
sonic_os_version: 12
secure_boot_image: 'no'
+ '[' -f sonic_debian_extension.sh ']'
+ ./sonic_debian_extension.sh ./fsroot-broadcom platform bookworm
++ '[' -f .arch ']'
++ cat .arch
+ CONFIGURED_ARCH=amd64
++ '[' -f .platform ']'
++ cat .platform
+ CONFIGURED_PLATFORM=broadcom
+ . functions.sh
++ _trap_push true
++ local next=true
+++ echo true
+++ sed -e 's/'\''/'\''\\'\'''\''/g'
++ eval 'trap_push() {
        local oldcmd='\''true'\''
        local newcmd="$1; $oldcmd"
        trap -- "$newcmd" EXIT INT TERM HUP
        _trap_push "$newcmd"
    }'
+ BUILD_SCRIPTS_DIR=files/build_scripts
+ BUILD_TEMPLATES=files/build_templates
+ IMAGE_CONFIGS=files/image_config
+ SCRIPTS_DIR=files/scripts
+ DOCKER_SCRIPTS_DIR=files/docker
+ DOCKER_CTL_DIR=/usr/lib/docker/
+ DOCKER_CTL_SCRIPT=/usr/lib/docker//docker.sh
+ FILESYSTEM_ROOT_USR=./fsroot-broadcom/usr
+ FILESYSTEM_ROOT_USR_LIB=./fsroot-broadcom/usr/lib/
+ FILESYSTEM_ROOT_USR_LIB_SYSTEMD_SYSTEM=./fsroot-broadcom/usr/lib//systemd/system
+ FILESYSTEM_ROOT_USR_LIB_SYSTEMD_NETWORK=./fsroot-broadcom/usr/lib//systemd/network
+ FILESYSTEM_ROOT_USR_SHARE=./fsroot-broadcom/usr/share
+ FILESYSTEM_ROOT_USR_SHARE_SONIC=./fsroot-broadcom/usr/share/sonic
+ FILESYSTEM_ROOT_USR_SHARE_SONIC_SCRIPTS=./fsroot-broadcom/usr/share/sonic/scripts
+ FILESYSTEM_ROOT_USR_SHARE_SONIC_TEMPLATES=./fsroot-broadcom/usr/share/sonic/templates
+ FILESYSTEM_ROOT_USR_SHARE_SONIC_FIRMWARE=./fsroot-broadcom/usr/share/sonic/firmware
+ FILESYSTEM_ROOT_ETC=./fsroot-broadcom/etc
+ FILESYSTEM_ROOT_ETC_SONIC=./fsroot-broadcom/etc/sonic
+ GENERATED_SERVICE_FILE=./fsroot-broadcom/etc/sonic/generated_services.conf
+ trap_push clean_sys
+ local oldcmd=true
+ local 'newcmd=clean_sys; true'
+ trap -- 'clean_sys; true' EXIT INT TERM HUP
+ _trap_push 'clean_sys; true'
+ local 'next=clean_sys; true'
++ echo 'clean_sys; true'
++ sed -e 's/'\''/'\''\\'\'''\''/g'
+ eval 'trap_push() {
        local oldcmd='\''clean_sys; true'\''
        local newcmd="$1; $oldcmd"
        trap -- "$newcmd" EXIT INT TERM HUP
        _trap_push "$newcmd"
    }'
+ sudo LANG=C chroot ./fsroot-broadcom mount sysfs /sys -t sysfs
+ sudo bash -c 'echo "DOCKER_OPTS="--storage-driver=overlay2"" >> ./fsroot-broadcom/etc/default/docker'
+ sudo mkdir -p ./fsroot-broadcom//usr/lib/docker/
+ sudo cp files/docker/docker ./fsroot-broadcom//usr/lib/docker//docker.sh
+ [[ n == y ]]
+ [[ n == y ]]
+ sudo chroot ./fsroot-broadcom /usr/lib/docker//docker.sh start
chroot: failed to run command '/usr/lib/docker//docker.sh': No such file or directory
+ clean_sys
+ sudo chroot ./fsroot-broadcom umount /sys/fs/cgroup/cgroup.controllers /sys/fs/cgroup/cgroup.events /sys/fs/cgroup/cgroup.freeze /sys/fs/cgroup/cgroup.kill /sys/fs/cgroup/cgroup.max.depth /sys/fs/cgroup/cgroup.max.descendants /sys/fs/cgroup/cgroup.pressure /sys/fs/cgroup/cgroup.procs /sys/fs/cgroup/cgroup.stat /sys/fs/cgroup/cgroup.subtree_control /sys/fs/cgroup/cgroup.threads /sys/fs/cgroup/cgroup.type /sys/fs/cgroup/cpu.idle /sys/fs/cgroup/cpu.max /sys/fs/cgroup/cpu.max.burst /sys/fs/cgroup/cpu.pressure /sys/fs/cgroup/cpu.stat /sys/fs/cgroup/cpu.stat.local /sys/fs/cgroup/cpu.uclamp.max /sys/fs/cgroup/cpu.uclamp.min /sys/fs/cgroup/cpu.weight /sys/fs/cgroup/cpu.weight.nice /sys/fs/cgroup/cpuset.cpus /sys/fs/cgroup/cpuset.cpus.effective /sys/fs/cgroup/cpuset.cpus.exclusive /sys/fs/cgroup/cpuset.cpus.exclusive.effective /sys/fs/cgroup/cpuset.cpus.partition /sys/fs/cgroup/cpuset.mems /sys/fs/cgroup/cpuset.mems.effective /sys/fs/cgroup/docker /sys/fs/cgroup/hugetlb.1GB.current /sys/fs/cgroup/hugetlb.1GB.events /sys/fs/cgroup/hugetlb.1GB.events.local /sys/fs/cgroup/hugetlb.1GB.max /sys/fs/cgroup/hugetlb.1GB.numa_stat /sys/fs/cgroup/hugetlb.1GB.rsvd.current /sys/fs/cgroup/hugetlb.1GB.rsvd.max /sys/fs/cgroup/hugetlb.2MB.current /sys/fs/cgroup/hugetlb.2MB.events /sys/fs/cgroup/hugetlb.2MB.events.local /sys/fs/cgroup/hugetlb.2MB.max /sys/fs/cgroup/hugetlb.2MB.numa_stat /sys/fs/cgroup/hugetlb.2MB.rsvd.current /sys/fs/cgroup/hugetlb.2MB.rsvd.max /sys/fs/cgroup/io.max /sys/fs/cgroup/io.pressure /sys/fs/cgroup/io.prio.class /sys/fs/cgroup/io.stat /sys/fs/cgroup/io.weight /sys/fs/cgroup/memory.current /sys/fs/cgroup/memory.events /sys/fs/cgroup/memory.events.local /sys/fs/cgroup/memory.high /sys/fs/cgroup/memory.low /sys/fs/cgroup/memory.max /sys/fs/cgroup/memory.min /sys/fs/cgroup/memory.numa_stat /sys/fs/cgroup/memory.oom.group /sys/fs/cgroup/memory.peak /sys/fs/cgroup/memory.pressure /sys/fs/cgroup/memory.reclaim /sys/fs/cgroup/memory.stat /sys/fs/cgroup/memory.swap.current /sys/fs/cgroup/memory.swap.events /sys/fs/cgroup/memory.swap.high /sys/fs/cgroup/memory.swap.max /sys/fs/cgroup/memory.swap.peak /sys/fs/cgroup/memory.zswap.current /sys/fs/cgroup/memory.zswap.max /sys/fs/cgroup/memory.zswap.writeback /sys/fs/cgroup/misc.current /sys/fs/cgroup/misc.events /sys/fs/cgroup/misc.max /sys/fs/cgroup/pids.current /sys/fs/cgroup/pids.events /sys/fs/cgroup/pids.max /sys/fs/cgroup/pids.peak /sys/fs/cgroup/rdma.current /sys/fs/cgroup/rdma.max /sys/fs/cgroup /sys
umount: /sys/fs/cgroup/cgroup.controllers: no mount point specified.
umount: /sys/fs/cgroup/cgroup.events: no mount point specified.
umount: /sys/fs/cgroup/cgroup.freeze: no mount point specified.
umount: /sys/fs/cgroup/cgroup.kill: no mount point specified.
umount: /sys/fs/cgroup/cgroup.max.depth: no mount point specified.
umount: /sys/fs/cgroup/cgroup.max.descendants: no mount point specified.
umount: /sys/fs/cgroup/cgroup.pressure: no mount point specified.
umount: /sys/fs/cgroup/cgroup.procs: no mount point specified.
umount: /sys/fs/cgroup/cgroup.stat: no mount point specified.
umount: /sys/fs/cgroup/cgroup.subtree_control: no mount point specified.
umount: /sys/fs/cgroup/cgroup.threads: no mount point specified.
umount: /sys/fs/cgroup/cgroup.type: no mount point specified.
umount: /sys/fs/cgroup/cpu.idle: no mount point specified.
umount: /sys/fs/cgroup/cpu.max: no mount point specified.
umount: /sys/fs/cgroup/cpu.max.burst: no mount point specified.
umount: /sys/fs/cgroup/cpu.pressure: no mount point specified.
umount: /sys/fs/cgroup/cpu.stat: no mount point specified.
umount: /sys/fs/cgroup/cpu.stat.local: no mount point specified.
umount: /sys/fs/cgroup/cpu.uclamp.max: no mount point specified.
umount: /sys/fs/cgroup/cpu.uclamp.min: no mount point specified.
umount: /sys/fs/cgroup/cpu.weight: no mount point specified.
umount: /sys/fs/cgroup/cpu.weight.nice: no mount point specified.
umount: /sys/fs/cgroup/cpuset.cpus: no mount point specified.
umount: /sys/fs/cgroup/cpuset.cpus.effective: no mount point specified.
umount: /sys/fs/cgroup/cpuset.cpus.exclusive: no mount point specified.
umount: /sys/fs/cgroup/cpuset.cpus.exclusive.effective: no mount point specified.
umount: /sys/fs/cgroup/cpuset.cpus.partition: no mount point specified.
umount: /sys/fs/cgroup/cpuset.mems: no mount point specified.
umount: /sys/fs/cgroup/cpuset.mems.effective: no mount point specified.
umount: /sys/fs/cgroup/docker: no mount point specified.
umount: /sys/fs/cgroup/hugetlb.1GB.current: no mount point specified.
umount: /sys/fs/cgroup/hugetlb.1GB.events: no mount point specified.
umount: /sys/fs/cgroup/hugetlb.1GB.events.local: no mount point specified.
umount: /sys/fs/cgroup/hugetlb.1GB.max: no mount point specified.
umount: /sys/fs/cgroup/hugetlb.1GB.numa_stat: no mount point specified.
umount: /sys/fs/cgroup/hugetlb.1GB.rsvd.current: no mount point specified.
umount: /sys/fs/cgroup/hugetlb.1GB.rsvd.max: no mount point specified.
umount: /sys/fs/cgroup/hugetlb.2MB.current: no mount point specified.
umount: /sys/fs/cgroup/hugetlb.2MB.events: no mount point specified.
umount: /sys/fs/cgroup/hugetlb.2MB.events.local: no mount point specified.
umount: /sys/fs/cgroup/hugetlb.2MB.max: no mount point specified.
umount: /sys/fs/cgroup/hugetlb.2MB.numa_stat: no mount point specified.
umount: /sys/fs/cgroup/hugetlb.2MB.rsvd.current: no mount point specified.
umount: /sys/fs/cgroup/hugetlb.2MB.rsvd.max: no mount point specified.
umount: /sys/fs/cgroup/io.max: no mount point specified.
umount: /sys/fs/cgroup/io.pressure: no mount point specified.
umount: /sys/fs/cgroup/io.prio.class: no mount point specified.
umount: /sys/fs/cgroup/io.stat: no mount point specified.
umount: /sys/fs/cgroup/io.weight: no mount point specified.
umount: /sys/fs/cgroup/memory.current: no mount point specified.
umount: /sys/fs/cgroup/memory.events: no mount point specified.
umount: /sys/fs/cgroup/memory.events.local: no mount point specified.
umount: /sys/fs/cgroup/memory.high: no mount point specified.
umount: /sys/fs/cgroup/memory.low: no mount point specified.
umount: /sys/fs/cgroup/memory.max: no mount point specified.
umount: /sys/fs/cgroup/memory.min: no mount point specified.
umount: /sys/fs/cgroup/memory.numa_stat: no mount point specified.
umount: /sys/fs/cgroup/memory.oom.group: no mount point specified.
umount: /sys/fs/cgroup/memory.peak: no mount point specified.
umount: /sys/fs/cgroup/memory.pressure: no mount point specified.
umount: /sys/fs/cgroup/memory.reclaim: no mount point specified.
umount: /sys/fs/cgroup/memory.stat: no mount point specified.
umount: /sys/fs/cgroup/memory.swap.current: no mount point specified.
umount: /sys/fs/cgroup/memory.swap.events: no mount point specified.
umount: /sys/fs/cgroup/memory.swap.high: no mount point specified.
umount: /sys/fs/cgroup/memory.swap.max: no mount point specified.
umount: /sys/fs/cgroup/memory.swap.peak: no mount point specified.
umount: /sys/fs/cgroup/memory.zswap.current: no mount point specified.
umount: /sys/fs/cgroup/memory.zswap.max: no mount point specified.
umount: /sys/fs/cgroup/memory.zswap.writeback: no mount point specified.
umount: /sys/fs/cgroup/misc.current: no mount point specified.
umount: /sys/fs/cgroup/misc.events: no mount point specified.
umount: /sys/fs/cgroup/misc.max: no mount point specified.
umount: /sys/fs/cgroup/pids.current: no mount point specified.
umount: /sys/fs/cgroup/pids.events: no mount point specified.
umount: /sys/fs/cgroup/pids.max: no mount point specified.
umount: /sys/fs/cgroup/pids.peak: no mount point specified.
umount: /sys/fs/cgroup/rdma.current: no mount point specified.
umount: /sys/fs/cgroup/rdma.max: no mount point specified.
umount: /sys/fs/cgroup: not mounted.
+ true
+ true
+ sudo LANG=C chroot ./fsroot-broadcom umount /proc
+ true
[  FAIL LOG END  ] [ target/sonic-broadcom.bin ]
make: *** [slave.mk:1435: target/sonic-broadcom.bin] Error 1
make[1]: *** [Makefile.work:611: all] Error 2
make[1]: Leaving directory '/var/lib/jenkins/workspace/DevOps-test2/platform-broadcom'
make: *** [Makefile:53: all] Error 2