+++ --- Applying local submodule patches --- +++
already applied: sonic-utilities
already applied: sonic-swss
already applied: sonic-swss-new
already applied: sonic-sairedis-vslib
already applied: sonic-sairedis-meta
already applied: sonic-sairedis-SAI
already applied: sonic-sairedis-SAI-apidef
already applied: sonic-mgmt-framework
+++ --- Making all --- +++
./scripts/run_with_retry make BLDENV=bookworm -f Makefile.work all
make[1]: Entering directory '/var/lib/jenkins/workspace/DevOps-test2/platform-vs'
"SECURE_UPGRADE_PROD_SIGNING_TOOL": ""
~/workspace/DevOps-test2/platform-vs/src/sonic-build-hooks ~/workspace/DevOps-test2/platform-vs
make[2]: Entering directory '/var/lib/jenkins/workspace/DevOps-test2/platform-vs/src/sonic-build-hooks'
dpkg-deb: building package 'sonic-build-hooks' in 'buildinfo/sonic-build-hooks_1.0_all.deb'.
make[2]: Leaving directory '/var/lib/jenkins/workspace/DevOps-test2/platform-vs/src/sonic-build-hooks'
~/workspace/DevOps-test2/platform-vs
Checking sonic-slave-base image: sonic-slave-bookworm:2f250bfbb4a
Checking sonic-slave-user image: sonic-slave-bookworm-jenkins:d05b1641d68
SONiC Build System
Build Configuration
"CONFIGURED_PLATFORM" : "vs"
"CONFIGURED_ARCH" : "amd64"
"SONIC_CONFIG_PRINT_DEPENDENCIES" : ""
"SONIC_BUILD_JOBS" : "4"
"SONIC_CONFIG_MAKE_JOBS" : "112"
"USE_NATIVE_DOCKERD_FOR_BUILD" : ""
"SONIC_USE_DOCKER_BUILDKIT" : ""
"USERNAME" : "admin"
"PASSWORD" : "YourPaSsWoRd"
"CHANGE_DEFAULT_PASSWORD" : "n"
"SECURE_UPGRADE_MODE" : "no_sign"
"SECURE_UPGRADE_DEV_SIGNING_KEY" : ""
"SECURE_UPGRADE_SIGNING_CERT" : ""
"SECURE_UPGRADE_PROD_SIGNING_TOOL": ""
"SECURE_UPGRADE_PROD_TOOL_ARGS" : ""
"ONIE_IMAGE_PART_SIZE" : ""
"SHUTDOWN_BGP_ON_START" : ""
"ENABLE_PFCWD_ON_START" : ""
"SONIC_BUFFER_MODEL" : ""
"INSTALL_DEBUG_TOOLS" : ""
"ROUTING_STACK" : "frr"
"FRR_USER_UID" : "300"
"FRR_USER_GID" : "300"
"ENABLE_SYNCD_RPC" : ""
"SAITHRIFT_V2" : ""
"ENABLE_ORGANIZATION_EXTENSIONS" : "y"
"HTTP_PROXY" : ""
"HTTPS_PROXY" : ""
"NO_PROXY" : ""
"ENABLE_ZTP" : ""
"INCLUDE_PDE" : ""
"SONIC_DEBUGGING_ON" : ""
"SONIC_PROFILING_ON" : ""
"KERNEL_PROCURE_METHOD" : "build"
"BUILD_TIMESTAMP" : "20261001.180434"
"BUILD_LOG_TIMESTAMP" : "none"
"SONIC_IMAGE_VERSION" : "etri-202505.29-6d0bf9c41"
"BLDENV" : "bookworm"
"VS_PREPARE_MEM" : "yes"
"INCLUDE_MGMT_FRAMEWORK" : "y"
"INCLUDE_ICCPD" : "n"
"INCLUDE_STP" : "y"
"INCLUDE_SYSTEM_TELEMETRY" : "y"
"INCLUDE_SYSTEM_GNMI" : "y"
"INCLUDE_SYSTEM_BMP" : "y"
"INCLUDE_SYSTEM_EVENTD" : "y"
"ENABLE_HOST_SERVICE_ON_START" : "y"
"INCLUDE_RESTAPI" : "n"
"INCLUDE_SFLOW" : "y"
"INCLUDE_NAT" : "y"
"INCLUDE_DHCP_RELAY" : "y"
"INCLUDE_DHCP_SERVER" : "n"
"INCLUDE_P4RT" : "n"
"INCLUDE_VS_DASH_SAI" : "y"
"INCLUDE_KUBERNETES" : "n"
"INCLUDE_KUBERNETES_MASTER" : "n"
"INCLUDE_MACSEC" : "y"
"INCLUDE_MUX" : "y"
"INCLUDE_TEAMD" : "y"
"INCLUDE_DASH_HA" : "y"
"INCLUDE_ROUTER_ADVERTISER" : "y"
"INCLUDE_BOOTCHART : "y"
"ENABLE_BOOTCHART : "n"
"INCLUDE_FIPS" : "y"
"ENABLE_TRANSLIB_WRITE" : ""
"ENABLE_NATIVE_WRITE" : "y"
"ENABLE_DIALOUT" : ""
"ENABLE_AUTO_TECH_SUPPORT" : "y"
"PDDF_SUPPORT" : "y"
"MULTIARCH_QEMU_ENVIRON" : "n"
"SONIC_VERSION_CONTROL_COMPONENTS": "py2,py3,web,git,docker"
"ENABLE_ASAN" : "n"
"DEFAULT_CONTAINER_REGISTRY" : "publicmirror.azurecr.io/"
"BUILD_MULTIASIC_KVM" : "n"
"CROSS_BUILD_ENVIRON" : "n"
"LEGACY_SONIC_MGMT_DOCKER" : "y"
"INCLUDE_EXTERNAL_PATCHES" : "n"
"PTF_ENV_PY_VER" : "py3"
"ENABLE_MULTIDB" : ""
mv: cannot move '/etc/apt/sources.list.d/debian.sources' to '/etc/apt/sources.list.d/debian.sources.back': Permission denied
fatal: not a git repository (or any of the parent directories): .git
"SONIC_DPKG_CACHE_METHOD" : "none"
[ building ] [ target/debs/bookworm/libyang_1.0.73_amd64.deb ]
[ building ] [ target/debs/bookworm/libnl-3-200_3.7.0-0.2+b1sonic1_amd64.deb-install ]
[ building ] [ target/python-wheels/bookworm/redis_dump_load-1.1-py3-none-any.whl-install ]
[ finished ] [ target/debs/bookworm/libnl-3-200_3.7.0-0.2+b1sonic1_amd64.deb-install ]
[ building ] [ target/debs/bookworm/p4lang-pi_0.1.0-15_amd64.deb-install ]
[ finished ] [ target/debs/bookworm/p4lang-pi_0.1.0-15_amd64.deb-install ]
[ building ] [ target/debs/bookworm/libnl-3-dev_3.7.0-0.2+b1sonic1_amd64.deb-install ]
[ building ] [ target/debs/bookworm/libnl-genl-3-200_3.7.0-0.2+b1sonic1_amd64.deb-install ]
[ finished ] [ target/debs/bookworm/libnl-3-dev_3.7.0-0.2+b1sonic1_amd64.deb-install ]
[ building ] [ target/debs/bookworm/libnl-route-3-200_3.7.0-0.2+b1sonic1_amd64.deb-install ]
[ finished ] [ target/debs/bookworm/libnl-route-3-200_3.7.0-0.2+b1sonic1_amd64.deb-install ]
[ building ] [ target/debs/bookworm/p4lang-bmv2_1.15.0-7_amd64.deb-install ]
[ finished ] [ target/python-wheels/bookworm/redis_dump_load-1.1-py3-none-any.whl-install ]
[ building ] [ target/debs/bookworm/libnl-route-3-dev_3.7.0-0.2+b1sonic1_amd64.deb-install ]
[ finished ] [ target/debs/bookworm/p4lang-bmv2_1.15.0-7_amd64.deb-install ]
[ building ] [ target/debs/bookworm/libdashapi_1.0.0_amd64.deb-install ]
[ finished ] [ target/debs/bookworm/libdashapi_1.0.0_amd64.deb-install ]
[ building ] [ target/python-wheels/bookworm/swsssdk-2.0.1-py3-none-any.whl-install ]
[ finished ] [ target/python-wheels/bookworm/swsssdk-2.0.1-py3-none-any.whl-install ]
[ building ] [ target/debs/bookworm/frr-snmp_10.3-sonic-0_amd64.deb ]
[ finished ] [ target/debs/bookworm/frr-snmp_10.3-sonic-0_amd64.deb ]
[ building ] [ target/docker-base-bookworm.gz-load ]
[ finished ] [ target/docker-base-bookworm.gz-load ]
[ building ] [ target/sonic-vs.bin__vs__rfs.squashfs ]
[ finished ] [ target/debs/bookworm/libnl-genl-3-200_3.7.0-0.2+b1sonic1_amd64.deb-install ]
[ building ] [ target/files/bookworm/sonic_version.yml ]
[ finished ] [ target/files/bookworm/sonic_version.yml ]
[ building ] [ target/debs/bookworm/libnl-genl-3-dev_3.7.0-0.2+b1sonic1_amd64.deb-install ]
[ finished ] [ target/debs/bookworm/libnl-genl-3-dev_3.7.0-0.2+b1sonic1_amd64.deb-install ]
[ building ] [ target/debs/bookworm/p4lang-p4c_1.2.4.2-2_amd64.deb ]
[ finished ] [ target/debs/bookworm/libnl-route-3-dev_3.7.0-0.2+b1sonic1_amd64.deb-install ]
[ building ] [ target/debs/bookworm/libnl-nf-3-200_3.7.0-0.2+b1sonic1_amd64.deb-install ]
[ finished ] [ target/debs/bookworm/libnl-nf-3-200_3.7.0-0.2+b1sonic1_amd64.deb-install ]
[ building ] [ target/debs/bookworm/libnl-nf-3-dev_3.7.0-0.2+b1sonic1_amd64.deb-install ]
[ finished ] [ target/debs/bookworm/libnl-nf-3-dev_3.7.0-0.2+b1sonic1_amd64.deb-install ]
[ building ] [ target/debs/bookworm/libnl-cli-3-200_3.7.0-0.2+b1sonic1_amd64.deb-install ]
[ finished ] [ target/debs/bookworm/libnl-cli-3-200_3.7.0-0.2+b1sonic1_amd64.deb-install ]
[ building ] [ target/debs/bookworm/libnl-cli-3-dev_3.7.0-0.2+b1sonic1_amd64.deb-install ]
[ finished ] [ target/debs/bookworm/libnl-cli-3-dev_3.7.0-0.2+b1sonic1_amd64.deb-install ]
[ building ] [ target/debs/bookworm/libteamdctl0_1.31-1_amd64.deb ]
[ finished ] [ target/debs/bookworm/libteamdctl0_1.31-1_amd64.deb ]
[ building ] [ target/debs/bookworm/libteam5_1.31-1_amd64.deb-install ]
[ finished ] [ target/debs/bookworm/libteam5_1.31-1_amd64.deb-install ]
[ building ] [ target/debs/bookworm/libteam-dev_1.31-1_amd64.deb ]
[ finished ] [ target/debs/bookworm/libteam-dev_1.31-1_amd64.deb ]
[ building ] [ target/debs/bookworm/libteam-utils_1.31-1_amd64.deb ]
[ finished ] [ target/debs/bookworm/libteam-utils_1.31-1_amd64.deb ]
[ building ] [ target/debs/bookworm/libteamdctl0_1.31-1_amd64.deb-install ]
[ finished ] [ target/debs/bookworm/libteamdctl0_1.31-1_amd64.deb-install ]
[ building ] [ target/debs/bookworm/libteam-dev_1.31-1_amd64.deb-install ]
[ finished ] [ target/debs/bookworm/libteam-dev_1.31-1_amd64.deb-install ]
[ building ] [ target/debs/bookworm/libteam-utils_1.31-1_amd64.deb-install ]
[ finished ] [ target/debs/bookworm/libteam-utils_1.31-1_amd64.deb-install ]
[ finished ] [ target/debs/bookworm/libyang_1.0.73_amd64.deb ]
[ building ] [ target/debs/bookworm/libyang-cpp_1.0.73_amd64.deb ]
[ finished ] [ target/debs/bookworm/libyang-cpp_1.0.73_amd64.deb ]
[ building ] [ target/debs/bookworm/libyang-dev_1.0.73_amd64.deb ]
[ finished ] [ target/debs/bookworm/libyang-dev_1.0.73_amd64.deb ]
[ building ] [ target/debs/bookworm/python3-yang_1.0.73_amd64.deb ]
[ finished ] [ target/debs/bookworm/python3-yang_1.0.73_amd64.deb ]
[ building ] [ target/debs/bookworm/libyang_1.0.73_amd64.deb-install ]
[ finished ] [ target/debs/bookworm/libyang_1.0.73_amd64.deb-install ]
[ building ] [ target/debs/bookworm/libyang-cpp_1.0.73_amd64.deb-install ]
[ building ] [ target/debs/bookworm/libyang-dev_1.0.73_amd64.deb-install ]
[ finished ] [ target/debs/bookworm/libyang-cpp_1.0.73_amd64.deb-install ]
[ building ] [ target/debs/bookworm/python3-yang_1.0.73_amd64.deb-install ]
[ finished ] [ target/debs/bookworm/python3-yang_1.0.73_amd64.deb-install ]
[ building ] [ target/python-wheels/bookworm/sonic_yang_models-1.0-py3-none-any.whl ]
[ finished ] [ target/debs/bookworm/libyang-dev_1.0.73_amd64.deb-install ]
[ finished ] [ target/python-wheels/bookworm/sonic_yang_models-1.0-py3-none-any.whl ]
[ building ] [ target/python-wheels/bookworm/sonic_yang_models-1.0-py3-none-any.whl-install ]
[ finished ] [ target/python-wheels/bookworm/sonic_yang_models-1.0-py3-none-any.whl-install ]
[ building ] [ target/python-wheels/bookworm/sonic_yang_mgmt-1.0-py3-none-any.whl ]
[ building ] [ target/debs/bookworm/sonic-mgmt-common_1.0.0_amd64.deb ]
[ finished ] [ target/python-wheels/bookworm/sonic_yang_mgmt-1.0-py3-none-any.whl ]
[ building ] [ target/python-wheels/bookworm/sonic_yang_mgmt-1.0-py3-none-any.whl-install ]
[ finished ] [ target/python-wheels/bookworm/sonic_yang_mgmt-1.0-py3-none-any.whl-install ]
[ building ] [ target/debs/bookworm/libswsscommon_1.0.0_amd64.deb ]
[ finished ] [ target/debs/bookworm/sonic-mgmt-common_1.0.0_amd64.deb ]
[ building ] [ target/debs/bookworm/sonic-mgmt-common-codegen_1.0.0_amd64.deb ]
[ finished ] [ target/debs/bookworm/sonic-mgmt-common-codegen_1.0.0_amd64.deb ]
[ building ] [ target/debs/bookworm/sonic-mgmt-common_1.0.0_amd64.deb-install ]
[ finished ] [ target/debs/bookworm/sonic-mgmt-common_1.0.0_amd64.deb-install ]
[ building ] [ target/debs/bookworm/sonic-mgmt-common-codegen_1.0.0_amd64.deb-install ]
[ finished ] [ target/debs/bookworm/sonic-mgmt-common-codegen_1.0.0_amd64.deb-install ]
[ building ] [ target/debs/bookworm/sonic-mgmt-framework_1.0-01_amd64.deb ]
[ finished ] [ target/debs/bookworm/sonic-mgmt-framework_1.0-01_amd64.deb ]
[ finished ] [ target/debs/bookworm/libswsscommon_1.0.0_amd64.deb ]
[ building ] [ target/debs/bookworm/python3-swsscommon_1.0.0_amd64.deb ]
[ building ] [ target/debs/bookworm/sonic-db-cli_1.0.0_amd64.deb ]
[ finished ] [ target/debs/bookworm/sonic-db-cli_1.0.0_amd64.deb ]
[ building ] [ target/debs/bookworm/libswsscommon-dev_1.0.0_amd64.deb ]
[ finished ] [ target/debs/bookworm/libswsscommon-dev_1.0.0_amd64.deb ]
[ building ] [ target/debs/bookworm/libswsscommon_1.0.0_amd64.deb-install ]
[ finished ] [ target/debs/bookworm/libswsscommon_1.0.0_amd64.deb-install ]
[ building ] [ target/debs/bookworm/libswsscommon-dev_1.0.0_amd64.deb-install ]
[ finished ] [ target/debs/bookworm/libswsscommon-dev_1.0.0_amd64.deb-install ]
[ building ] [ target/debs/bookworm/sonic-eventd_1.0.0-0_amd64.deb ]
[ finished ] [ target/debs/bookworm/python3-swsscommon_1.0.0_amd64.deb ]
[ building ] [ target/debs/bookworm/sonic-bmp_0.1_amd64.deb ]
[ finished ] [ target/sonic-vs.bin__vs__rfs.squashfs ]
[ building ] [ target/debs/bookworm/python3-swsscommon_1.0.0_amd64.deb-install ]
[ finished ] [ target/debs/bookworm/python3-swsscommon_1.0.0_amd64.deb-install ]
[ building ] [ target/debs/bookworm/dash-ha_1.0.0_amd64.deb ]
[ finished ] [ target/debs/bookworm/sonic-eventd_1.0.0-0_amd64.deb ]
[ finished ] [ target/debs/bookworm/dash-ha_1.0.0_amd64.deb ]
[ building ] [ target/debs/bookworm/stp_1.0.0_amd64.deb ]
[ building ] [ target/debs/bookworm/sonic-gnmi_0.1_amd64.deb ]
[ finished ] [ target/debs/bookworm/sonic-bmp_0.1_amd64.deb ]
[ building ] [ target/debs/bookworm/sonic-linkmgrd_1.0.0-1_amd64.deb ]
[ finished ] [ target/debs/bookworm/stp_1.0.0_amd64.deb ]
[ building ] [ target/debs/bookworm/sysmgr_1.0.0_amd64.deb ]
[ finished ] [ target/debs/bookworm/sonic-gnmi_0.1_amd64.deb ]
[ building ] [ target/debs/bookworm/sonic-dhcpmon_1.0.0-0_amd64.deb ]
[ finished ] [ target/debs/bookworm/sonic-dhcpmon_1.0.0-0_amd64.deb ]
[ building ] [ target/debs/bookworm/sonic-dhcp6relay_1.0.0-0_amd64.deb ]
[ finished ] [ target/debs/bookworm/sysmgr_1.0.0_amd64.deb ]
[ building ] [ target/debs/bookworm/wpasupplicant_2.9.0-14_amd64.deb ]
[ finished ] [ target/debs/bookworm/wpasupplicant_2.9.0-14_amd64.deb ]
[ building ] [ target/debs/bookworm/sonic-rsyslog-plugin_1.0.0-0_amd64.deb ]
[ finished ] [ target/debs/bookworm/sonic-rsyslog-plugin_1.0.0-0_amd64.deb ]
[ building ] [ target/python-wheels/bookworm/sonic_py_common-1.0-py3-none-any.whl ]
[ finished ] [ target/debs/bookworm/sonic-dhcp6relay_1.0.0-0_amd64.deb ]
[ building ] [ target/debs/bookworm/sonic-bmp_0.1_amd64.deb-install ]
[ finished ] [ target/debs/bookworm/sonic-bmp_0.1_amd64.deb-install ]
[ building ] [ target/debs/bookworm/stp_1.0.0_amd64.deb-install ]
[ finished ] [ target/debs/bookworm/stp_1.0.0_amd64.deb-install ]
[ finished ] [ target/python-wheels/bookworm/sonic_py_common-1.0-py3-none-any.whl ]
[ building ] [ target/python-wheels/bookworm/sonic_py_common-1.0-py3-none-any.whl-install ]
[ finished ] [ target/python-wheels/bookworm/sonic_py_common-1.0-py3-none-any.whl-install ]
[ building ] [ target/python-wheels/bookworm/sonic_containercfgd-1.0-py3-none-any.whl ]
[ building ] [ target/python-wheels/bookworm/sonic_config_engine-1.0-py3-none-any.whl ]
[ finished ] [ target/python-wheels/bookworm/sonic_containercfgd-1.0-py3-none-any.whl ]
[ building ] [ target/python-wheels/bookworm/sonic_d-2.0.0-py3-none-any.whl ]
[ finished ] [ target/python-wheels/bookworm/sonic_d-2.0.0-py3-none-any.whl ]
[ building ] [ target/python-wheels/bookworm/sonic_ledd-1.1-py3-none-any.whl ]
[ finished ] [ target/python-wheels/bookworm/sonic_ledd-1.1-py3-none-any.whl ]
[ building ] [ target/python-wheels/bookworm/sonic_pcied-1.0-py3-none-any.whl ]
[ finished ] [ target/python-wheels/bookworm/sonic_pcied-1.0-py3-none-any.whl ]
[ building ] [ target/python-wheels/bookworm/sonic_stormond-1.0-py3-none-any.whl ]
[ finished ] [ target/python-wheels/bookworm/sonic_stormond-1.0-py3-none-any.whl ]
[ building ] [ target/python-wheels/bookworm/sonic_dhcp_utilities-1.0-py3-none-any.whl ]
[ finished ] [ target/python-wheels/bookworm/sonic_dhcp_utilities-1.0-py3-none-any.whl ]
[ building ] [ target/python-wheels/bookworm/sonic_ctrmgrd-1.0.0-py3-none-any.whl ]
[ finished ] [ target/python-wheels/bookworm/sonic_ctrmgrd-1.0.0-py3-none-any.whl ]
[ finished ] [ target/debs/bookworm/p4lang-p4c_1.2.4.2-2_amd64.deb ]
[ building ] [ target/debs/bookworm/p4lang-p4c_1.2.4.2-2_amd64.deb-install ]
[ finished ] [ target/debs/bookworm/sonic-linkmgrd_1.0.0-1_amd64.deb ]
[ finished ] [ target/debs/bookworm/p4lang-p4c_1.2.4.2-2_amd64.deb-install ]
[ building ] [ target/debs/bookworm/libsai_1.0.0_amd64.deb ]
[ finished ] [ target/debs/bookworm/libsai_1.0.0_amd64.deb ]
[ building ] [ target/debs/bookworm/libsai_1.0.0_amd64.deb-install ]
[ finished ] [ target/debs/bookworm/libsai_1.0.0_amd64.deb-install ]
[ building ] [ target/debs/bookworm/libsairedis_1.0.0_amd64.deb ]
[ finished ] [ target/python-wheels/bookworm/sonic_config_engine-1.0-py3-none-any.whl ]
[ building ] [ target/docker-config-engine-bookworm.gz ]
[ building ] [ target/python-wheels/bookworm/sonic_config_engine-1.0-py3-none-any.whl-install ]
[ finished ] [ target/python-wheels/bookworm/sonic_config_engine-1.0-py3-none-any.whl-install ]
[ building ] [ target/python-wheels/bookworm/sonic_platform_common-1.0-py3-none-any.whl ]
[ building ] [ target/python-wheels/bookworm/sonic_bgpcfgd-1.0-py3-none-any.whl ]
[ finished ] [ target/python-wheels/bookworm/sonic_bgpcfgd-1.0-py3-none-any.whl ]
[ building ] [ target/python-wheels/bookworm/sonic_frr_mgmt_framework-1.0-py3-none-any.whl ]
[ finished ] [ target/python-wheels/bookworm/sonic_platform_common-1.0-py3-none-any.whl ]
[ building ] [ target/python-wheels/bookworm/system_health-1.0-py3-none-any.whl ]
[ finished ] [ target/docker-config-engine-bookworm.gz ]
[ building ] [ target/python-wheels/bookworm/sonic_platform_common-1.0-py3-none-any.whl-install ]
[ finished ] [ target/python-wheels/bookworm/sonic_frr_mgmt_framework-1.0-py3-none-any.whl ]
[ building ] [ target/docker-config-engine-bookworm.gz-load ]
[ finished ] [ target/python-wheels/bookworm/sonic_platform_common-1.0-py3-none-any.whl-install ]
[ building ] [ target/python-wheels/bookworm/sonic_utilities-1.2-py3-none-any.whl ]
[ finished ] [ target/docker-config-engine-bookworm.gz-load ]
[ building ] [ target/python-wheels/bookworm/sonic_psud-1.0-py3-none-any.whl ]
[ finished ] [ target/python-wheels/bookworm/system_health-1.0-py3-none-any.whl ]
[ building ] [ target/python-wheels/bookworm/sonic_syseepromd-1.0-py3-none-any.whl ]
[ finished ] [ target/python-wheels/bookworm/sonic_psud-1.0-py3-none-any.whl ]
[ building ] [ target/python-wheels/bookworm/sonic_thermalctld-1.0-py3-none-any.whl ]
[ finished ] [ target/python-wheels/bookworm/sonic_syseepromd-1.0-py3-none-any.whl ]
[ building ] [ target/python-wheels/bookworm/sonic_sensormond-1.0-py3-none-any.whl ]
[ finished ] [ target/python-wheels/bookworm/sonic_utilities-1.2-py3-none-any.whl ]
[ building ] [ target/python-wheels/bookworm/sonic_xcvrd-1.0-py3-none-any.whl ]
[ finished ] [ target/python-wheels/bookworm/sonic_thermalctld-1.0-py3-none-any.whl ]
[ building ] [ target/python-wheels/bookworm/sonic_ycabled-1.0-py3-none-any.whl ]
[ finished ] [ target/python-wheels/bookworm/sonic_sensormond-1.0-py3-none-any.whl ]
[ building ] [ target/python-wheels/bookworm/sonic_chassisd-1.0-py3-none-any.whl ]
[ finished ] [ target/python-wheels/bookworm/sonic_xcvrd-1.0-py3-none-any.whl ]
[ building ] [ target/docker-ptp.gz ]
[ finished ] [ target/python-wheels/bookworm/sonic_ycabled-1.0-py3-none-any.whl ]
[ building ] [ target/docker-router-advertiser.gz ]
[ finished ] [ target/python-wheels/bookworm/sonic_chassisd-1.0-py3-none-any.whl ]
[ building ] [ target/python-wheels/bookworm/asyncsnmp-2.1.0-py3-none-any.whl ]
[ finished ] [ target/docker-ptp.gz ]
[ building ] [ target/docker-sonic-mgmt-framework.gz ]
[ finished ] [ target/python-wheels/bookworm/asyncsnmp-2.1.0-py3-none-any.whl ]
[ building ] [ target/docker-sysmgr.gz ]
[ finished ] [ target/docker-router-advertiser.gz ]
[ building ] [ target/docker-dash-engine.gz ]
[ finished ] [ target/docker-sysmgr.gz ]
[ building ] [ target/python-wheels/bookworm/sonic_utilities-1.2-py3-none-any.whl-install ]
[ finished ] [ target/python-wheels/bookworm/sonic_utilities-1.2-py3-none-any.whl-install ]
[ building ] [ target/docker-auditd-watchdog.gz ]
[ finished ] [ target/docker-sonic-mgmt-framework.gz ]
[ building ] [ target/docker-auditd.gz ]
[ finished ] [ target/docker-auditd.gz ]
[ building ] [ target/docker-bmp-watchdog.gz ]
[ finished ] [ target/docker-dash-engine.gz ]
[ building ] [ target/python-wheels/bookworm/sonic_bmpcfgd_services-1.0-py3-none-any.whl ]
[ finished ] [ target/python-wheels/bookworm/sonic_bmpcfgd_services-1.0-py3-none-any.whl ]
[ building ] [ target/docker-database.gz ]
[ finished ] [ target/debs/bookworm/libsairedis_1.0.0_amd64.deb ]
[ building ] [ target/docker-eventd.gz ]
[ finished ] [ target/docker-auditd-watchdog.gz ]
[ building ] [ target/docker-gnmi-watchdog.gz ]
[ finished ] [ target/docker-database.gz ]
[ building ] [ target/docker-sonic-gnmi.gz ]
[ finished ] [ target/docker-bmp-watchdog.gz ]
[ building ] [ target/docker-lldp.gz ]
[ finished ] [ target/docker-eventd.gz ]
[ building ] [ target/docker-mux.gz ]
[ finished ] [ target/docker-sonic-gnmi.gz ]
[ building ] [ target/docker-platform-monitor.gz ]
[ finished ] [ target/docker-mux.gz ]
[ finished ] [ target/docker-lldp.gz ]
[ building ] [ target/docker-snmp.gz ]
[ building ] [ target/docker-sonic-gnmi.gz-load ]
[ finished ] [ target/docker-sonic-gnmi.gz-load ]
[ building ] [ target/debs/bookworm/syncd-vs_1.0.0_amd64.deb ]
[ finished ] [ target/debs/bookworm/syncd-vs_1.0.0_amd64.deb ]
[ building ] [ target/docker-dhcp-relay.gz ]
/sonic/dockers/docker-dhcp-relay/cli-plugin-tests /sonic
[ finished ] [ target/docker-gnmi-watchdog.gz ]
[ building ] [ target/python-wheels/bookworm/sonic_host_services-1.0-py3-none-any.whl ]
/sonic
[ finished ] [ target/python-wheels/bookworm/sonic_host_services-1.0-py3-none-any.whl ]
[ building ] [ target/docker-sonic-bmp.gz ]
[ finished ] [ target/docker-snmp.gz ]
[ building ] [ target/debs/bookworm/libsairedis-dev_1.0.0_amd64.deb ]
[ finished ] [ target/debs/bookworm/libsairedis-dev_1.0.0_amd64.deb ]
[ building ] [ target/debs/bookworm/libsaimetadata_1.0.0_amd64.deb ]
[ finished ] [ target/debs/bookworm/libsaimetadata_1.0.0_amd64.deb ]
[ building ] [ target/debs/bookworm/libsaivs_1.0.0_amd64.deb ]
[ finished ] [ target/debs/bookworm/libsaivs_1.0.0_amd64.deb ]
[ building ] [ target/debs/bookworm/libsairedis_1.0.0_amd64.deb-install ]
[ finished ] [ target/docker-platform-monitor.gz ]
[ building ] [ target/docker-sonic-telemetry.gz ]
[ finished ] [ target/debs/bookworm/libsairedis_1.0.0_amd64.deb-install ]
[ building ] [ target/docker-syncd-vs.gz ]
[ finished ] [ target/docker-dhcp-relay.gz ]
[ building ] [ target/docker-gbsyncd-vs.gz ]
[ finished ] [ target/docker-sonic-bmp.gz ]
[ building ] [ target/debs/bookworm/libsaimetadata-dev_1.0.0_amd64.deb ]
[ finished ] [ target/debs/bookworm/libsaimetadata-dev_1.0.0_amd64.deb ]
[ building ] [ target/debs/bookworm/libsaivs-dev_1.0.0_amd64.deb ]
[ finished ] [ target/debs/bookworm/libsaivs-dev_1.0.0_amd64.deb ]
[ building ] [ target/debs/bookworm/libsairedis-dev_1.0.0_amd64.deb-install ]
[ finished ] [ target/debs/bookworm/libsairedis-dev_1.0.0_amd64.deb-install ]
[ building ] [ target/debs/bookworm/libsaimetadata_1.0.0_amd64.deb-install ]
[ finished ] [ target/debs/bookworm/libsaimetadata_1.0.0_amd64.deb-install ]
[ building ] [ target/debs/bookworm/libsaivs_1.0.0_amd64.deb-install ]
[ finished ] [ target/debs/bookworm/libsaivs_1.0.0_amd64.deb-install ]
[ building ] [ target/debs/bookworm/libsaimetadata-dev_1.0.0_amd64.deb-install ]
[ finished ] [ target/debs/bookworm/libsaimetadata-dev_1.0.0_amd64.deb-install ]
[ building ] [ target/debs/bookworm/libsaivs-dev_1.0.0_amd64.deb-install ]
[ finished ] [ target/debs/bookworm/libsaivs-dev_1.0.0_amd64.deb-install ]
[ building ] [ target/debs/bookworm/swss_1.0.0_amd64.deb ]
[ finished ] [ target/docker-sonic-telemetry.gz ]
[ finished ] [ target/docker-gbsyncd-vs.gz ]
[ finished ] [ target/debs/bookworm/swss_1.0.0_amd64.deb ]
[ building ] [ target/docker-swss-layer-bookworm.gz ]
[ building ] [ target/docker-stp.gz ]
[ finished ] [ target/docker-syncd-vs.gz ]
[ finished ] [ target/docker-swss-layer-bookworm.gz ]
[ building ] [ target/docker-swss-layer-bookworm.gz-load ]
[ finished ] [ target/docker-swss-layer-bookworm.gz-load ]
[ building ] [ target/docker-dash-ha.gz ]
[ building ] [ target/docker-fpm-frr.gz ]
[ building ] [ target/docker-nat.gz ]
[ finished ] [ target/docker-stp.gz ]
[ building ] [ target/docker-orchagent.gz ]
[ finished ] [ target/docker-dash-ha.gz ]
[ building ] [ target/docker-sflow.gz ]
[ finished ] [ target/docker-nat.gz ]
[ building ] [ target/docker-teamd.gz ]
[ finished ] [ target/docker-fpm-frr.gz ]
[ building ] [ target/docker-macsec.gz ]
/sonic/dockers/docker-macsec/cli-plugin-tests /sonic
/sonic
[ finished ] [ target/docker-sflow.gz ]
[ building ] [ target/docker-sonic-vs.gz ]
[ finished ] [ target/docker-teamd.gz ]
[ finished ] [ target/docker-orchagent.gz ]
[ finished ] [ target/docker-macsec.gz ]
basename: missing operand
Try 'basename --help' for more information.
basename: missing operand
Try 'basename --help' for more information.
[ building ] [ target/sonic-vs.bin ]
[ building ] [ target/sonic-vs.img.gz ]
[ finished ] [ target/sonic-vs.img.gz ]
[ FAIL LOG START ] [ target/sonic-vs.img.gz ]
Build start time: Thu Oct 1 09:53:39 UTC 2026
++ '[' -f .arch ']'
++ cat .arch
+ CONFIGURED_ARCH=amd64
+ DOCKER_VERSION=5:24.0.2-1~debian.12~bookworm
+ CONTAINERD_IO_VERSION=1.6.21-1
+ LINUX_KERNEL_VERSION=6.1.0-29-2
+ FILESYSTEM_ROOT=./fsroot
+ PLATFORM_DIR=platform
+ HOSTNAME=sonic
+ DEFAULT_USERINFO='Default admin user,,,'
+ BUILD_TOOL_PATH=src/sonic-build-hooks/buildinfo
+ TRUSTED_GPG_DIR=src/sonic-build-hooks/buildinfo/trusted.gpg.d
+ . ./onie-image.conf
++ : 32768
++ : x86_64
++ : vs
++ ONIEIMAGE_VERSION=r0
++ FILESYSTEM_ROOT=./fsroot-vs
++ FILESYSTEM_SQUASHFS=fs.squashfs
++ INSTALLER_PAYLOAD=fs.zip
++ FILESYSTEM_DOCKERFS=dockerfs.tar.gz
++ DOCKERFS_DIR=docker
++ DOCKER_RAMFS_SIZE=3500M
++ OUTPUT_ONIE_IMAGE=target/sonic-vs.bin
++ OUTPUT_RAW_IMAGE=target/sonic-vs.raw
++ RAW_IMAGE_DISK_SIZE=1700
++ OUTPUT_KVM_IMAGE=target/sonic-vs.img
++ KVM_IMAGE_DISK_SIZE=16
++ OUTPUT_ABOOT_IMAGE=target/sonic-aboot-vs.swi
++ ABOOT_BOOT_IMAGE=.sonic-boot.swi
++ OUTPUT_KVM_4ASIC_IMAGE=target/sonic-4asic-vs.img
++ OUTPUT_KVM_6ASIC_IMAGE=target/sonic-6asic-vs.img
++ OUTPUT_DSC_IMAGE=target/sonic-vs.tar
+ '[' -n 32768 ']'
+ '[' -n fs.zip ']'
+ '[' -n fs.squashfs ']'
+ '[' kvm = aboot ']'
+ [[ y != y ]]
+ [[ n == y ]]
+ [[ y == y ]]
+ echo '[INFO] RFS build: second stage'
[INFO] RFS build: second stage
+ sudo mount proc /proc -t proc
+ sudo fuser -vm ./fsroot-vs
USER PID ACCESS COMMAND
/sonic/fsroot-vs: root kernel mount /usr/sbin/docker-init
jenkins 1 ..ce. docker-init
jenkins 8 ..c.. bash
jenkins 9 ..c.. make
root 6236 ....m dockerd
root 6306 ....m containerd
jenkins 504340 ..c.. bash
jenkins 505063 ..c.. docker
jenkins 505064 ..c.. process_log.sh
jenkins 512014 ..c.. bash
jenkins 512284 ..c.. bash
jenkins 512810 ..c.. build_debian.sh
jenkins 512811 ..c.. process_log.sh
root 513040 ..c.. sudo
root 513041 F.c.. unsquashfs
jenkins 513200 ..c.. build_debian.sh
jenkins 513201 ..c.. process_log.sh
root 513220 ..c.. sudo
+ sudo rm -rf ./fsroot-vs
rm: cannot remove './fsroot-vs/usr/lib/firmware/nvidia': Directory not empty
[ FAIL LOG END ] [ target/sonic-vs.img.gz ]
make: *** [slave.mk:1435: target/sonic-vs.img.gz] Error 1
make: *** Waiting for unfinished jobs....
[ finished ] [ target/sonic-vs.bin ]
[ FAIL LOG START ] [ target/sonic-vs.bin ]
Build start time: Thu Oct 1 09:53:39 UTC 2026
++ '[' -f .arch ']'
++ cat .arch
+ CONFIGURED_ARCH=amd64
+ DOCKER_VERSION=5:24.0.2-1~debian.12~bookworm
+ CONTAINERD_IO_VERSION=1.6.21-1
+ LINUX_KERNEL_VERSION=6.1.0-29-2
+ FILESYSTEM_ROOT=./fsroot
+ PLATFORM_DIR=platform
+ HOSTNAME=sonic
+ DEFAULT_USERINFO='Default admin user,,,'
+ BUILD_TOOL_PATH=src/sonic-build-hooks/buildinfo
+ TRUSTED_GPG_DIR=src/sonic-build-hooks/buildinfo/trusted.gpg.d
+ . ./onie-image.conf
++ : 32768
++ : x86_64
++ : vs
++ ONIEIMAGE_VERSION=r0
++ FILESYSTEM_ROOT=./fsroot-vs
++ FILESYSTEM_SQUASHFS=fs.squashfs
++ INSTALLER_PAYLOAD=fs.zip
++ FILESYSTEM_DOCKERFS=dockerfs.tar.gz
++ DOCKERFS_DIR=docker
++ DOCKER_RAMFS_SIZE=3500M
++ OUTPUT_ONIE_IMAGE=target/sonic-vs.bin
++ OUTPUT_RAW_IMAGE=target/sonic-vs.raw
++ RAW_IMAGE_DISK_SIZE=1700
++ OUTPUT_KVM_IMAGE=target/sonic-vs.img
++ KVM_IMAGE_DISK_SIZE=16
++ OUTPUT_ABOOT_IMAGE=target/sonic-aboot-vs.swi
++ ABOOT_BOOT_IMAGE=.sonic-boot.swi
++ OUTPUT_KVM_4ASIC_IMAGE=target/sonic-4asic-vs.img
++ OUTPUT_KVM_6ASIC_IMAGE=target/sonic-6asic-vs.img
++ OUTPUT_DSC_IMAGE=target/sonic-vs.tar
+ '[' -n 32768 ']'
+ '[' -n fs.zip ']'
+ '[' -n fs.squashfs ']'
+ '[' onie = aboot ']'
+ [[ y != y ]]
+ [[ n == y ]]
+ [[ y == y ]]
+ echo '[INFO] RFS build: second stage'
[INFO] RFS build: second stage
+ sudo mount proc /proc -t proc
+ sudo fuser -vm ./fsroot-vs
USER PID ACCESS COMMAND
/sonic/fsroot-vs: root kernel mount /usr/sbin/docker-init
jenkins 1 ..ce. docker-init
jenkins 8 ..c.. bash
jenkins 9 ..c.. make
root 6236 ....m dockerd
root 6306 ....m containerd
jenkins 504340 ..c.. bash
jenkins 505063 ..c.. docker
jenkins 505064 ..c.. process_log.sh
jenkins 512014 ..c.. bash
jenkins 512284 ..c.. bash
jenkins 512808 ..c.. j2
jenkins 512810 ..c.. build_debian.sh
jenkins 512811 ..c.. process_log.sh
root 512822 ..c.. sudo
+ sudo rm -rf ./fsroot-vs
+ sudo unsquashfs -d ./fsroot-vs target/sonic-vs.bin__vs__rfs.squashfs
Parallel unsquashfs: Using 112 processors
33651 inodes (34125 blocks) to write
[=====| ] 6050/67776 8%
[======/ ] 7126/67776 10%
[========\ ] 10317/67776 15%
[==========| ] 12426/67776 18%
set_attributes: failed to set time on ./fsroot-vs/usr/games, because No such file or directory
set_attributes: failed to set time on ./fsroot-vs/usr/lib/apt/apt-helper, because No such file or directory
set_attributes: failed to set time on ./fsroot-vs/usr/lib/apt/apt.systemd.daily, because No such file or directory
set_attributes: failed to set time on ./fsroot-vs/usr/lib/apt/methods/cdrom, because No such file or directory
set_attributes: failed to set time on ./fsroot-vs/usr/lib/apt/methods/copy, because No such file or directory
set_attributes: failed to set time on ./fsroot-vs/usr/lib/apt/methods/file, because No such file or directory
set_attributes: failed to set time on ./fsroot-vs/usr/lib/apt/methods/ftp, because No such file or directory
set_attributes: failed to set time on ./fsroot-vs/usr/lib/apt/methods/gpgv, because No such file or directory
set_attributes: failed to set time on ./fsroot-vs/usr/lib/apt/methods/http, because No such file or directory
set_attributes: failed to set time on ./fsroot-vs/usr/lib/apt/methods/mirror, because No such file or directory
set_attributes: failed to set time on ./fsroot-vs/usr/lib/apt/methods/rred, because No such file or directory
set_attributes: failed to set time on ./fsroot-vs/usr/lib/apt/methods/rsh, because No such file or directory
set_attributes: failed to set time on ./fsroot-vs/usr/lib/apt/methods/store, because No such file or directory
set_attributes: failed to set time on ./fsroot-vs/usr/lib/apt/methods, because No such file or directory
set_attributes: failed to set time on ./fsroot-vs/usr/lib/apt/planners, because No such file or directory
set_attributes: failed to set time on ./fsroot-vs/usr/lib/apt/solvers/dump, because No such file or directory
set_attributes: failed to set time on ./fsroot-vs/usr/lib/apt/solvers, because No such file or directory
set_attributes: failed to set time on ./fsroot-vs/usr/lib/apt, because No such file or directory
set_attributes: failed to set time on ./fsroot-vs/usr/lib/dpkg/methods/apt/desc.apt, because No such file or directory
set_attributes: failed to set time on ./fsroot-vs/usr/lib/dpkg/methods/apt/install, because No such file or directory
set_attributes: failed to set time on ./fsroot-vs/usr/lib/dpkg/methods/apt/names, because No such file or directory
set_attributes: failed to set time on ./fsroot-vs/usr/lib/dpkg/methods/apt/setup, because No such file or directory
set_attributes: failed to set time on ./fsroot-vs/usr/lib/dpkg/methods/apt/update, because No such file or directory
set_attributes: failed to set time on ./fsroot-vs/usr/lib/dpkg/methods/apt, because No such file or directory
set_attributes: failed to set time on ./fsroot-vs/usr/lib/dpkg/methods, because No such file or directory
set_attributes: failed to set time on ./fsroot-vs/usr/lib/dpkg, because No such file or directory
set_attributes: failed to set time on ./fsroot-vs/usr/lib/environment.d, because No such file or directory
set_attributes: failed to set time on ./fsroot-vs/usr/lib/file/magic.mgc, because No such file or directory
set_attributes: failed to set time on ./fsroot-vs/usr/lib/file, because No such file or directory
set_attributes: failed to set time on ./fsroot-vs/usr/lib/firmware/3com/typhoon.bin, because No such file or directory
set_attributes: failed to set time on ./fsroot-vs/usr/lib/firmware/3com, because No such file or directory
set_attributes: failed to set time on ./fsroot-vs/usr/lib/firmware/advansys/3550.bin, because No such file or directory
set_attributes: failed to set time on ./fsroot-vs/usr/lib/firmware/advansys/38C0800.bin, because No such file or directory
set_attributes: failed to set time on ./fsroot-vs/usr/lib/firmware/advansys/38C1600.bin, because No such file or directory
set_attributes: failed to set time on ./fsroot-vs/usr/lib/firmware/advansys/mcode.bin, because No such file or directory
set_attributes: failed to set time on ./fsroot-vs/usr/lib/firmware/advansys, because No such file or directory
set_attributes: failed to set time on ./fsroot-vs/usr/lib/firmware/agere_ap_fw.bin, because No such file or directory
set_attributes: failed to set time on ./fsroot-vs/usr/lib/firmware/agere_sta_fw.bin, because No such file or directory
set_attributes: failed to set time on ./fsroot-vs/usr/lib/firmware/amdgpu/aldebaran_mec.bin, because No such file or directory
set_attributes: failed to set time on ./fsroot-vs/usr/lib/firmware/amdgpu/aldebaran_mec2.bin, because No such file or directory
set_attributes: failed to set time on ./fsroot-vs/usr/lib/firmware/amdgpu/aldebaran_rlc.bin, because No such file or directory
set_attributes: failed to set time on ./fsroot-vs/usr/lib/firmware/amdgpu/aldebaran_sdma.bin, because No such file or directory
set_attributes: failed to set time on ./fsroot-vs/usr/lib/firmware/amdgpu/aldebaran_sjt_mec.bin, because No such file or directory
set_attributes: failed to set time on ./fsroot-vs/usr/lib/firmware/amdgpu/aldebaran_sjt_mec2.bin, because No such file or directory
set_attributes: failed to set time on ./fsroot-vs/usr/lib/firmware/amdgpu/aldebaran_smc.bin, because No such file or directory
set_attributes: failed to set time on ./fsroot-vs/usr/lib/firmware/amdgpu/aldebaran_sos.bin, because No such file or directory
set_attributes: failed to set time on ./fsroot-vs/usr/lib/firmware/amdgpu/aldebaran_ta.bin, because No such file or directory
set_attributes: failed to set time on ./fsroot-vs/usr/lib/firmware/amdgpu/aldebaran_vcn.bin, because No such file or directory
set_attributes: failed to set time on ./fsroot-vs/usr/lib/firmware/amdgpu/arcturus_asd.bin, because No such file or directory
set_attributes: failed to set time on ./fsroot-vs/usr/lib/firmware/amdgpu/arcturus_gpu_info.bin, because No such file or directory
set_attributes: failed to set time on ./fsroot-vs/usr/lib/firmware/amdgpu/arcturus_mec.bin, because No such file or directory
set_attributes: failed to set time on ./fsroot-vs/usr/lib/firmware/amdgpu/arcturus_mec2.bin, because No such file or directory
set_attributes: failed to set time on ./fsroot-vs/usr/lib/firmware/amdgpu/arcturus_rlc.bin, because No such file or directory
set_attributes: failed to set time on ./fsroot-vs/usr/lib/firmware/amdgpu/arcturus_sdma.bin, because No such file or directory
set_attributes: failed to set time on ./fsroot-vs/usr/lib/firmware/amdgpu/arcturus_smc.bin, because No such file or directory
set_attributes: failed to set time on ./fsroot-vs/usr/lib/firmware/amdgpu/arcturus_sos.bin, because No such file or directory
set_attributes: failed to set time on ./fsroot-vs/usr/lib/firmware/amdgpu/arcturus_ta.bin, because No such file or directory
set_attributes: failed to set time on ./fsroot-vs/usr/lib/firmware/amdgpu/arcturus_vcn.bin, because No such file or directory
set_attributes: failed to set time on ./fsroot-vs/usr/lib/firmware/amdgpu/banks_k_2_smc.bin, because No such file or directory
set_attributes: failed to set time on ./fsroot-vs/usr/lib/firmware/amdgpu/beige_goby_ce.bin, because No such file or directory
set_attributes: failed to set time on ./fsroot-vs/usr/lib/firmware/amdgpu/beige_goby_dmcub.bin, because No such file or directory
set_attributes: failed to set time on ./fsroot-vs/usr/lib/firmware/amdgpu/beige_goby_me.bin, because No such file or directory
set_attributes: failed to set time on ./fsroot-vs/usr/lib/firmware/amdgpu/beige_goby_mec.bin, because No such file or directory
set_attributes: failed to set time on ./fsroot-vs/usr/lib/firmware/amdgpu/beige_goby_mec2.bin, because No such file or directory
set_attributes: failed to set time on ./fsroot-vs/usr/lib/firmware/amdgpu/beige_goby_pfp.bin, because No such file or directory
set_attributes: failed to set time on ./fsroot-vs/usr/lib/firmware/amdgpu/beige_goby_rlc.bin, because No such file or directory
set_attributes: failed to set time on ./fsroot-vs/usr/lib/firmware/amdgpu/beige_goby_sdma.bin, because No such file or directory
set_attributes: failed to set time on ./fsroot-vs/usr/lib/firmware/amdgpu/beige_goby_smc.bin, because No such file or directory
set_attributes: failed to set time on ./fsroot-vs/usr/lib/firmware/amdgpu/beige_goby_sos.bin, because No such file or directory
set_attributes: failed to set time on ./fsroot-vs/usr/lib/firmware/amdgpu/beige_goby_ta.bin, because No such file or directory
set_attributes: failed to set time on ./fsroot-vs/usr/lib/firmware/amdgpu/beige_goby_vcn.bin, because No such file or directory
set_attributes: failed to set time on ./fsroot-vs/usr/lib/firmware/amdgpu/bonaire_ce.bin, because No such file or directory
set_attributes: failed to set time on ./fsroot-vs/usr/lib/firmware/amdgpu/bonaire_k_smc.bin, because No such file or directory
set_attributes: failed to set time on ./fsroot-vs/usr/lib/firmware/amdgpu/bonaire_mc.bin, because No such file or directory
set_attributes: failed to set time on ./fsroot-vs/usr/lib/firmware/amdgpu/bonaire_me.bin, because No such file or directory
set_attributes: failed to set time on ./fsroot-vs/usr/lib/firmware/amdgpu/bonaire_mec.bin, because No such file or directory
set_attributes: failed to set time on ./fsroot-vs/usr/lib/firmware/amdgpu/bonaire_pfp.bin, because No such file or directory
set_attributes: failed to set time on ./fsroot-vs/usr/lib/firmware/amdgpu/bonaire_rlc.bin, because No such file or directory
set_attributes: failed to set time on ./fsroot-vs/usr/lib/firmware/amdgpu/bonaire_sdma.bin, because No such file or directory
set_attributes: failed to set time on ./fsroot-vs/usr/lib/firmware/amdgpu/bonaire_sdma1.bin, because No such file or directory
set_attributes: failed to set time on ./fsroot-vs/usr/lib/firmware/amdgpu/bonaire_smc.bin, because No such file or directory
set_attributes: failed to set time on ./fsroot-vs/usr/lib/firmware/amdgpu/bonaire_uvd.bin, because No such file or directory
set_attributes: failed to set time on ./fsroot-vs/usr/lib/firmware/amdgpu/bonaire_vce.bin, because No such file or directory
set_attributes: failed to set time on ./fsroot-vs/usr/lib/firmware/amdgpu/carrizo_ce.bin, because No such file or directory
set_attributes: failed to set time on ./fsroot-vs/usr/lib/firmware/amdgpu/carrizo_me.bin, because No such file or directory
set_attributes: failed to set time on ./fsroot-vs/usr/lib/firmware/amdgpu/carrizo_mec.bin, because No such file or directory
set_attributes: failed to set time on ./fsroot-vs/usr/lib/firmware/amdgpu/carrizo_mec2.bin, because No such file or directory
set_attributes: failed to set time on ./fsroot-vs/usr/lib/firmware/amdgpu/carrizo_pfp.bin, because No such file or directory
set_attributes: failed to set time on ./fsroot-vs/usr/lib/firmware/amdgpu/carrizo_rlc.bin, because No such file or directory
set_attributes: failed to set time on ./fsroot-vs/usr/lib/firmware/amdgpu/carrizo_sdma.bin, because No such file or directory
set_attributes: failed to set time on ./fsroot-vs/usr/lib/firmware/amdgpu/carrizo_sdma1.bin, because No such file or directory
set_attributes: failed to set time on ./fsroot-vs/usr/lib/firmware/amdgpu/carrizo_uvd.bin, because No such file or directory
set_attributes: failed to set time on ./fsroot-vs/usr/lib/firmware/amdgpu/carrizo_vce.bin, because No such file or directory
set_attributes: failed to set time on ./fsroot-vs/usr/lib/firmware/amdgpu/cyan_skillfish2_ce.bin, because No such file or directory
set_attributes: failed to set time on ./fsroot-vs/usr/lib/firmware/amdgpu/cyan_skillfish2_me.bin, because No such file or directory
set_attributes: failed to set time on ./fsroot-vs/usr/lib/firmware/amdgpu/cyan_skillfish2_mec.bin, because No such file or directory
set_attributes: failed to set time on ./fsroot-vs/usr/lib/firmware/amdgpu/cyan_skillfish2_mec2.bin, because No such file or directory
set_attributes: failed to set time on ./fsroot-vs/usr/lib/firmware/amdgpu/cyan_skillfish2_pfp.bin, because No such file or directory
set_attributes: failed to set time on ./fsroot-vs/usr/lib/firmware/amdgpu/cyan_skillfish2_rlc.bin, because No such file or directory
set_attributes: failed to set time on ./fsroot-vs/usr/lib/firmware/amdgpu/cyan_skillfish2_sdma.bin, because No such file or directory
set_attributes: failed to set time on ./fsroot-vs/usr/lib/firmware/amdgpu/cyan_skillfish2_sdma1.bin, because No such file or directory
set_attributes: failed to set time on ./fsroot-vs/usr/lib/firmware/amdgpu/dcn_3_1_4_dmcub.bin, because No such file or directory
set_attributes: failed to set time on ./fsroot-vs/usr/lib/firmware/amdgpu/dcn_3_1_5_dmcub.bin, because No such file or directory
set_attributes: failed to set time on ./fsroot-vs/usr/lib/firmware/amdgpu/dcn_3_1_6_dmcub.bin, because No such file or directory
set_attributes: failed to set time on ./fsroot-vs/usr/lib/firmware/amdgpu/dcn_3_2_0_dmcub.bin, because No such file or directory
set_attributes: failed to set time on ./fsroot-vs/usr/lib/firmware/amdgpu/dcn_3_2_1_dmcub.bin, because No such file or directory
set_attributes: failed to set time on ./fsroot-vs/usr/lib/firmware/amdgpu/dimgrey_cavefish_ce.bin, because No such file or directory
set_attributes: failed to set time on ./fsroot-vs/usr/lib/firmware/amdgpu/dimgrey_cavefish_dmcub.bin, because No such file or directory
set_attributes: failed to set time on ./fsroot-vs/usr/lib/firmware/amdgpu/dimgrey_cavefish_me.bin, because No such file or directory
set_attributes: failed to set time on ./fsroot-vs/usr/lib/firmware/amdgpu/dimgrey_cavefish_mec.bin, because No such file or directory
set_attributes: failed to set time on ./fsroot-vs/usr/lib/firmware/amdgpu/dimgrey_cavefish_mec2.bin, because No such file or directory
set_attributes: failed to set time on ./fsroot-vs/usr/lib/firmware/amdgpu/dimgrey_cavefish_pfp.bin, because No such file or directory
set_attributes: failed to set time on ./fsroot-vs/usr/lib/firmware/amdgpu/dimgrey_cavefish_rlc.bin, because No such file or directory
set_attributes: failed to set time on ./fsroot-vs/usr/lib/firmware/amdgpu/dimgrey_cavefish_sdma.bin, because No such file or directory
set_attributes: failed to set time on ./fsroot-vs/usr/lib/firmware/amdgpu/dimgrey_cavefish_smc.bin, because No such file or directory
set_attributes: failed to set time on ./fsroot-vs/usr/lib/firmware/amdgpu/dimgrey_cavefish_sos.bin, because No such file or directory
set_attributes: failed to set time on ./fsroot-vs/usr/lib/firmware/amdgpu/dimgrey_cavefish_ta.bin, because No such file or directory
set_attributes: failed to set time on ./fsroot-vs/usr/lib/firmware/amdgpu/dimgrey_cavefish_vcn.bin, because No such file or directory
set_attributes: failed to set time on ./fsroot-vs/usr/lib/firmware/amdgpu/fiji_ce.bin, because No such file or directory
set_attributes: failed to set time on ./fsroot-vs/usr/lib/firmware/amdgpu/fiji_mc.bin, because No such file or directory
set_attributes: failed to set time on ./fsroot-vs/usr/lib/firmware/amdgpu/fiji_me.bin, because No such file or directory
set_attributes: failed to set time on ./fsroot-vs/usr/lib/firmware/amdgpu/fiji_mec.bin, because No such file or directory
set_attributes: failed to set time on ./fsroot-vs/usr/lib/firmware/amdgpu/fiji_mec2.bin, because No such file or directory
set_attributes: failed to set time on ./fsroot-vs/usr/lib/firmware/amdgpu/fiji_pfp.bin, because No such file or directory
set_attributes: failed to set time on ./fsroot-vs/usr/lib/firmware/amdgpu/fiji_rlc.bin, because No such file or directory
set_attributes: failed to set time on ./fsroot-vs/usr/lib/firmware/amdgpu/fiji_sdma.bin, because No such file or directory
set_attributes: failed to set time on ./fsroot-vs/usr/lib/firmware/amdgpu/fiji_sdma1.bin, because No such file or directory
set_attributes: failed to set time on ./fsroot-vs/usr/lib/firmware/amdgpu/fiji_smc.bin, because No such file or directory
set_attributes: failed to set time on ./fsroot-vs/usr/lib/firmware/amdgpu/fiji_uvd.bin, because No such file or directory
set_attributes: failed to set time on ./fsroot-vs/usr/lib/firmware/amdgpu/fiji_vce.bin, because No such file or directory
set_attributes: failed to set time on ./fsroot-vs/usr/lib/firmware/amdgpu/gc_10_3_6_ce.bin, because No such file or directory
set_attributes: failed to set time on ./fsroot-vs/usr/lib/firmware/amdgpu/gc_10_3_6_me.bin, because No such file or directory
set_attributes: failed to set time on ./fsroot-vs/usr/lib/firmware/amdgpu/gc_10_3_6_mec.bin, because No such file or directory
set_attributes: failed to set time on ./fsroot-vs/usr/lib/firmware/amdgpu/gc_10_3_6_mec2.bin, because No such file or directory
set_attributes: failed to set time on ./fsroot-vs/usr/lib/firmware/amdgpu/gc_10_3_6_pfp.bin, because No such file or directory
set_attributes: failed to set time on ./fsroot-vs/usr/lib/firmware/amdgpu/gc_10_3_6_rlc.bin, because No such file or directory
set_attributes: failed to set time on ./fsroot-vs/usr/lib/firmware/amdgpu/gc_10_3_7_ce.bin, because No such file or directory
set_attributes: failed to set time on ./fsroot-vs/usr/lib/firmware/amdgpu/gc_10_3_7_me.bin, because No such file or directory
set_attributes: failed to set time on ./fsroot-vs/usr/lib/firmware/amdgpu/gc_10_3_7_mec.bin, because No such file or directory
set_attributes: failed to set time on ./fsroot-vs/usr/lib/firmware/amdgpu/gc_10_3_7_mec2.bin, because No such file or directory
set_attributes: failed to set time on ./fsroot-vs/usr/lib/firmware/amdgpu/gc_10_3_7_pfp.bin, because No such file or directory
set_attributes: failed to set time on ./fsroot-vs/usr/lib/firmware/amdgpu/gc_10_3_7_rlc.bin, because No such file or directory
set_attributes: failed to set time on ./fsroot-vs/usr/lib/firmware/amdgpu/gc_11_0_0_imu.bin, because No such file or directory
set_attributes: failed to set time on ./fsroot-vs/usr/lib/firmware/amdgpu/gc_11_0_0_me.bin, because No such file or directory
set_attributes: failed to set time on ./fsroot-vs/usr/lib/firmware/amdgpu/gc_11_0_0_mec.bin, because No such file or directory
set_attributes: failed to set time on ./fsroot-vs/usr/lib/firmware/amdgpu/gc_11_0_0_mes.bin, because No such file or directory
set_attributes: failed to set time on ./fsroot-vs/usr/lib/firmware/amdgpu/gc_11_0_0_mes1.bin, because No such file or directory
set_attributes: failed to set time on ./fsroot-vs/usr/lib/firmware/amdgpu/gc_11_0_0_pfp.bin, because No such file or directory
set_attributes: failed to set time on ./fsroot-vs/usr/lib/firmware/amdgpu/gc_11_0_0_rlc.bin, because No such file or directory
set_attributes: failed to set time on ./fsroot-vs/usr/lib/firmware/amdgpu/gc_11_0_1_imu.bin, because No such file or directory
set_attributes: failed to set time on ./fsroot-vs/usr/lib/firmware/amdgpu/gc_11_0_1_me.bin, because No such file or directory
set_attributes: failed to set time on ./fsroot-vs/usr/lib/firmware/amdgpu/gc_11_0_1_mec.bin, because No such file or directory
set_attributes: failed to set time on ./fsroot-vs/usr/lib/firmware/amdgpu/gc_11_0_1_mes.bin, because No such file or directory
set_attributes: failed to set time on ./fsroot-vs/usr/lib/firmware/amdgpu/gc_11_0_1_mes1.bin, because No such file or directory
set_attributes: failed to set time on ./fsroot-vs/usr/lib/firmware/amdgpu/gc_11_0_1_pfp.bin, because No such file or directory
set_attributes: failed to set time on ./fsroot-vs/usr/lib/firmware/amdgpu/gc_11_0_1_rlc.bin, because No such file or directory
set_attributes: failed to set time on ./fsroot-vs/usr/lib/firmware/amdgpu/gc_11_0_2_imu.bin, because No such file or directory
set_attributes: failed to set time on ./fsroot-vs/usr/lib/firmware/amdgpu/gc_11_0_2_me.bin, because No such file or directory
set_attributes: failed to set time on ./fsroot-vs/usr/lib/firmware/amdgpu/gc_11_0_2_mec.bin, because No such file or directory
set_attributes: failed to set time on ./fsroot-vs/usr/lib/firmware/amdgpu/gc_11_0_2_mes.bin, because No such file or directory
set_attributes: failed to set time on ./fsroot-vs/usr/lib/firmware/amdgpu/gc_11_0_2_mes1.bin, because No such file or directory
set_attributes: failed to set time on ./fsroot-vs/usr/lib/firmware/amdgpu/gc_11_0_2_pfp.bin, because No such file or directory
set_attributes: failed to set time on ./fsroot-vs/usr/lib/firmware/amdgpu/gc_11_0_2_rlc.bin, because No such file or directory
set_attributes: failed to set time on ./fsroot-vs/usr/lib/firmware/amdgpu/green_sardine_asd.bin, because No such file or directory
set_attributes: failed to set time on ./fsroot-vs/usr/lib/firmware/amdgpu/green_sardine_ce.bin, because No such file or directory
set_attributes: failed to set time on ./fsroot-vs/usr/lib/firmware/amdgpu/green_sardine_dmcub.bin, because No such file or directory
set_attributes: failed to set time on ./fsroot-vs/usr/lib/firmware/amdgpu/green_sardine_me.bin, because No such file or directory
set_attributes: failed to set time on ./fsroot-vs/usr/lib/firmware/amdgpu/green_sardine_mec.bin, because No such file or directory
set_attributes: failed to set time on ./fsroot-vs/usr/lib/firmware/amdgpu/green_sardine_mec2.bin, because No such file or directory
set_attributes: failed to set time on ./fsroot-vs/usr/lib/firmware/amdgpu/green_sardine_pfp.bin, because No such file or directory
set_attributes: failed to set time on ./fsroot-vs/usr/lib/firmware/amdgpu/green_sardine_rlc.bin, because No such file or directory
set_attributes: failed to set time on ./fsroot-vs/usr/lib/firmware/amdgpu/green_sardine_sdma.bin, because No such file or directory
set_attributes: failed to set time on ./fsroot-vs/usr/lib/firmware/amdgpu/green_sardine_ta.bin, because No such file or directory
set_attributes: failed to set time on ./fsroot-vs/usr/lib/firmware/amdgpu/green_sardine_vcn.bin, because No such file or directory
set_attributes: failed to set time on ./fsroot-vs/usr/lib/firmware/amdgpu/hainan_ce.bin, because No such file or directory
set_attributes: failed to set time on ./fsroot-vs/usr/lib/firmware/amdgpu/hainan_k_smc.bin, because No such file or directory
set_attributes: failed to set time on ./fsroot-vs/usr/lib/firmware/amdgpu/hainan_mc.bin, because No such file or directory
set_attributes: failed to set time on ./fsroot-vs/usr/lib/firmware/amdgpu/hainan_me.bin, because No such file or directory
set_attributes: failed to set time on ./fsroot-vs/usr/lib/firmware/amdgpu/hainan_pfp.bin, because No such file or directory
set_attributes: failed to set time on ./fsroot-vs/usr/lib/firmware/amdgpu/hainan_rlc.bin, because No such file or directory
set_attributes: failed to set time on ./fsroot-vs/usr/lib/firmware/amdgpu/hainan_smc.bin, because No such file or directory
set_attributes: failed to set time on ./fsroot-vs/usr/lib/firmware/amdgpu/hawaii_ce.bin, because No such file or directory
set_attributes: failed to set time on ./fsroot-vs/usr/lib/firmware/amdgpu/hawaii_k_smc.bin, because No such file or directory
set_attributes: failed to set time on ./fsroot-vs/usr/lib/firmware/amdgpu/hawaii_mc.bin, because No such file or directory
set_attributes: failed to set time on ./fsroot-vs/usr/lib/firmware/amdgpu/hawaii_me.bin, because No such file or directory
set_attributes: failed to set time on ./fsroot-vs/usr/lib/firmware/amdgpu/hawaii_mec.bin, because No such file or directory
set_attributes: failed to set time on ./fsroot-vs/usr/lib/firmware/amdgpu/hawaii_pfp.bin, because No such file or directory
set_attributes: failed to set time on ./fsroot-vs/usr/lib/firmware/amdgpu/hawaii_rlc.bin, because No such file or directory
set_attributes: failed to set time on ./fsroot-vs/usr/lib/firmware/amdgpu/hawaii_sdma.bin, because No such file or directory
set_attributes: failed to set time on ./fsroot-vs/usr/lib/firmware/amdgpu/hawaii_sdma1.bin, because No such file or directory
set_attributes: failed to set time on ./fsroot-vs/usr/lib/firmware/amdgpu/hawaii_smc.bin, because No such file or directory
set_attributes: failed to set time on ./fsroot-vs/usr/lib/firmware/amdgpu/hawaii_uvd.bin, because No such file or directory
set_attributes: failed to set time on ./fsroot-vs/usr/lib/firmware/amdgpu/hawaii_vce.bin, because No such file or directory
set_attributes: failed to set time on ./fsroot-vs/usr/lib/firmware/amdgpu/kabini_ce.bin, because No such file or directory
set_attributes: failed to set time on ./fsroot-vs/usr/lib/firmware/amdgpu/kabini_me.bin, because No such file or directory
set_attributes: failed to set time on ./fsroot-vs/usr/lib/firmware/amdgpu/kabini_mec.bin, because No such file or directory
set_attributes: failed to set time on ./fsroot-vs/usr/lib/firmware/amdgpu/kabini_pfp.bin, because No such file or directory
set_attributes: failed to set time on ./fsroot-vs/usr/lib/firmware/amdgpu/kabini_rlc.bin, because No such file or directory
set_attributes: failed to set time on ./fsroot-vs/usr/lib/firmware/amdgpu/kabini_sdma.bin, because No such file or directory
set_attributes: failed to set time on ./fsroot-vs/usr/lib/firmware/amdgpu/kabini_sdma1.bin, because No such file or directory
set_attributes: failed to set time on ./fsroot-vs/usr/lib/firmware/amdgpu/kabini_uvd.bin, because No such file or directory
set_attributes: failed to set time on ./fsroot-vs/usr/lib/firmware/amdgpu/kabini_vce.bin, because No such file or directory
set_attributes: failed to set time on ./fsroot-vs/usr/lib/firmware/amdgpu/kaveri_ce.bin, because No such file or directory
set_attributes: failed to set time on ./fsroot-vs/usr/lib/firmware/amdgpu/kaveri_me.bin, because No such file or directory
set_attributes: failed to set time on ./fsroot-vs/usr/lib/firmware/amdgpu/kaveri_mec.bin, because No such file or directory
set_attributes: failed to set time on ./fsroot-vs/usr/lib/firmware/amdgpu/kaveri_mec2.bin, because No such file or directory
set_attributes: failed to set time on ./fsroot-vs/usr/lib/firmware/amdgpu/kaveri_pfp.bin, because No such file or directory
set_attributes: failed to set time on ./fsroot-vs/usr/lib/firmware/amdgpu/kaveri_rlc.bin, because No such file or directory
set_attributes: failed to set time on ./fsroot-vs/usr/lib/firmware/amdgpu/kaveri_sdma.bin, because No such file or directory
set_attributes: failed to set time on ./fsroot-vs/usr/lib/firmware/amdgpu/kaveri_sdma1.bin, because No such file or directory
set_attributes: failed to set time on ./fsroot-vs/usr/lib/firmware/amdgpu/kaveri_uvd.bin, because No such file or directory
set_attributes: failed to set time on ./fsroot-vs/usr/lib/firmware/amdgpu/kaveri_vce.bin, because No such file or directory
set_attributes: failed to set time on ./fsroot-vs/usr/lib/firmware/amdgpu/mullins_ce.bin, because No such file or directory
set_attributes: failed to set time on ./fsroot-vs/usr/lib/firmware/amdgpu/mullins_me.bin, because No such file or directory
set_attributes: failed to set time on ./fsroot-vs/usr/lib/firmware/amdgpu/mullins_mec.bin, because No such file or directory
set_attributes: failed to set time on ./fsroot-vs/usr/lib/firmware/amdgpu/mullins_pfp.bin, because No such file or directory
set_attributes: failed to set time on ./fsroot-vs/usr/lib/firmware/amdgpu/mullins_rlc.bin, because No such file or directory
set_attributes: failed to set time on ./fsroot-vs/usr/lib/firmware/amdgpu/mullins_sdma.bin, because No such file or directory
set_attributes: failed to set time on ./fsroot-vs/usr/lib/firmware/amdgpu/mullins_sdma1.bin, because No such file or directory
set_attributes: failed to set time on ./fsroot-vs/usr/lib/firmware/amdgpu/mullins_uvd.bin, because No such file or directory
set_attributes: failed to set time on ./fsroot-vs/usr/lib/firmware/amdgpu/mullins_vce.bin, because No such file or directory
set_attributes: failed to set time on ./fsroot-vs/usr/lib/firmware/amdgpu/navi10_asd.bin, because No such file or directory
set_attributes: failed to set time on ./fsroot-vs/usr/lib/firmware/amdgpu/navi10_ce.bin, because No such file or directory
set_attributes: failed to set time on ./fsroot-vs/usr/lib/firmware/amdgpu/navi10_gpu_info.bin, because No such file or directory
set_attributes: failed to set time on ./fsroot-vs/usr/lib/firmware/amdgpu/navi10_me.bin, because No such file or directory
set_attributes: failed to set time on ./fsroot-vs/usr/lib/firmware/amdgpu/navi10_mec.bin, because No such file or directory
set_attributes: failed to set time on ./fsroot-vs/usr/lib/firmware/amdgpu/navi10_mec2.bin, because No such file or directory
set_attributes: failed to set time on ./fsroot-vs/usr/lib/firmware/amdgpu/navi10_pfp.bin, because No such file or directory
set_attributes: failed to set time on ./fsroot-vs/usr/lib/firmware/amdgpu/navi10_rlc.bin, because No such file or directory
set_attributes: failed to set time on ./fsroot-vs/usr/lib/firmware/amdgpu/navi10_sdma.bin, because No such file or directory
set_attributes: failed to set time on ./fsroot-vs/usr/lib/firmware/amdgpu/navi10_sdma1.bin, because No such file or directory
set_attributes: failed to set time on ./fsroot-vs/usr/lib/firmware/amdgpu/navi10_smc.bin, because No such file or directory
set_attributes: failed to set time on ./fsroot-vs/usr/lib/firmware/amdgpu/navi10_sos.bin, because No such file or directory
set_attributes: failed to set time on ./fsroot-vs/usr/lib/firmware/amdgpu/navi10_ta.bin, because No such file or directory
set_attributes: failed to set time on ./fsroot-vs/usr/lib/firmware/amdgpu/navi10_vcn.bin, because No such file or directory
[===========/ ] 13201/67776 19%
set_attributes: failed to set time on ./fsroot-vs/usr/lib/firmware/amdgpu/navi12_asd.bin, because No such file or directory
set_attributes: failed to set time on ./fsroot-vs/usr/lib/firmware/amdgpu/navi12_ce.bin, because No such file or directory
set_attributes: failed to set time on ./fsroot-vs/usr/lib/firmware/amdgpu/navi12_dmcu.bin, because No such file or directory
set_attributes: failed to set time on ./fsroot-vs/usr/lib/firmware/amdgpu/navi12_gpu_info.bin, because No such file or directory
set_attributes: failed to set time on ./fsroot-vs/usr/lib/firmware/amdgpu/navi12_me.bin, because No such file or directory
set_attributes: failed to set time on ./fsroot-vs/usr/lib/firmware/amdgpu/navi12_mec.bin, because No such file or directory
set_attributes: failed to set time on ./fsroot-vs/usr/lib/firmware/amdgpu/navi12_mec2.bin, because No such file or directory
set_attributes: failed to set time on ./fsroot-vs/usr/lib/firmware/amdgpu/navi12_pfp.bin, because No such file or directory
set_attributes: failed to set time on ./fsroot-vs/usr/lib/firmware/amdgpu/navi12_rlc.bin, because No such file or directory
set_attributes: failed to set time on ./fsroot-vs/usr/lib/firmware/amdgpu/navi12_sdma.bin, because No such file or directory
set_attributes: failed to set time on ./fsroot-vs/usr/lib/firmware/amdgpu/navi12_sdma1.bin, because No such file or directory
set_attributes: failed to set time on ./fsroot-vs/usr/lib/firmware/amdgpu/navi12_smc.bin, because No such file or directory
set_attributes: failed to set time on ./fsroot-vs/usr/lib/firmware/amdgpu/navi12_sos.bin, because No such file or directory
set_attributes: failed to set time on ./fsroot-vs/usr/lib/firmware/amdgpu/navi12_ta.bin, because No such file or directory
set_attributes: failed to set time on ./fsroot-vs/usr/lib/firmware/amdgpu/navi12_vcn.bin, because No such file or directory
set_attributes: failed to set time on ./fsroot-vs/usr/lib/firmware/amdgpu/navi14_asd.bin, because No such file or directory
set_attributes: failed to set time on ./fsroot-vs/usr/lib/firmware/amdgpu/navi14_ce.bin, because No such file or directory
set_attributes: failed to set time on ./fsroot-vs/usr/lib/firmware/amdgpu/navi14_ce_wks.bin, because No such file or directory
set_attributes: failed to set time on ./fsroot-vs/usr/lib/firmware/amdgpu/navi14_gpu_info.bin, because No such file or directory
set_attributes: failed to set time on ./fsroot-vs/usr/lib/firmware/amdgpu/navi14_me.bin, because No such file or directory
set_attributes: failed to set time on ./fsroot-vs/usr/lib/firmware/amdgpu/navi14_me_wks.bin, because No such file or directory
set_attributes: failed to set time on ./fsroot-vs/usr/lib/firmware/amdgpu/navi14_mec.bin, because No such file or directory
set_attributes: failed to set time on ./fsroot-vs/usr/lib/firmware/amdgpu/navi14_mec2.bin, because No such file or directory
set_attributes: failed to set time on ./fsroot-vs/usr/lib/firmware/amdgpu/navi14_mec2_wks.bin, because No such file or directory
set_attributes: failed to set time on ./fsroot-vs/usr/lib/firmware/amdgpu/navi14_mec_wks.bin, because No such file or directory
set_attributes: failed to set time on ./fsroot-vs/usr/lib/firmware/amdgpu/navi14_pfp.bin, because No such file or directory
set_attributes: failed to set time on ./fsroot-vs/usr/lib/firmware/amdgpu/navi14_pfp_wks.bin, because No such file or directory
set_attributes: failed to set time on ./fsroot-vs/usr/lib/firmware/amdgpu/navi14_rlc.bin, because No such file or directory
set_attributes: failed to set time on ./fsroot-vs/usr/lib/firmware/amdgpu/navi14_sdma.bin, because No such file or directory
set_attributes: failed to set time on ./fsroot-vs/usr/lib/firmware/amdgpu/navi14_sdma1.bin, because No such file or directory
set_attributes: failed to set time on ./fsroot-vs/usr/lib/firmware/amdgpu/navi14_smc.bin, because No such file or directory
set_attributes: failed to set time on ./fsroot-vs/usr/lib/firmware/amdgpu/navi14_sos.bin, because No such file or directory
set_attributes: failed to set time on ./fsroot-vs/usr/lib/firmware/amdgpu/navi14_ta.bin, because No such file or directory
set_attributes: failed to set time on ./fsroot-vs/usr/lib/firmware/amdgpu/navi14_vcn.bin, because No such file or directory
set_attributes: failed to set time on ./fsroot-vs/usr/lib/firmware/amdgpu/navy_flounder_ce.bin, because No such file or directory
set_attributes: failed to set time on ./fsroot-vs/usr/lib/firmware/amdgpu/navy_flounder_dmcub.bin, because No such file or directory
set_attributes: failed to set time on ./fsroot-vs/usr/lib/firmware/amdgpu/navy_flounder_me.bin, because No such file or directory
set_attributes: failed to set time on ./fsroot-vs/usr/lib/firmware/amdgpu/navy_flounder_mec.bin, because No such file or directory
set_attributes: failed to set time on ./fsroot-vs/usr/lib/firmware/amdgpu/navy_flounder_mec2.bin, because No such file or directory
set_attributes: failed to set time on ./fsroot-vs/usr/lib/firmware/amdgpu/navy_flounder_pfp.bin, because No such file or directory
set_attributes: failed to set time on ./fsroot-vs/usr/lib/firmware/amdgpu/navy_flounder_rlc.bin, because No such file or directory
set_attributes: failed to set time on ./fsroot-vs/usr/lib/firmware/amdgpu/navy_flounder_sdma.bin, because No such file or directory
set_attributes: failed to set time on ./fsroot-vs/usr/lib/firmware/amdgpu/navy_flounder_smc.bin, because No such file or directory
set_attributes: failed to set time on ./fsroot-vs/usr/lib/firmware/amdgpu/navy_flounder_sos.bin, because No such file or directory
set_attributes: failed to set time on ./fsroot-vs/usr/lib/firmware/amdgpu/navy_flounder_ta.bin, because No such file or directory
set_attributes: failed to set time on ./fsroot-vs/usr/lib/firmware/amdgpu/navy_flounder_vcn.bin, because No such file or directory
set_attributes: failed to set time on ./fsroot-vs/usr/lib/firmware/amdgpu/oland_ce.bin, because No such file or directory
set_attributes: failed to set time on ./fsroot-vs/usr/lib/firmware/amdgpu/oland_k_smc.bin, because No such file or directory
set_attributes: failed to set time on ./fsroot-vs/usr/lib/firmware/amdgpu/oland_mc.bin, because No such file or directory
set_attributes: failed to set time on ./fsroot-vs/usr/lib/firmware/amdgpu/oland_me.bin, because No such file or directory
set_attributes: failed to set time on ./fsroot-vs/usr/lib/firmware/amdgpu/oland_pfp.bin, because No such file or directory
set_attributes: failed to set time on ./fsroot-vs/usr/lib/firmware/amdgpu/oland_rlc.bin, because No such file or directory
set_attributes: failed to set time on ./fsroot-vs/usr/lib/firmware/amdgpu/oland_smc.bin, because No such file or directory
set_attributes: failed to set time on ./fsroot-vs/usr/lib/firmware/amdgpu/oland_uvd.bin, because No such file or directory
set_attributes: failed to set time on ./fsroot-vs/usr/lib/firmware/amdgpu/picasso_asd.bin, because No such file or directory
set_attributes: failed to set time on ./fsroot-vs/usr/lib/firmware/amdgpu/picasso_ce.bin, because No such file or directory
set_attributes: failed to set time on ./fsroot-vs/usr/lib/firmware/amdgpu/picasso_gpu_info.bin, because No such file or directory
set_attributes: failed to set time on ./fsroot-vs/usr/lib/firmware/amdgpu/picasso_me.bin, because No such file or directory
set_attributes: failed to set time on ./fsroot-vs/usr/lib/firmware/amdgpu/picasso_mec.bin, because No such file or directory
set_attributes: failed to set time on ./fsroot-vs/usr/lib/firmware/amdgpu/picasso_mec2.bin, because No such file or directory
set_attributes: failed to set time on ./fsroot-vs/usr/lib/firmware/amdgpu/picasso_pfp.bin, because No such file or directory
set_attributes: failed to set time on ./fsroot-vs/usr/lib/firmware/amdgpu/picasso_rlc.bin, because No such file or directory
set_attributes: failed to set time on ./fsroot-vs/usr/lib/firmware/amdgpu/picasso_rlc_am4.bin, because No such file or directory
set_attributes: failed to set time on ./fsroot-vs/usr/lib/firmware/amdgpu/picasso_sdma.bin, because No such file or directory
set_attributes: failed to set time on ./fsroot-vs/usr/lib/firmware/amdgpu/picasso_ta.bin, because No such file or directory
set_attributes: failed to set time on ./fsroot-vs/usr/lib/firmware/amdgpu/picasso_vcn.bin, because No such file or directory
set_attributes: failed to set time on ./fsroot-vs/usr/lib/firmware/amdgpu/pitcairn_ce.bin, because No such file or directory
set_attributes: failed to set time on ./fsroot-vs/usr/lib/firmware/amdgpu/pitcairn_k_smc.bin, because No such file or directory
set_attributes: failed to set time on ./fsroot-vs/usr/lib/firmware/amdgpu/pitcairn_mc.bin, because No such file or directory
set_attributes: failed to set time on ./fsroot-vs/usr/lib/firmware/amdgpu/pitcairn_me.bin, because No such file or directory
set_attributes: failed to set time on ./fsroot-vs/usr/lib/firmware/amdgpu/pitcairn_pfp.bin, because No such file or directory
set_attributes: failed to set time on ./fsroot-vs/usr/lib/firmware/amdgpu/pitcairn_rlc.bin, because No such file or directory
set_attributes: failed to set time on ./fsroot-vs/usr/lib/firmware/amdgpu/pitcairn_smc.bin, because No such file or directory
set_attributes: failed to set time on ./fsroot-vs/usr/lib/firmware/amdgpu/pitcairn_uvd.bin, because No such file or directory
set_attributes: failed to set time on ./fsroot-vs/usr/lib/firmware/amdgpu/polaris10_ce.bin, because No such file or directory
set_attributes: failed to set time on ./fsroot-vs/usr/lib/firmware/amdgpu/polaris10_ce_2.bin, because No such file or directory
set_attributes: failed to set time on ./fsroot-vs/usr/lib/firmware/amdgpu/polaris10_k2_smc.bin, because No such file or directory
set_attributes: failed to set time on ./fsroot-vs/usr/lib/firmware/amdgpu/polaris10_k_mc.bin, because No such file or directory
set_attributes: failed to set time on ./fsroot-vs/usr/lib/firmware/amdgpu/polaris10_k_smc.bin, because No such file or directory
set_attributes: failed to set time on ./fsroot-vs/usr/lib/firmware/amdgpu/polaris10_mc.bin, because No such file or directory
set_attributes: failed to set time on ./fsroot-vs/usr/lib/firmware/amdgpu/polaris10_me.bin, because No such file or directory
set_attributes: failed to set time on ./fsroot-vs/usr/lib/firmware/amdgpu/polaris10_me_2.bin, because No such file or directory
set_attributes: failed to set time on ./fsroot-vs/usr/lib/firmware/amdgpu/polaris10_mec.bin, because No such file or directory
set_attributes: failed to set time on ./fsroot-vs/usr/lib/firmware/amdgpu/polaris10_mec2.bin, because No such file or directory
set_attributes: failed to set time on ./fsroot-vs/usr/lib/firmware/amdgpu/polaris10_mec2_2.bin, because No such file or directory
set_attributes: failed to set time on ./fsroot-vs/usr/lib/firmware/amdgpu/polaris10_mec_2.bin, because No such file or directory
set_attributes: failed to set time on ./fsroot-vs/usr/lib/firmware/amdgpu/polaris10_pfp.bin, because No such file or directory
set_attributes: failed to set time on ./fsroot-vs/usr/lib/firmware/amdgpu/polaris10_pfp_2.bin, because No such file or directory
set_attributes: failed to set time on ./fsroot-vs/usr/lib/firmware/amdgpu/polaris10_rlc.bin, because No such file or directory
set_attributes: failed to set time on ./fsroot-vs/usr/lib/firmware/amdgpu/polaris10_sdma.bin, because No such file or directory
set_attributes: failed to set time on ./fsroot-vs/usr/lib/firmware/amdgpu/polaris10_sdma1.bin, because No such file or directory
set_attributes: failed to set time on ./fsroot-vs/usr/lib/firmware/amdgpu/polaris10_smc.bin, because No such file or directory
set_attributes: failed to set time on ./fsroot-vs/usr/lib/firmware/amdgpu/polaris10_smc_sk.bin, because No such file or directory
set_attributes: failed to set time on ./fsroot-vs/usr/lib/firmware/amdgpu/polaris10_uvd.bin, because No such file or directory
set_attributes: failed to set time on ./fsroot-vs/usr/lib/firmware/amdgpu/polaris10_vce.bin, because No such file or directory
set_attributes: failed to set time on ./fsroot-vs/usr/lib/firmware/amdgpu/polaris11_ce.bin, because No such file or directory
set_attributes: failed to set time on ./fsroot-vs/usr/lib/firmware/amdgpu/polaris11_ce_2.bin, because No such file or directory
set_attributes: failed to set time on ./fsroot-vs/usr/lib/firmware/amdgpu/polaris11_k2_smc.bin, because No such file or directory
set_attributes: failed to set time on ./fsroot-vs/usr/lib/firmware/amdgpu/polaris11_k_mc.bin, because No such file or directory
set_attributes: failed to set time on ./fsroot-vs/usr/lib/firmware/amdgpu/polaris11_k_smc.bin, because No such file or directory
set_attributes: failed to set time on ./fsroot-vs/usr/lib/firmware/amdgpu/polaris11_mc.bin, because No such file or directory
set_attributes: failed to set time on ./fsroot-vs/usr/lib/firmware/amdgpu/polaris11_me.bin, because No such file or directory
set_attributes: failed to set time on ./fsroot-vs/usr/lib/firmware/amdgpu/polaris11_me_2.bin, because No such file or directory
set_attributes: failed to set time on ./fsroot-vs/usr/lib/firmware/amdgpu/polaris11_mec.bin, because No such file or directory
set_attributes: failed to set time on ./fsroot-vs/usr/lib/firmware/amdgpu/polaris11_mec2.bin, because No such file or directory
set_attributes: failed to set time on ./fsroot-vs/usr/lib/firmware/amdgpu/polaris11_mec2_2.bin, because No such file or directory
set_attributes: failed to set time on ./fsroot-vs/usr/lib/firmware/amdgpu/polaris11_mec_2.bin, because No such file or directory
set_attributes: failed to set time on ./fsroot-vs/usr/lib/firmware/amdgpu/polaris11_pfp.bin, because No such file or directory
set_attributes: failed to set time on ./fsroot-vs/usr/lib/firmware/amdgpu/polaris11_pfp_2.bin, because No such file or directory
set_attributes: failed to set time on ./fsroot-vs/usr/lib/firmware/amdgpu/polaris11_rlc.bin, because No such file or directory
set_attributes: failed to set time on ./fsroot-vs/usr/lib/firmware/amdgpu/polaris11_sdma.bin, because No such file or directory
set_attributes: failed to set time on ./fsroot-vs/usr/lib/firmware/amdgpu/polaris11_sdma1.bin, because No such file or directory
set_attributes: failed to set time on ./fsroot-vs/usr/lib/firmware/amdgpu/polaris11_smc.bin, because No such file or directory
set_attributes: failed to set time on ./fsroot-vs/usr/lib/firmware/amdgpu/polaris11_smc_sk.bin, because No such file or directory
set_attributes: failed to set time on ./fsroot-vs/usr/lib/firmware/amdgpu/polaris11_uvd.bin, because No such file or directory
set_attributes: failed to set time on ./fsroot-vs/usr/lib/firmware/amdgpu/polaris11_vce.bin, because No such file or directory
set_attributes: failed to set time on ./fsroot-vs/usr/lib/firmware/amdgpu/polaris12_32_mc.bin, because No such file or directory
set_attributes: failed to set time on ./fsroot-vs/usr/lib/firmware/amdgpu/polaris12_ce.bin, because No such file or directory
set_attributes: failed to set time on ./fsroot-vs/usr/lib/firmware/amdgpu/polaris12_ce_2.bin, because No such file or directory
set_attributes: failed to set time on ./fsroot-vs/usr/lib/firmware/amdgpu/polaris12_k_mc.bin, because No such file or directory
set_attributes: failed to set time on ./fsroot-vs/usr/lib/firmware/amdgpu/polaris12_k_smc.bin, because No such file or directory
set_attributes: failed to set time on ./fsroot-vs/usr/lib/firmware/amdgpu/polaris12_mc.bin, because No such file or directory
set_attributes: failed to set time on ./fsroot-vs/usr/lib/firmware/amdgpu/polaris12_me.bin, because No such file or directory
set_attributes: failed to set time on ./fsroot-vs/usr/lib/firmware/amdgpu/polaris12_me_2.bin, because No such file or directory
set_attributes: failed to set time on ./fsroot-vs/usr/lib/firmware/amdgpu/polaris12_mec.bin, because No such file or directory
set_attributes: failed to set time on ./fsroot-vs/usr/lib/firmware/amdgpu/polaris12_mec2.bin, because No such file or directory
set_attributes: failed to set time on ./fsroot-vs/usr/lib/firmware/amdgpu/polaris12_mec2_2.bin, because No such file or directory
set_attributes: failed to set time on ./fsroot-vs/usr/lib/firmware/amdgpu/polaris12_mec_2.bin, because No such file or directory
set_attributes: failed to set time on ./fsroot-vs/usr/lib/firmware/amdgpu/polaris12_pfp.bin, because No such file or directory
set_attributes: failed to set time on ./fsroot-vs/usr/lib/firmware/amdgpu/polaris12_pfp_2.bin, because No such file or directory
set_attributes: failed to set time on ./fsroot-vs/usr/lib/firmware/amdgpu/polaris12_rlc.bin, because No such file or directory
set_attributes: failed to set time on ./fsroot-vs/usr/lib/firmware/amdgpu/polaris12_sdma.bin, because No such file or directory
set_attributes: failed to set time on ./fsroot-vs/usr/lib/firmware/amdgpu/polaris12_sdma1.bin, because No such file or directory
set_attributes: failed to set time on ./fsroot-vs/usr/lib/firmware/amdgpu/polaris12_smc.bin, because No such file or directory
set_attributes: failed to set time on ./fsroot-vs/usr/lib/firmware/amdgpu/polaris12_uvd.bin, because No such file or directory
set_attributes: failed to set time on ./fsroot-vs/usr/lib/firmware/amdgpu/polaris12_vce.bin, because No such file or directory
set_attributes: failed to set time on ./fsroot-vs/usr/lib/firmware/amdgpu/psp_13_0_0_sos.bin, because No such file or directory
set_attributes: failed to set time on ./fsroot-vs/usr/lib/firmware/amdgpu/psp_13_0_0_ta.bin, because No such file or directory
set_attributes: failed to set time on ./fsroot-vs/usr/lib/firmware/amdgpu/psp_13_0_4_ta.bin, because No such file or directory
set_attributes: failed to set time on ./fsroot-vs/usr/lib/firmware/amdgpu/psp_13_0_4_toc.bin, because No such file or directory
set_attributes: failed to set time on ./fsroot-vs/usr/lib/firmware/amdgpu/psp_13_0_5_asd.bin, because No such file or directory
set_attributes: failed to set time on ./fsroot-vs/usr/lib/firmware/amdgpu/psp_13_0_5_ta.bin, because No such file or directory
set_attributes: failed to set time on ./fsroot-vs/usr/lib/firmware/amdgpu/psp_13_0_5_toc.bin, because No such file or directory
set_attributes: failed to set time on ./fsroot-vs/usr/lib/firmware/amdgpu/psp_13_0_7_sos.bin, because No such file or directory
set_attributes: failed to set time on ./fsroot-vs/usr/lib/firmware/amdgpu/psp_13_0_7_ta.bin, because No such file or directory
set_attributes: failed to set time on ./fsroot-vs/usr/lib/firmware/amdgpu/psp_13_0_8_asd.bin, because No such file or directory
set_attributes: failed to set time on ./fsroot-vs/usr/lib/firmware/amdgpu/psp_13_0_8_ta.bin, because No such file or directory
set_attributes: failed to set time on ./fsroot-vs/usr/lib/firmware/amdgpu/psp_13_0_8_toc.bin, because No such file or directory
set_attributes: failed to set time on ./fsroot-vs/usr/lib/firmware/amdgpu/raven2_asd.bin, because No such file or directory
set_attributes: failed to set time on ./fsroot-vs/usr/lib/firmware/amdgpu/raven2_ce.bin, because No such file or directory
set_attributes: failed to set time on ./fsroot-vs/usr/lib/firmware/amdgpu/raven2_gpu_info.bin, because No such file or directory
set_attributes: failed to set time on ./fsroot-vs/usr/lib/firmware/amdgpu/raven2_me.bin, because No such file or directory
set_attributes: failed to set time on ./fsroot-vs/usr/lib/firmware/amdgpu/raven2_mec.bin, because No such file or directory
set_attributes: failed to set time on ./fsroot-vs/usr/lib/firmware/amdgpu/raven2_mec2.bin, because No such file or directory
set_attributes: failed to set time on ./fsroot-vs/usr/lib/firmware/amdgpu/raven2_pfp.bin, because No such file or directory
set_attributes: failed to set time on ./fsroot-vs/usr/lib/firmware/amdgpu/raven2_rlc.bin, because No such file or directory
set_attributes: failed to set time on ./fsroot-vs/usr/lib/firmware/amdgpu/raven2_sdma.bin, because No such file or directory
set_attributes: failed to set time on ./fsroot-vs/usr/lib/firmware/amdgpu/raven2_ta.bin, because No such file or directory
set_attributes: failed to set time on ./fsroot-vs/usr/lib/firmware/amdgpu/raven2_vcn.bin, because No such file or directory
set_attributes: failed to set time on ./fsroot-vs/usr/lib/firmware/amdgpu/raven_asd.bin, because No such file or directory
set_attributes: failed to set time on ./fsroot-vs/usr/lib/firmware/amdgpu/raven_ce.bin, because No such file or directory
set_attributes: failed to set time on ./fsroot-vs/usr/lib/firmware/amdgpu/raven_dmcu.bin, because No such file or directory
set_attributes: failed to set time on ./fsroot-vs/usr/lib/firmware/amdgpu/raven_gpu_info.bin, because No such file or directory
set_attributes: failed to set time on ./fsroot-vs/usr/lib/firmware/amdgpu/raven_kicker_rlc.bin, because No such file or directory
set_attributes: failed to set time on ./fsroot-vs/usr/lib/firmware/amdgpu/raven_me.bin, because No such file or directory
set_attributes: failed to set time on ./fsroot-vs/usr/lib/firmware/amdgpu/raven_mec.bin, because No such file or directory
set_attributes: failed to set time on ./fsroot-vs/usr/lib/firmware/amdgpu/raven_mec2.bin, because No such file or directory
set_attributes: failed to set time on ./fsroot-vs/usr/lib/firmware/amdgpu/raven_pfp.bin, because No such file or directory
set_attributes: failed to set time on ./fsroot-vs/usr/lib/firmware/amdgpu/raven_rlc.bin, because No such file or directory
set_attributes: failed to set time on ./fsroot-vs/usr/lib/firmware/amdgpu/raven_sdma.bin, because No such file or directory
set_attributes: failed to set time on ./fsroot-vs/usr/lib/firmware/amdgpu/raven_ta.bin, because No such file or directory
set_attributes: failed to set time on ./fsroot-vs/usr/lib/firmware/amdgpu/raven_vcn.bin, because No such file or directory
set_attributes: failed to set time on ./fsroot-vs/usr/lib/firmware/amdgpu/renoir_asd.bin, because No such file or directory
set_attributes: failed to set time on ./fsroot-vs/usr/lib/firmware/amdgpu/renoir_ce.bin, because No such file or directory
set_attributes: failed to set time on ./fsroot-vs/usr/lib/firmware/amdgpu/renoir_dmcub.bin, because No such file or directory
set_attributes: failed to set time on ./fsroot-vs/usr/lib/firmware/amdgpu/renoir_gpu_info.bin, because No such file or directory
set_attributes: failed to set time on ./fsroot-vs/usr/lib/firmware/amdgpu/renoir_me.bin, because No such file or directory
set_attributes: failed to set time on ./fsroot-vs/usr/lib/firmware/amdgpu/renoir_mec.bin, because No such file or directory
[===========| ] 13704/67776 20%
set_attributes: failed to set time on ./fsroot-vs/usr/lib/firmware/amdgpu/renoir_mec2.bin, because No such file or directory
set_attributes: failed to set time on ./fsroot-vs/usr/lib/firmware/amdgpu/renoir_pfp.bin, because No such file or directory
set_attributes: failed to set time on ./fsroot-vs/usr/lib/firmware/amdgpu/renoir_rlc.bin, because No such file or directory
set_attributes: failed to set time on ./fsroot-vs/usr/lib/firmware/amdgpu/renoir_sdma.bin, because No such file or directory
set_attributes: failed to set time on ./fsroot-vs/usr/lib/firmware/amdgpu/renoir_ta.bin, because No such file or directory
set_attributes: failed to set time on ./fsroot-vs/usr/lib/firmware/amdgpu/renoir_vcn.bin, because No such file or directory
set_attributes: failed to set time on ./fsroot-vs/usr/lib/firmware/amdgpu/sdma_5_2_6.bin, because No such file or directory
set_attributes: failed to set time on ./fsroot-vs/usr/lib/firmware/amdgpu/sdma_5_2_7.bin, because No such file or directory
set_attributes: failed to set time on ./fsroot-vs/usr/lib/firmware/amdgpu/sdma_6_0_0.bin, because No such file or directory
set_attributes: failed to set time on ./fsroot-vs/usr/lib/firmware/amdgpu/sdma_6_0_1.bin, because No such file or directory
set_attributes: failed to set time on ./fsroot-vs/usr/lib/firmware/amdgpu/sdma_6_0_2.bin, because No such file or directory
set_attributes: failed to set time on ./fsroot-vs/usr/lib/firmware/amdgpu/si58_mc.bin, because No such file or directory
set_attributes: failed to set time on ./fsroot-vs/usr/lib/firmware/amdgpu/sienna_cichlid_ce.bin, because No such file or directory
set_attributes: failed to set time on ./fsroot-vs/usr/lib/firmware/amdgpu/sienna_cichlid_dmcub.bin, because No such file or directory
set_attributes: failed to set time on ./fsroot-vs/usr/lib/firmware/amdgpu/sienna_cichlid_me.bin, because No such file or directory
set_attributes: failed to set time on ./fsroot-vs/usr/lib/firmware/amdgpu/sienna_cichlid_mec.bin, because No such file or directory
set_attributes: failed to set time on ./fsroot-vs/usr/lib/firmware/amdgpu/sienna_cichlid_mec2.bin, because No such file or directory
set_attributes: failed to set time on ./fsroot-vs/usr/lib/firmware/amdgpu/sienna_cichlid_pfp.bin, because No such file or directory
set_attributes: failed to set time on ./fsroot-vs/usr/lib/firmware/amdgpu/sienna_cichlid_rlc.bin, because No such file or directory
set_attributes: failed to set time on ./fsroot-vs/usr/lib/firmware/amdgpu/sienna_cichlid_sdma.bin, because No such file or directory
set_attributes: failed to set time on ./fsroot-vs/usr/lib/firmware/amdgpu/sienna_cichlid_smc.bin, because No such file or directory
set_attributes: failed to set time on ./fsroot-vs/usr/lib/firmware/amdgpu/sienna_cichlid_sos.bin, because No such file or directory
set_attributes: failed to set time on ./fsroot-vs/usr/lib/firmware/amdgpu/sienna_cichlid_ta.bin, because No such file or directory
set_attributes: failed to set time on ./fsroot-vs/usr/lib/firmware/amdgpu/sienna_cichlid_vcn.bin, because No such file or directory
set_attributes: failed to set time on ./fsroot-vs/usr/lib/firmware/amdgpu/smu_13_0_0.bin, because No such file or directory
set_attributes: failed to set time on ./fsroot-vs/usr/lib/firmware/amdgpu/smu_13_0_7.bin, because No such file or directory
set_attributes: failed to set time on ./fsroot-vs/usr/lib/firmware/amdgpu/stoney_ce.bin, because No such file or directory
set_attributes: failed to set time on ./fsroot-vs/usr/lib/firmware/amdgpu/stoney_me.bin, because No such file or directory
set_attributes: failed to set time on ./fsroot-vs/usr/lib/firmware/amdgpu/stoney_mec.bin, because No such file or directory
set_attributes: failed to set time on ./fsroot-vs/usr/lib/firmware/amdgpu/stoney_pfp.bin, because No such file or directory
set_attributes: failed to set time on ./fsroot-vs/usr/lib/firmware/amdgpu/stoney_rlc.bin, because No such file or directory
set_attributes: failed to set time on ./fsroot-vs/usr/lib/firmware/amdgpu/stoney_sdma.bin, because No such file or directory
set_attributes: failed to set time on ./fsroot-vs/usr/lib/firmware/amdgpu/stoney_uvd.bin, because No such file or directory
set_attributes: failed to set time on ./fsroot-vs/usr/lib/firmware/amdgpu/stoney_vce.bin, because No such file or directory
set_attributes: failed to set time on ./fsroot-vs/usr/lib/firmware/amdgpu/tahiti_ce.bin, because No such file or directory
set_attributes: failed to set time on ./fsroot-vs/usr/lib/firmware/amdgpu/tahiti_k_smc.bin, because No such file or directory
set_attributes: failed to set time on ./fsroot-vs/usr/lib/firmware/amdgpu/tahiti_mc.bin, because No such file or directory
set_attributes: failed to set time on ./fsroot-vs/usr/lib/firmware/amdgpu/tahiti_me.bin, because No such file or directory
set_attributes: failed to set time on ./fsroot-vs/usr/lib/firmware/amdgpu/tahiti_pfp.bin, because No such file or directory
set_attributes: failed to set time on ./fsroot-vs/usr/lib/firmware/amdgpu/tahiti_rlc.bin, because No such file or directory
set_attributes: failed to set time on ./fsroot-vs/usr/lib/firmware/amdgpu/tahiti_smc.bin, because No such file or directory
set_attributes: failed to set time on ./fsroot-vs/usr/lib/firmware/amdgpu/tahiti_uvd.bin, because No such file or directory
set_attributes: failed to set time on ./fsroot-vs/usr/lib/firmware/amdgpu/tonga_ce.bin, because No such file or directory
set_attributes: failed to set time on ./fsroot-vs/usr/lib/firmware/amdgpu/tonga_k_smc.bin, because No such file or directory
set_attributes: failed to set time on ./fsroot-vs/usr/lib/firmware/amdgpu/tonga_mc.bin, because No such file or directory
set_attributes: failed to set time on ./fsroot-vs/usr/lib/firmware/amdgpu/tonga_me.bin, because No such file or directory
set_attributes: failed to set time on ./fsroot-vs/usr/lib/firmware/amdgpu/tonga_mec.bin, because No such file or directory
set_attributes: failed to set time on ./fsroot-vs/usr/lib/firmware/amdgpu/tonga_mec2.bin, because No such file or directory
set_attributes: failed to set time on ./fsroot-vs/usr/lib/firmware/amdgpu/tonga_pfp.bin, because No such file or directory
set_attributes: failed to set time on ./fsroot-vs/usr/lib/firmware/amdgpu/tonga_rlc.bin, because No such file or directory
set_attributes: failed to set time on ./fsroot-vs/usr/lib/firmware/amdgpu/tonga_sdma.bin, because No such file or directory
set_attributes: failed to set time on ./fsroot-vs/usr/lib/firmware/amdgpu/tonga_sdma1.bin, because No such file or directory
set_attributes: failed to set time on ./fsroot-vs/usr/lib/firmware/amdgpu/tonga_smc.bin, because No such file or directory
set_attributes: failed to set time on ./fsroot-vs/usr/lib/firmware/amdgpu/tonga_uvd.bin, because No such file or directory
set_attributes: failed to set time on ./fsroot-vs/usr/lib/firmware/amdgpu/tonga_vce.bin, because No such file or directory
set_attributes: failed to set time on ./fsroot-vs/usr/lib/firmware/amdgpu/topaz_ce.bin, because No such file or directory
set_attributes: failed to set time on ./fsroot-vs/usr/lib/firmware/amdgpu/topaz_k_smc.bin, because No such file or directory
set_attributes: failed to set time on ./fsroot-vs/usr/lib/firmware/amdgpu/topaz_mc.bin, because No such file or directory
set_attributes: failed to set time on ./fsroot-vs/usr/lib/firmware/amdgpu/topaz_me.bin, because No such file or directory
set_attributes: failed to set time on ./fsroot-vs/usr/lib/firmware/amdgpu/topaz_mec.bin, because No such file or directory
set_attributes: failed to set time on ./fsroot-vs/usr/lib/firmware/amdgpu/topaz_mec2.bin, because No such file or directory
set_attributes: failed to set time on ./fsroot-vs/usr/lib/firmware/amdgpu/topaz_pfp.bin, because No such file or directory
set_attributes: failed to set time on ./fsroot-vs/usr/lib/firmware/amdgpu/topaz_rlc.bin, because No such file or directory
set_attributes: failed to set time on ./fsroot-vs/usr/lib/firmware/amdgpu/topaz_sdma.bin, because No such file or directory
set_attributes: failed to set time on ./fsroot-vs/usr/lib/firmware/amdgpu/topaz_sdma1.bin, because No such file or directory
set_attributes: failed to set time on ./fsroot-vs/usr/lib/firmware/amdgpu/topaz_smc.bin, because No such file or directory
set_attributes: failed to set time on ./fsroot-vs/usr/lib/firmware/amdgpu/vangogh_asd.bin, because No such file or directory
set_attributes: failed to set time on ./fsroot-vs/usr/lib/firmware/amdgpu/vangogh_ce.bin, because No such file or directory
set_attributes: failed to set time on ./fsroot-vs/usr/lib/firmware/amdgpu/vangogh_dmcub.bin, because No such file or directory
set_attributes: failed to set time on ./fsroot-vs/usr/lib/firmware/amdgpu/vangogh_me.bin, because No such file or directory
set_attributes: failed to set time on ./fsroot-vs/usr/lib/firmware/amdgpu/vangogh_mec.bin, because No such file or directory
set_attributes: failed to set time on ./fsroot-vs/usr/lib/firmware/amdgpu/vangogh_mec2.bin, because No such file or directory
set_attributes: failed to set time on ./fsroot-vs/usr/lib/firmware/amdgpu/vangogh_pfp.bin, because No such file or directory
set_attributes: failed to set time on ./fsroot-vs/usr/lib/firmware/amdgpu/vangogh_rlc.bin, because No such file or directory
set_attributes: failed to set time on ./fsroot-vs/usr/lib/firmware/amdgpu/vangogh_sdma.bin, because No such file or directory
set_attributes: failed to set time on ./fsroot-vs/usr/lib/firmware/amdgpu/vangogh_toc.bin, because No such file or directory
set_attributes: failed to set time on ./fsroot-vs/usr/lib/firmware/amdgpu/vangogh_vcn.bin, because No such file or directory
set_attributes: failed to set time on ./fsroot-vs/usr/lib/firmware/amdgpu/vcn_3_1_2.bin, because No such file or directory
set_attributes: failed to set time on ./fsroot-vs/usr/lib/firmware/amdgpu/vcn_4_0_0.bin, because No such file or directory
set_attributes: failed to set time on ./fsroot-vs/usr/lib/firmware/amdgpu/vcn_4_0_2.bin, because No such file or directory
set_attributes: failed to set time on ./fsroot-vs/usr/lib/firmware/amdgpu/vcn_4_0_4.bin, because No such file or directory
set_attributes: failed to set time on ./fsroot-vs/usr/lib/firmware/amdgpu/vega10_acg_smc.bin, because No such file or directory
set_attributes: failed to set time on ./fsroot-vs/usr/lib/firmware/amdgpu/vega10_asd.bin, because No such file or directory
set_attributes: failed to set time on ./fsroot-vs/usr/lib/firmware/amdgpu/vega10_ce.bin, because No such file or directory
set_attributes: failed to set time on ./fsroot-vs/usr/lib/firmware/amdgpu/vega10_gpu_info.bin, because No such file or directory
set_attributes: failed to set time on ./fsroot-vs/usr/lib/firmware/amdgpu/vega10_me.bin, because No such file or directory
set_attributes: failed to set time on ./fsroot-vs/usr/lib/firmware/amdgpu/vega10_mec.bin, because No such file or directory
set_attributes: failed to set time on ./fsroot-vs/usr/lib/firmware/amdgpu/vega10_mec2.bin, because No such file or directory
set_attributes: failed to set time on ./fsroot-vs/usr/lib/firmware/amdgpu/vega10_pfp.bin, because No such file or directory
set_attributes: failed to set time on ./fsroot-vs/usr/lib/firmware/amdgpu/vega10_rlc.bin, because No such file or directory
set_attributes: failed to set time on ./fsroot-vs/usr/lib/firmware/amdgpu/vega10_sdma.bin, because No such file or directory
set_attributes: failed to set time on ./fsroot-vs/usr/lib/firmware/amdgpu/vega10_sdma1.bin, because No such file or directory
set_attributes: failed to set time on ./fsroot-vs/usr/lib/firmware/amdgpu/vega10_smc.bin, because No such file or directory
set_attributes: failed to set time on ./fsroot-vs/usr/lib/firmware/amdgpu/vega10_sos.bin, because No such file or directory
set_attributes: failed to set time on ./fsroot-vs/usr/lib/firmware/amdgpu/vega10_uvd.bin, because No such file or directory
set_attributes: failed to set time on ./fsroot-vs/usr/lib/firmware/amdgpu/vega10_vce.bin, because No such file or directory
set_attributes: failed to set time on ./fsroot-vs/usr/lib/firmware/amdgpu/vega12_asd.bin, because No such file or directory
set_attributes: failed to set time on ./fsroot-vs/usr/lib/firmware/amdgpu/vega12_ce.bin, because No such file or directory
set_attributes: failed to set time on ./fsroot-vs/usr/lib/firmware/amdgpu/vega12_gpu_info.bin, because No such file or directory
set_attributes: failed to set time on ./fsroot-vs/usr/lib/firmware/amdgpu/vega12_me.bin, because No such file or directory
set_attributes: failed to set time on ./fsroot-vs/usr/lib/firmware/amdgpu/vega12_mec.bin, because No such file or directory
set_attributes: failed to set time on ./fsroot-vs/usr/lib/firmware/amdgpu/vega12_mec2.bin, because No such file or directory
set_attributes: failed to set time on ./fsroot-vs/usr/lib/firmware/amdgpu/vega12_pfp.bin, because No such file or directory
set_attributes: failed to set time on ./fsroot-vs/usr/lib/firmware/amdgpu/vega12_rlc.bin, because No such file or directory
set_attributes: failed to set time on ./fsroot-vs/usr/lib/firmware/amdgpu/vega12_sdma.bin, because No such file or directory
set_attributes: failed to set time on ./fsroot-vs/usr/lib/firmware/amdgpu/vega12_sdma1.bin, because No such file or directory
set_attributes: failed to set time on ./fsroot-vs/usr/lib/firmware/amdgpu/vega12_smc.bin, because No such file or directory
set_attributes: failed to set time on ./fsroot-vs/usr/lib/firmware/amdgpu/vega12_sos.bin, because No such file or directory
set_attributes: failed to set time on ./fsroot-vs/usr/lib/firmware/amdgpu/vega12_uvd.bin, because No such file or directory
set_attributes: failed to set time on ./fsroot-vs/usr/lib/firmware/amdgpu/vega12_vce.bin, because No such file or directory
set_attributes: failed to set time on ./fsroot-vs/usr/lib/firmware/amdgpu/vega20_asd.bin, because No such file or directory
set_attributes: failed to set time on ./fsroot-vs/usr/lib/firmware/amdgpu/vega20_ce.bin, because No such file or directory
set_attributes: failed to set time on ./fsroot-vs/usr/lib/firmware/amdgpu/vega20_me.bin, because No such file or directory
set_attributes: failed to set time on ./fsroot-vs/usr/lib/firmware/amdgpu/vega20_mec.bin, because No such file or directory
set_attributes: failed to set time on ./fsroot-vs/usr/lib/firmware/amdgpu/vega20_mec2.bin, because No such file or directory
set_attributes: failed to set time on ./fsroot-vs/usr/lib/firmware/amdgpu/vega20_pfp.bin, because No such file or directory
set_attributes: failed to set time on ./fsroot-vs/usr/lib/firmware/amdgpu/vega20_rlc.bin, because No such file or directory
set_attributes: failed to set time on ./fsroot-vs/usr/lib/firmware/amdgpu/vega20_sdma.bin, because No such file or directory
set_attributes: failed to set time on ./fsroot-vs/usr/lib/firmware/amdgpu/vega20_sdma1.bin, because No such file or directory
set_attributes: failed to set time on ./fsroot-vs/usr/lib/firmware/amdgpu/vega20_smc.bin, because No such file or directory
set_attributes: failed to set time on ./fsroot-vs/usr/lib/firmware/amdgpu/vega20_sos.bin, because No such file or directory
set_attributes: failed to set time on ./fsroot-vs/usr/lib/firmware/amdgpu/vega20_ta.bin, because No such file or directory
set_attributes: failed to set time on ./fsroot-vs/usr/lib/firmware/amdgpu/vega20_uvd.bin, because No such file or directory
set_attributes: failed to set time on ./fsroot-vs/usr/lib/firmware/amdgpu/vega20_vce.bin, because No such file or directory
set_attributes: failed to set time on ./fsroot-vs/usr/lib/firmware/amdgpu/vegam_ce.bin, because No such file or directory
set_attributes: failed to set time on ./fsroot-vs/usr/lib/firmware/amdgpu/vegam_me.bin, because No such file or directory
set_attributes: failed to set time on ./fsroot-vs/usr/lib/firmware/amdgpu/vegam_mec.bin, because No such file or directory
set_attributes: failed to set time on ./fsroot-vs/usr/lib/firmware/amdgpu/vegam_mec2.bin, because No such file or directory
set_attributes: failed to set time on ./fsroot-vs/usr/lib/firmware/amdgpu/vegam_pfp.bin, because No such file or directory
set_attributes: failed to set time on ./fsroot-vs/usr/lib/firmware/amdgpu/vegam_rlc.bin, because No such file or directory
set_attributes: failed to set time on ./fsroot-vs/usr/lib/firmware/amdgpu/vegam_sdma.bin, because No such file or directory
set_attributes: failed to set time on ./fsroot-vs/usr/lib/firmware/amdgpu/vegam_sdma1.bin, because No such file or directory
set_attributes: failed to set time on ./fsroot-vs/usr/lib/firmware/amdgpu/vegam_smc.bin, because No such file or directory
set_attributes: failed to set time on ./fsroot-vs/usr/lib/firmware/amdgpu/vegam_uvd.bin, because No such file or directory
set_attributes: failed to set time on ./fsroot-vs/usr/lib/firmware/amdgpu/vegam_vce.bin, because No such file or directory
set_attributes: failed to set time on ./fsroot-vs/usr/lib/firmware/amdgpu/verde_ce.bin, because No such file or directory
set_attributes: failed to set time on ./fsroot-vs/usr/lib/firmware/amdgpu/verde_k_smc.bin, because No such file or directory
set_attributes: failed to set time on ./fsroot-vs/usr/lib/firmware/amdgpu/verde_mc.bin, because No such file or directory
set_attributes: failed to set time on ./fsroot-vs/usr/lib/firmware/amdgpu/verde_me.bin, because No such file or directory
set_attributes: failed to set time on ./fsroot-vs/usr/lib/firmware/amdgpu/verde_pfp.bin, because No such file or directory
set_attributes: failed to set time on ./fsroot-vs/usr/lib/firmware/amdgpu/verde_rlc.bin, because No such file or directory
set_attributes: failed to set time on ./fsroot-vs/usr/lib/firmware/amdgpu/verde_smc.bin, because No such file or directory
set_attributes: failed to set time on ./fsroot-vs/usr/lib/firmware/amdgpu/verde_uvd.bin, because No such file or directory
set_attributes: failed to set time on ./fsroot-vs/usr/lib/firmware/amdgpu/yellow_carp_asd.bin, because No such file or directory
set_attributes: failed to set time on ./fsroot-vs/usr/lib/firmware/amdgpu/yellow_carp_ce.bin, because No such file or directory
set_attributes: failed to set time on ./fsroot-vs/usr/lib/firmware/amdgpu/yellow_carp_dmcub.bin, because No such file or directory
set_attributes: failed to set time on ./fsroot-vs/usr/lib/firmware/amdgpu/yellow_carp_me.bin, because No such file or directory
set_attributes: failed to set time on ./fsroot-vs/usr/lib/firmware/amdgpu/yellow_carp_mec.bin, because No such file or directory
set_attributes: failed to set time on ./fsroot-vs/usr/lib/firmware/amdgpu/yellow_carp_mec2.bin, because No such file or directory
set_attributes: failed to set time on ./fsroot-vs/usr/lib/firmware/amdgpu/yellow_carp_pfp.bin, because No such file or directory
set_attributes: failed to set time on ./fsroot-vs/usr/lib/firmware/amdgpu/yellow_carp_rlc.bin, because No such file or directory
set_attributes: failed to set time on ./fsroot-vs/usr/lib/firmware/amdgpu/yellow_carp_sdma.bin, because No such file or directory
set_attributes: failed to set time on ./fsroot-vs/usr/lib/firmware/amdgpu/yellow_carp_ta.bin, because No such file or directory
set_attributes: failed to set time on ./fsroot-vs/usr/lib/firmware/amdgpu/yellow_carp_toc.bin, because No such file or directory
set_attributes: failed to set time on ./fsroot-vs/usr/lib/firmware/amdgpu/yellow_carp_vcn.bin, because No such file or directory
set_attributes: failed to set time on ./fsroot-vs/usr/lib/firmware/amdgpu, because No such file or directory
set_attributes: failed to set time on ./fsroot-vs/usr/lib/firmware/as102_data1_st.hex, because No such file or directory
set_attributes: failed to set time on ./fsroot-vs/usr/lib/firmware/as102_data2_st.hex, because No such file or directory
set_attributes: failed to set time on ./fsroot-vs/usr/lib/firmware/brcm/BCM-0bb4-0306.hcd, because No such file or directory
set_attributes: failed to set time on ./fsroot-vs/usr/lib/firmware/brcm, because No such file or directory
set_attributes: failed to set time on ./fsroot-vs/usr/lib/firmware/cadence/mhdp8546.bin, because No such file or directory
set_attributes: failed to set time on ./fsroot-vs/usr/lib/firmware/cadence, because No such file or directory
set_attributes: failed to set time on ./fsroot-vs/usr/lib/firmware/ctefx.bin, because No such file or directory
set_attributes: failed to set time on ./fsroot-vs/usr/lib/firmware/ctspeq.bin, because No such file or directory
set_attributes: failed to set time on ./fsroot-vs/usr/lib/firmware/cxgb3/ael2005_opt_edc.bin, because No such file or directory
set_attributes: failed to set time on ./fsroot-vs/usr/lib/firmware/cxgb3/ael2005_twx_edc.bin, because No such file or directory
set_attributes: failed to set time on ./fsroot-vs/usr/lib/firmware/cxgb3/ael2020_twx_edc.bin, because No such file or directory
set_attributes: failed to set time on ./fsroot-vs/usr/lib/firmware/cxgb3/t3b_psram-1.1.0.bin, because No such file or directory
set_attributes: failed to set time on ./fsroot-vs/usr/lib/firmware/cxgb3/t3c_psram-1.1.0.bin, because No such file or directory
set_attributes: failed to set time on ./fsroot-vs/usr/lib/firmware/cxgb3/t3fw-7.10.0.bin, because No such file or directory
set_attributes: failed to set time on ./fsroot-vs/usr/lib/firmware/cxgb3/t3fw-7.12.0.bin, because No such file or directory
set_attributes: failed to set time on ./fsroot-vs/usr/lib/firmware/cxgb3/t3fw-7.4.0.bin, because No such file or directory
set_attributes: failed to set time on ./fsroot-vs/usr/lib/firmware/cxgb3, because No such file or directory
set_attributes: failed to set time on ./fsroot-vs/usr/lib/firmware/cxgb4/aq1202_fw.cld, because No such file or directory
set_attributes: failed to set time on ./fsroot-vs/usr/lib/firmware/cxgb4/bcm8483.bin, because No such file or directory
set_attributes: failed to set time on ./fsroot-vs/usr/lib/firmware/cxgb4/configs/t4-config-default.txt, because No such file or directory
set_attributes: failed to set time on ./fsroot-vs/usr/lib/firmware/cxgb4/configs/t5-config-default.txt, because No such file or directory
set_attributes: failed to set time on ./fsroot-vs/usr/lib/firmware/cxgb4/configs/t5-config-hashfilter.txt, because No such file or directory
set_attributes: failed to set time on ./fsroot-vs/usr/lib/firmware/cxgb4/configs/t6-config-default.txt, because No such file or directory
set_attributes: failed to set time on ./fsroot-vs/usr/lib/firmware/cxgb4/configs/t6-config-hashfilter.txt, because No such file or directory
set_attributes: failed to set time on ./fsroot-vs/usr/lib/firmware/cxgb4/configs, because No such file or directory
set_attributes: failed to set time on ./fsroot-vs/usr/lib/firmware/cxgb4/t4fw-1.27.1.0.bin, because No such file or directory
set_attributes: failed to set time on ./fsroot-vs/usr/lib/firmware/cxgb4/t5fw-1.27.1.0.bin, because No such file or directory
set_attributes: failed to set time on ./fsroot-vs/usr/lib/firmware/cxgb4/t6fw-1.27.1.0.bin, because No such file or directory
set_attributes: failed to set time on ./fsroot-vs/usr/lib/firmware/cxgb4, because No such file or directory
set_attributes: failed to set time on ./fsroot-vs/usr/lib/firmware/dabusb/bitstream.bin, because No such file or directory
set_attributes: failed to set time on ./fsroot-vs/usr/lib/firmware/dabusb/firmware.fw, because No such file or directory
set_attributes: failed to set time on ./fsroot-vs/usr/lib/firmware/dabusb, because No such file or directory
set_attributes: failed to set time on ./fsroot-vs/usr/lib/firmware/dvb-fe-xc4000-1.4.1.fw, because No such file or directory
set_attributes: failed to set time on ./fsroot-vs/usr/lib/firmware/dvb-fe-xc5000-1.6.114.fw, because No such file or directory
set_attributes: failed to set time on ./fsroot-vs/usr/lib/firmware/dvb-fe-xc5000c-4.1.30.7.fw, because No such file or directory
set_attributes: failed to set time on ./fsroot-vs/usr/lib/firmware/dvb-usb-dib0700-1.20.fw, because No such file or directory
set_attributes: failed to set time on ./fsroot-vs/usr/lib/firmware/dvb-usb-it9135-01.fw, because No such file or directory
set_attributes: failed to set time on ./fsroot-vs/usr/lib/firmware/dvb-usb-it9135-02.fw, because No such file or directory
set_attributes: failed to set time on ./fsroot-vs/usr/lib/firmware/dvb-usb-terratec-h5-drxk.fw, because No such file or directory
set_attributes: failed to set time on ./fsroot-vs/usr/lib/firmware/e100/d101m_ucode.bin, because No such file or directory
set_attributes: failed to set time on ./fsroot-vs/usr/lib/firmware/e100/d101s_ucode.bin, because No such file or directory
set_attributes: failed to set time on ./fsroot-vs/usr/lib/firmware/e100/d102e_ucode.bin, because No such file or directory
set_attributes: failed to set time on ./fsroot-vs/usr/lib/firmware/e100, because No such file or directory
set_attributes: failed to set time on ./fsroot-vs/usr/lib/firmware/ene-ub6250/ms_init.bin, because No such file or directory
set_attributes: failed to set time on ./fsroot-vs/usr/lib/firmware/ene-ub6250/ms_rdwr.bin, because No such file or directory
set_attributes: failed to set time on ./fsroot-vs/usr/lib/firmware/ene-ub6250/msp_rdwr.bin, because No such file or directory
set_attributes: failed to set time on ./fsroot-vs/usr/lib/firmware/ene-ub6250/sd_init1.bin, because No such file or directory
set_attributes: failed to set time on ./fsroot-vs/usr/lib/firmware/ene-ub6250/sd_init2.bin, because No such file or directory
set_attributes: failed to set time on ./fsroot-vs/usr/lib/firmware/ene-ub6250/sd_rdwr.bin, because No such file or directory
set_attributes: failed to set time on ./fsroot-vs/usr/lib/firmware/ene-ub6250, because No such file or directory
set_attributes: failed to set time on ./fsroot-vs/usr/lib/firmware/f2255usb.bin, because No such file or directory
set_attributes: failed to set time on ./fsroot-vs/usr/lib/firmware/go7007/go7007fw.bin, because No such file or directory
set_attributes: failed to set time on ./fsroot-vs/usr/lib/firmware/go7007/go7007tv.bin, because No such file or directory
set_attributes: failed to set time on ./fsroot-vs/usr/lib/firmware/go7007/lr192.fw, because No such file or directory
set_attributes: failed to set time on ./fsroot-vs/usr/lib/firmware/go7007/px-m402u.fw, because No such file or directory
set_attributes: failed to set time on ./fsroot-vs/usr/lib/firmware/go7007/px-tv402u.fw, because No such file or directory
set_attributes: failed to set time on ./fsroot-vs/usr/lib/firmware/go7007/s2250-1.fw, because No such file or directory
set_attributes: failed to set time on ./fsroot-vs/usr/lib/firmware/go7007/s2250-2.fw, because No such file or directory
set_attributes: failed to set time on ./fsroot-vs/usr/lib/firmware/go7007/wis-startrek.fw, because No such file or directory
set_attributes: failed to set time on ./fsroot-vs/usr/lib/firmware/go7007, because No such file or directory
set_attributes: failed to set time on ./fsroot-vs/usr/lib/firmware/hfi1_dc8051.fw, because No such file or directory
set_attributes: failed to set time on ./fsroot-vs/usr/lib/firmware/hfi1_fabric.fw, because No such file or directory
set_attributes: failed to set time on ./fsroot-vs/usr/lib/firmware/hfi1_pcie.fw, because No such file or directory
set_attributes: failed to set time on ./fsroot-vs/usr/lib/firmware/hfi1_sbus.fw, because No such file or directory
set_attributes: failed to set time on ./fsroot-vs/usr/lib/firmware/i915/adlp_dmc.bin, because No such file or directory
set_attributes: failed to set time on ./fsroot-vs/usr/lib/firmware/i915/adlp_dmc_ver2_09.bin, because No such file or directory
set_attributes: failed to set time on ./fsroot-vs/usr/lib/firmware/i915/adlp_dmc_ver2_10.bin, because No such file or directory
set_attributes: failed to set time on ./fsroot-vs/usr/lib/firmware/i915/adlp_dmc_ver2_12.bin, because No such file or directory
set_attributes: failed to set time on ./fsroot-vs/usr/lib/firmware/i915/adlp_dmc_ver2_14.bin, because No such file or directory
set_attributes: failed to set time on ./fsroot-vs/usr/lib/firmware/i915/adlp_dmc_ver2_16.bin, because No such file or directory
set_attributes: failed to set time on ./fsroot-vs/usr/lib/firmware/i915/adlp_guc_62.0.3.bin, because No such file or directory
set_attributes: failed to set time on ./fsroot-vs/usr/lib/firmware/i915/adlp_guc_69.0.3.bin, because No such file or directory
set_attributes: failed to set time on ./fsroot-vs/usr/lib/firmware/i915/adlp_guc_70.1.1.bin, because No such file or directory
set_attributes: failed to set time on ./fsroot-vs/usr/lib/firmware/i915/adlp_guc_70.bin, because No such file or directory
set_attributes: failed to set time on ./fsroot-vs/usr/lib/firmware/i915/adls_dmc_ver2_01.bin, because No such file or directory
set_attributes: failed to set time on ./fsroot-vs/usr/lib/firmware/i915/bxt_dmc_ver1_07.bin, because No such file or directory
set_attributes: failed to set time on ./fsroot-vs/usr/lib/firmware/i915/bxt_guc_32.0.3.bin, because No such file or directory
set_attributes: failed to set time on ./fsroot-vs/usr/lib/firmware/i915/bxt_guc_33.0.0.bin, because No such file or directory
set_attributes: failed to set time on ./fsroot-vs/usr/lib/firmware/i915/bxt_guc_49.0.1.bin, because No such file or directory
set_attributes: failed to set time on ./fsroot-vs/usr/lib/firmware/i915/bxt_guc_62.0.0.bin, because No such file or directory
set_attributes: failed to set time on ./fsroot-vs/usr/lib/firmware/i915/bxt_guc_69.0.3.bin, because No such file or directory
set_attributes: failed to set time on ./fsroot-vs/usr/lib/firmware/i915/bxt_guc_70.1.1.bin, because No such file or directory
set_attributes: failed to set time on ./fsroot-vs/usr/lib/firmware/i915/bxt_guc_ver8_7.bin, because No such file or directory
set_attributes: failed to set time on ./fsroot-vs/usr/lib/firmware/i915/bxt_guc_ver9_29.bin, because No such file or directory
set_attributes: failed to set time on ./fsroot-vs/usr/lib/firmware/i915/bxt_huc_2.0.0.bin, because No such file or directory
set_attributes: failed to set time on ./fsroot-vs/usr/lib/firmware/i915/bxt_huc_ver01_07_1398.bin, because No such file or directory
set_attributes: failed to set time on ./fsroot-vs/usr/lib/firmware/i915/bxt_huc_ver01_8_2893.bin, because No such file or directory
set_attributes: failed to set time on ./fsroot-vs/usr/lib/firmware/i915/cml_guc_33.0.0.bin, because No such file or directory
set_attributes: failed to set time on ./fsroot-vs/usr/lib/firmware/i915/cml_guc_49.0.1.bin, because No such file or directory
set_attributes: failed to set time on ./fsroot-vs/usr/lib/firmware/i915/cml_guc_62.0.0.bin, because No such file or directory
set_attributes: failed to set time on ./fsroot-vs/usr/lib/firmware/i915/cml_guc_69.0.3.bin, because No such file or directory
set_attributes: failed to set time on ./fsroot-vs/usr/lib/firmware/i915/cml_guc_70.1.1.bin, because No such file or directory
set_attributes: failed to set time on ./fsroot-vs/usr/lib/firmware/i915/cml_huc_4.0.0.bin, because No such file or directory
set_attributes: failed to set time on ./fsroot-vs/usr/lib/firmware/i915/cnl_dmc_ver1_07.bin, because No such file or directory
set_attributes: failed to set time on ./fsroot-vs/usr/lib/firmware/i915/dg1_dmc_ver2_02.bin, because No such file or directory
set_attributes: failed to set time on ./fsroot-vs/usr/lib/firmware/i915/dg1_guc_49.0.1.bin, because No such file or directory
set_attributes: failed to set time on ./fsroot-vs/usr/lib/firmware/i915/dg1_guc_62.0.0.bin, because No such file or directory
set_attributes: failed to set time on ./fsroot-vs/usr/lib/firmware/i915/dg1_guc_69.0.3.bin, because No such file or directory
set_attributes: failed to set time on ./fsroot-vs/usr/lib/firmware/i915/dg1_guc_70.1.1.bin, because No such file or directory
set_attributes: failed to set time on ./fsroot-vs/usr/lib/firmware/i915/dg1_guc_70.bin, because No such file or directory
set_attributes: failed to set time on ./fsroot-vs/usr/lib/firmware/i915/dg1_huc.bin, because No such file or directory
set_attributes: failed to set time on ./fsroot-vs/usr/lib/firmware/i915/dg1_huc_7.7.1.bin, because No such file or directory
set_attributes: failed to set time on ./fsroot-vs/usr/lib/firmware/i915/dg1_huc_7.9.3.bin, because No such file or directory
set_attributes: failed to set time on ./fsroot-vs/usr/lib/firmware/i915/dg2_dmc_ver2_06.bin, because No such file or directory
set_attributes: failed to set time on ./fsroot-vs/usr/lib/firmware/i915/dg2_dmc_ver2_07.bin, because No such file or directory
set_attributes: failed to set time on ./fsroot-vs/usr/lib/firmware/i915/dg2_dmc_ver2_08.bin, because No such file or directory
set_attributes: failed to set time on ./fsroot-vs/usr/lib/firmware/i915/dg2_guc_70.1.2.bin, because No such file or directory
set_attributes: failed to set time on ./fsroot-vs/usr/lib/firmware/i915/dg2_guc_70.4.1.bin, because No such file or directory
set_attributes: failed to set time on ./fsroot-vs/usr/lib/firmware/i915/dg2_guc_70.bin, because No such file or directory
set_attributes: failed to set time on ./fsroot-vs/usr/lib/firmware/i915/ehl_guc_33.0.4.bin, because No such file or directory
set_attributes: failed to set time on ./fsroot-vs/usr/lib/firmware/i915/ehl_guc_49.0.1.bin, because No such file or directory
set_attributes: failed to set time on ./fsroot-vs/usr/lib/firmware/i915/ehl_guc_62.0.0.bin, because No such file or directory
set_attributes: failed to set time on ./fsroot-vs/usr/lib/firmware/i915/ehl_guc_69.0.3.bin, because No such file or directory
set_attributes: failed to set time on ./fsroot-vs/usr/lib/firmware/i915/ehl_guc_70.1.1.bin, because No such file or directory
set_attributes: failed to set time on ./fsroot-vs/usr/lib/firmware/i915/ehl_huc_9.0.0.bin, because No such file or directory
set_attributes: failed to set time on ./fsroot-vs/usr/lib/firmware/i915/glk_dmc_ver1_04.bin, because No such file or directory
set_attributes: failed to set time on ./fsroot-vs/usr/lib/firmware/i915/glk_guc_32.0.3.bin, because No such file or directory
set_attributes: failed to set time on ./fsroot-vs/usr/lib/firmware/i915/glk_guc_33.0.0.bin, because No such file or directory
set_attributes: failed to set time on ./fsroot-vs/usr/lib/firmware/i915/glk_guc_49.0.1.bin, because No such file or directory
set_attributes: failed to set time on ./fsroot-vs/usr/lib/firmware/i915/glk_guc_62.0.0.bin, because No such file or directory
set_attributes: failed to set time on ./fsroot-vs/usr/lib/firmware/i915/glk_guc_69.0.3.bin, because No such file or directory
set_attributes: failed to set time on ./fsroot-vs/usr/lib/firmware/i915/glk_guc_70.1.1.bin, because No such file or directory
set_attributes: failed to set time on ./fsroot-vs/usr/lib/firmware/i915/glk_huc_4.0.0.bin, because No such file or directory
set_attributes: failed to set time on ./fsroot-vs/usr/lib/firmware/i915/glk_huc_ver03_01_2893.bin, because No such file or directory
set_attributes: failed to set time on ./fsroot-vs/usr/lib/firmware/i915/icl_dmc_ver1_07.bin, because No such file or directory
set_attributes: failed to set time on ./fsroot-vs/usr/lib/firmware/i915/icl_dmc_ver1_09.bin, because No such file or directory
set_attributes: failed to set time on ./fsroot-vs/usr/lib/firmware/i915/icl_guc_32.0.3.bin, because No such file or directory
set_attributes: failed to set time on ./fsroot-vs/usr/lib/firmware/i915/icl_guc_33.0.0.bin, because No such file or directory
set_attributes: failed to set time on ./fsroot-vs/usr/lib/firmware/i915/icl_guc_49.0.1.bin, because No such file or directory
set_attributes: failed to set time on ./fsroot-vs/usr/lib/firmware/i915/icl_guc_62.0.0.bin, because No such file or directory
set_attributes: failed to set time on ./fsroot-vs/usr/lib/firmware/i915/icl_guc_69.0.3.bin, because No such file or directory
set_attributes: failed to set time on ./fsroot-vs/usr/lib/firmware/i915/icl_guc_70.1.1.bin, because No such file or directory
set_attributes: failed to set time on ./fsroot-vs/usr/lib/firmware/i915/icl_huc_9.0.0.bin, because No such file or directory
set_attributes: failed to set time on ./fsroot-vs/usr/lib/firmware/i915/icl_huc_ver8_4_3238.bin, because No such file or directory
set_attributes: failed to set time on ./fsroot-vs/usr/lib/firmware/i915/kbl_dmc_ver1_01.bin, because No such file or directory
set_attributes: failed to set time on ./fsroot-vs/usr/lib/firmware/i915/kbl_dmc_ver1_04.bin, because No such file or directory
set_attributes: failed to set time on ./fsroot-vs/usr/lib/firmware/i915/kbl_guc_32.0.3.bin, because No such file or directory
set_attributes: failed to set time on ./fsroot-vs/usr/lib/firmware/i915/kbl_guc_33.0.0.bin, because No such file or directory
set_attributes: failed to set time on ./fsroot-vs/usr/lib/firmware/i915/kbl_guc_49.0.1.bin, because No such file or directory
set_attributes: failed to set time on ./fsroot-vs/usr/lib/firmware/i915/kbl_guc_62.0.0.bin, because No such file or directory
set_attributes: failed to set time on ./fsroot-vs/usr/lib/firmware/i915/kbl_guc_69.0.3.bin, because No such file or directory
set_attributes: failed to set time on ./fsroot-vs/usr/lib/firmware/i915/kbl_guc_70.1.1.bin, because No such file or directory
set_attributes: failed to set time on ./fsroot-vs/usr/lib/firmware/i915/kbl_guc_ver9_14.bin, because No such file or directory
set_attributes: failed to set time on ./fsroot-vs/usr/lib/firmware/i915/kbl_guc_ver9_39.bin, because No such file or directory
set_attributes: failed to set time on ./fsroot-vs/usr/lib/firmware/i915/kbl_huc_4.0.0.bin, because No such file or directory
set_attributes: failed to set time on ./fsroot-vs/usr/lib/firmware/i915/kbl_huc_ver02_00_1810.bin, because No such file or directory
set_attributes: failed to set time on ./fsroot-vs/usr/lib/firmware/i915/mtl_dmc.bin, because No such file or directory
set_attributes: failed to set time on ./fsroot-vs/usr/lib/firmware/i915/rkl_dmc_ver2_02.bin, because No such file or directory
set_attributes: failed to set time on ./fsroot-vs/usr/lib/firmware/i915/rkl_dmc_ver2_03.bin, because No such file or directory
set_attributes: failed to set time on ./fsroot-vs/usr/lib/firmware/i915/skl_dmc_ver1_23.bin, because No such file or directory
set_attributes: failed to set time on ./fsroot-vs/usr/lib/firmware/i915/skl_dmc_ver1_26.bin, because No such file or directory
set_attributes: failed to set time on ./fsroot-vs/usr/lib/firmware/i915/skl_dmc_ver1_27.bin, because No such file or directory
set_attributes: failed to set time on ./fsroot-vs/usr/lib/firmware/i915/skl_guc_32.0.3.bin, because No such file or directory
set_attributes: failed to set time on ./fsroot-vs/usr/lib/firmware/i915/skl_guc_33.0.0.bin, because No such file or directory
set_attributes: failed to set time on ./fsroot-vs/usr/lib/firmware/i915/skl_guc_49.0.1.bin, because No such file or directory
set_attributes: failed to set time on ./fsroot-vs/usr/lib/firmware/i915/skl_guc_62.0.0.bin, because No such file or directory
set_attributes: failed to set time on ./fsroot-vs/usr/lib/firmware/i915/skl_guc_69.0.3.bin, because No such file or directory
set_attributes: failed to set time on ./fsroot-vs/usr/lib/firmware/i915/skl_guc_70.1.1.bin, because No such file or directory
set_attributes: failed to set time on ./fsroot-vs/usr/lib/firmware/i915/skl_guc_ver1.bin, because No such file or directory
set_attributes: failed to set time on ./fsroot-vs/usr/lib/firmware/i915/skl_guc_ver4.bin, because No such file or directory
set_attributes: failed to set time on ./fsroot-vs/usr/lib/firmware/i915/skl_guc_ver6_1.bin, because No such file or directory
set_attributes: failed to set time on ./fsroot-vs/usr/lib/firmware/i915/skl_guc_ver9_33.bin, because No such file or directory
set_attributes: failed to set time on ./fsroot-vs/usr/lib/firmware/i915/skl_huc_2.0.0.bin, because No such file or directory
set_attributes: failed to set time on ./fsroot-vs/usr/lib/firmware/i915/skl_huc_ver01_07_1398.bin, because No such file or directory
set_attributes: failed to set time on ./fsroot-vs/usr/lib/firmware/i915/tgl_dmc_ver2_04.bin, because No such file or directory
set_attributes: failed to set time on ./fsroot-vs/usr/lib/firmware/i915/tgl_dmc_ver2_06.bin, because No such file or directory
set_attributes: failed to set time on ./fsroot-vs/usr/lib/firmware/i915/tgl_dmc_ver2_08.bin, because No such file or directory
[============| ] 14601/67776 21%
set_attributes: failed to set time on ./fsroot-vs/usr/lib/firmware/i915/tgl_dmc_ver2_12.bin, because No such file or directory
set_attributes: failed to set time on ./fsroot-vs/usr/lib/firmware/i915/tgl_guc_35.2.0.bin, because No such file or directory
set_attributes: failed to set time on ./fsroot-vs/usr/lib/firmware/i915/tgl_guc_49.0.1.bin, because No such file or directory
set_attributes: failed to set time on ./fsroot-vs/usr/lib/firmware/i915/tgl_guc_62.0.0.bin, because No such file or directory
set_attributes: failed to set time on ./fsroot-vs/usr/lib/firmware/i915/tgl_guc_69.0.3.bin, because No such file or directory
set_attributes: failed to set time on ./fsroot-vs/usr/lib/firmware/i915/tgl_guc_70.1.1.bin, because No such file or directory
set_attributes: failed to set time on ./fsroot-vs/usr/lib/firmware/i915/tgl_guc_70.bin, because No such file or directory
set_attributes: failed to set time on ./fsroot-vs/usr/lib/firmware/i915/tgl_huc.bin, because No such file or directory
set_attributes: failed to set time on ./fsroot-vs/usr/lib/firmware/i915/tgl_huc_7.0.12.bin, because No such file or directory
set_attributes: failed to set time on ./fsroot-vs/usr/lib/firmware/i915/tgl_huc_7.0.3.bin, because No such file or directory
set_attributes: failed to set time on ./fsroot-vs/usr/lib/firmware/i915/tgl_huc_7.5.0.bin, because No such file or directory
set_attributes: failed to set time on ./fsroot-vs/usr/lib/firmware/i915/tgl_huc_7.9.3.bin, because No such file or directory
set_attributes: failed to set time on ./fsroot-vs/usr/lib/firmware/i915, because No such file or directory
set_attributes: failed to set time on ./fsroot-vs/usr/lib/firmware/imx/sdma/sdma-imx6q.bin, because No such file or directory
set_attributes: failed to set time on ./fsroot-vs/usr/lib/firmware/imx/sdma/sdma-imx7d.bin, because No such file or directory
set_attributes: failed to set time on ./fsroot-vs/usr/lib/firmware/imx/sdma, because No such file or directory
set_attributes: failed to set time on ./fsroot-vs/usr/lib/firmware/imx, because No such file or directory
set_attributes: failed to set time on ./fsroot-vs/usr/lib/firmware/intel/ice/ddp/ice-1.3.30.0.pkg, because No such file or directory
set_attributes: failed to set time on ./fsroot-vs/usr/lib/firmware/intel/ice/ddp, because No such file or directory
set_attributes: failed to set time on ./fsroot-vs/usr/lib/firmware/intel/ice/ddp-comms/ice_comms-1.3.31.0.pkg, because No such file or directory
set_attributes: failed to set time on ./fsroot-vs/usr/lib/firmware/intel/ice/ddp-comms, because No such file or directory
set_attributes: failed to set time on ./fsroot-vs/usr/lib/firmware/intel/ice, because No such file or directory
set_attributes: failed to set time on ./fsroot-vs/usr/lib/firmware/intel/irci_irci_ecr-master_20161208_0213_20170112_1500.bin, because No such file or directory
set_attributes: failed to set time on ./fsroot-vs/usr/lib/firmware/intel, because No such file or directory
set_attributes: failed to set time on ./fsroot-vs/usr/lib/firmware/kaweth/new_code.bin, because No such file or directory
set_attributes: failed to set time on ./fsroot-vs/usr/lib/firmware/kaweth/new_code_fix.bin, because No such file or directory
set_attributes: failed to set time on ./fsroot-vs/usr/lib/firmware/kaweth/trigger_code.bin, because No such file or directory
set_attributes: failed to set time on ./fsroot-vs/usr/lib/firmware/kaweth/trigger_code_fix.bin, because No such file or directory
set_attributes: failed to set time on ./fsroot-vs/usr/lib/firmware/kaweth, because No such file or directory
set_attributes: failed to set time on ./fsroot-vs/usr/lib/firmware/lt9611uxc_fw.bin, because No such file or directory
set_attributes: failed to set time on ./fsroot-vs/usr/lib/firmware/matrox/g200_warp.fw, because No such file or directory
set_attributes: failed to set time on ./fsroot-vs/usr/lib/firmware/matrox/g400_warp.fw, because No such file or directory
set_attributes: failed to set time on ./fsroot-vs/usr/lib/firmware/matrox, because No such file or directory
set_attributes: failed to set time on ./fsroot-vs/usr/lib/firmware/mediatek/BT_RAM_CODE_MT7922_1_1_hdr.bin, because No such file or directory
set_attributes: failed to set time on ./fsroot-vs/usr/lib/firmware/mediatek/BT_RAM_CODE_MT7961_1_2_hdr.bin, because No such file or directory
set_attributes: failed to set time on ./fsroot-vs/usr/lib/firmware/mediatek/WIFI_MT7922_patch_mcu_1_1_hdr.bin, because No such file or directory
set_attributes: failed to set time on ./fsroot-vs/usr/lib/firmware/mediatek/WIFI_MT7961_patch_mcu_1_2_hdr.bin, because No such file or directory
set_attributes: failed to set time on ./fsroot-vs/usr/lib/firmware/mediatek/WIFI_RAM_CODE_MT7922_1.bin, because No such file or directory
set_attributes: failed to set time on ./fsroot-vs/usr/lib/firmware/mediatek/WIFI_RAM_CODE_MT7961_1.bin, because No such file or directory
set_attributes: failed to set time on ./fsroot-vs/usr/lib/firmware/mediatek/mt7610e.bin, because No such file or directory
set_attributes: failed to set time on ./fsroot-vs/usr/lib/firmware/mediatek/mt7610u.bin, because No such file or directory
set_attributes: failed to set time on ./fsroot-vs/usr/lib/firmware/mediatek/mt7615_cr4.bin, because No such file or directory
set_attributes: failed to set time on ./fsroot-vs/usr/lib/firmware/mediatek/mt7615_n9.bin, because No such file or directory
set_attributes: failed to set time on ./fsroot-vs/usr/lib/firmware/mediatek/mt7615_rom_patch.bin, because No such file or directory
set_attributes: failed to set time on ./fsroot-vs/usr/lib/firmware/mediatek/mt7622_n9.bin, because No such file or directory
set_attributes: failed to set time on ./fsroot-vs/usr/lib/firmware/mediatek/mt7622_rom_patch.bin, because No such file or directory
set_attributes: failed to set time on ./fsroot-vs/usr/lib/firmware/mediatek/mt7622pr2h.bin, because No such file or directory
set_attributes: failed to set time on ./fsroot-vs/usr/lib/firmware/mediatek/mt7650e.bin, because No such file or directory
set_attributes: failed to set time on ./fsroot-vs/usr/lib/firmware/mediatek/mt7662u.bin, because No such file or directory
set_attributes: failed to set time on ./fsroot-vs/usr/lib/firmware/mediatek/mt7662u_rom_patch.bin, because No such file or directory
set_attributes: failed to set time on ./fsroot-vs/usr/lib/firmware/mediatek/mt7663_n9_rebb.bin, because No such file or directory
set_attributes: failed to set time on ./fsroot-vs/usr/lib/firmware/mediatek/mt7663_n9_v3.bin, because No such file or directory
set_attributes: failed to set time on ./fsroot-vs/usr/lib/firmware/mediatek/mt7663pr2h.bin, because No such file or directory
set_attributes: failed to set time on ./fsroot-vs/usr/lib/firmware/mediatek/mt7663pr2h_rebb.bin, because No such file or directory
set_attributes: failed to set time on ./fsroot-vs/usr/lib/firmware/mediatek/mt7668pr2h.bin, because No such file or directory
set_attributes: failed to set time on ./fsroot-vs/usr/lib/firmware/mediatek/mt7915_rom_patch.bin, because No such file or directory
set_attributes: failed to set time on ./fsroot-vs/usr/lib/firmware/mediatek/mt7915_wa.bin, because No such file or directory
set_attributes: failed to set time on ./fsroot-vs/usr/lib/firmware/mediatek/mt7915_wm.bin, because No such file or directory
set_attributes: failed to set time on ./fsroot-vs/usr/lib/firmware/mediatek/mt8173/vpu_d.bin, because No such file or directory
set_attributes: failed to set time on ./fsroot-vs/usr/lib/firmware/mediatek/mt8173/vpu_p.bin, because No such file or directory
set_attributes: failed to set time on ./fsroot-vs/usr/lib/firmware/mediatek/mt8173, because No such file or directory
set_attributes: failed to set time on ./fsroot-vs/usr/lib/firmware/mediatek/mt8183/scp.img, because No such file or directory
set_attributes: failed to set time on ./fsroot-vs/usr/lib/firmware/mediatek/mt8183, because No such file or directory
set_attributes: failed to set time on ./fsroot-vs/usr/lib/firmware/mediatek/mt8186/scp.img, because No such file or directory
set_attributes: failed to set time on ./fsroot-vs/usr/lib/firmware/mediatek/mt8186, because No such file or directory
set_attributes: failed to set time on ./fsroot-vs/usr/lib/firmware/mediatek/mt8195/scp.img, because No such file or directory
set_attributes: failed to set time on ./fsroot-vs/usr/lib/firmware/mediatek/mt8195, because No such file or directory
set_attributes: failed to set time on ./fsroot-vs/usr/lib/firmware/mediatek, because No such file or directory
set_attributes: failed to set time on ./fsroot-vs/usr/lib/firmware/moxa/moxa-1110.fw, because No such file or directory
set_attributes: failed to set time on ./fsroot-vs/usr/lib/firmware/moxa/moxa-1130.fw, because No such file or directory
set_attributes: failed to set time on ./fsroot-vs/usr/lib/firmware/moxa/moxa-1131.fw, because No such file or directory
set_attributes: failed to set time on ./fsroot-vs/usr/lib/firmware/moxa/moxa-1150.fw, because No such file or directory
set_attributes: failed to set time on ./fsroot-vs/usr/lib/firmware/moxa/moxa-1151.fw, because No such file or directory
set_attributes: failed to set time on ./fsroot-vs/usr/lib/firmware/moxa/moxa-1250.fw, because No such file or directory
set_attributes: failed to set time on ./fsroot-vs/usr/lib/firmware/moxa/moxa-1251.fw, because No such file or directory
set_attributes: failed to set time on ./fsroot-vs/usr/lib/firmware/moxa/moxa-1410.fw, because No such file or directory
set_attributes: failed to set time on ./fsroot-vs/usr/lib/firmware/moxa/moxa-1450.fw, because No such file or directory
set_attributes: failed to set time on ./fsroot-vs/usr/lib/firmware/moxa/moxa-1451.fw, because No such file or directory
set_attributes: failed to set time on ./fsroot-vs/usr/lib/firmware/moxa/moxa-1613.fw, because No such file or directory
set_attributes: failed to set time on ./fsroot-vs/usr/lib/firmware/moxa/moxa-1618.fw, because No such file or directory
set_attributes: failed to set time on ./fsroot-vs/usr/lib/firmware/moxa/moxa-1653.fw, because No such file or directory
set_attributes: failed to set time on ./fsroot-vs/usr/lib/firmware/moxa/moxa-1658.fw, because No such file or directory
set_attributes: failed to set time on ./fsroot-vs/usr/lib/firmware/moxa, because No such file or directory
set_attributes: failed to set time on ./fsroot-vs/usr/lib/firmware/mt7601u.bin, because No such file or directory
set_attributes: failed to set time on ./fsroot-vs/usr/lib/firmware/mt7650.bin, because No such file or directory
set_attributes: failed to set time on ./fsroot-vs/usr/lib/firmware/mt7662.bin, because No such file or directory
set_attributes: failed to set time on ./fsroot-vs/usr/lib/firmware/mt7662_rom_patch.bin, because No such file or directory
set_attributes: failed to set time on ./fsroot-vs/usr/lib/firmware/mts_cdma.fw, because No such file or directory
set_attributes: failed to set time on ./fsroot-vs/usr/lib/firmware/mts_edge.fw, because No such file or directory
set_attributes: failed to set time on ./fsroot-vs/usr/lib/firmware/mts_gsm.fw, because No such file or directory
set_attributes: failed to set time on ./fsroot-vs/usr/lib/firmware/nvidia/ga102/acr/ucode_ahesasc.bin, because No such file or directory
set_attributes: failed to set time on ./fsroot-vs/usr/lib/firmware/nvidia/ga102/acr/ucode_asb.bin, because No such file or directory
set_attributes: failed to set time on ./fsroot-vs/usr/lib/firmware/nvidia/ga102/acr/ucode_unload.bin, because No such file or directory
set_attributes: failed to set time on ./fsroot-vs/usr/lib/firmware/nvidia/ga102/acr, because No such file or directory
set_attributes: failed to set time on ./fsroot-vs/usr/lib/firmware/nvidia/ga102/gr/NET_img.bin, because No such file or directory
set_attributes: failed to set time on ./fsroot-vs/usr/lib/firmware/nvidia/ga102/gr/fecs_bl.bin, because No such file or directory
set_attributes: failed to set time on ./fsroot-vs/usr/lib/firmware/nvidia/ga102/gr/fecs_sig.bin, because No such file or directory
set_attributes: failed to set time on ./fsroot-vs/usr/lib/firmware/nvidia/ga102/gr/gpccs_bl.bin, because No such file or directory
set_attributes: failed to set time on ./fsroot-vs/usr/lib/firmware/nvidia/ga102/gr/gpccs_sig.bin, because No such file or directory
set_attributes: failed to set time on ./fsroot-vs/usr/lib/firmware/nvidia/ga102/gr, because No such file or directory
set_attributes: failed to set time on ./fsroot-vs/usr/lib/firmware/nvidia/ga102/nvdec/scrubber.bin, because No such file or directory
set_attributes: failed to set time on ./fsroot-vs/usr/lib/firmware/nvidia/ga102/nvdec, because No such file or directory
set_attributes: failed to set time on ./fsroot-vs/usr/lib/firmware/nvidia/ga102/sec2/desc.bin, because No such file or directory
set_attributes: failed to set time on ./fsroot-vs/usr/lib/firmware/nvidia/ga102/sec2/hs_bl_sig.bin, because No such file or directory
set_attributes: failed to set time on ./fsroot-vs/usr/lib/firmware/nvidia/ga102/sec2/image.bin, because No such file or directory
set_attributes: failed to set time on ./fsroot-vs/usr/lib/firmware/nvidia/ga102/sec2/sig.bin, because No such file or directory
set_attributes: failed to set time on ./fsroot-vs/usr/lib/firmware/nvidia/ga102/sec2, because No such file or directory
set_attributes: failed to set time on ./fsroot-vs/usr/lib/firmware/nvidia/ga102, because No such file or directory
set_attributes: failed to set time on ./fsroot-vs/usr/lib/firmware/nvidia/ga103/gr/NET_img.bin, because No such file or directory
set_attributes: failed to set time on ./fsroot-vs/usr/lib/firmware/nvidia/ga103/gr/fecs_bl.bin, because No such file or directory
set_attributes: failed to set time on ./fsroot-vs/usr/lib/firmware/nvidia/ga103/gr/fecs_sig.bin, because No such file or directory
set_attributes: failed to set time on ./fsroot-vs/usr/lib/firmware/nvidia/ga103/gr/gpccs_bl.bin, because No such file or directory
set_attributes: failed to set time on ./fsroot-vs/usr/lib/firmware/nvidia/ga103/gr/gpccs_sig.bin, because No such file or directory
set_attributes: failed to set time on ./fsroot-vs/usr/lib/firmware/nvidia/ga103/gr, because No such file or directory
set_attributes: failed to set time on ./fsroot-vs/usr/lib/firmware/nvidia/ga103, because No such file or directory
set_attributes: failed to set time on ./fsroot-vs/usr/lib/firmware/nvidia/ga104/gr/NET_img.bin, because No such file or directory
set_attributes: failed to set time on ./fsroot-vs/usr/lib/firmware/nvidia/ga104/gr/fecs_bl.bin, because No such file or directory
set_attributes: failed to set time on ./fsroot-vs/usr/lib/firmware/nvidia/ga104/gr/fecs_sig.bin, because No such file or directory
set_attributes: failed to set time on ./fsroot-vs/usr/lib/firmware/nvidia/ga104/gr/gpccs_bl.bin, because No such file or directory
set_attributes: failed to set time on ./fsroot-vs/usr/lib/firmware/nvidia/ga104/gr/gpccs_sig.bin, because No such file or directory
set_attributes: failed to set time on ./fsroot-vs/usr/lib/firmware/nvidia/ga104/gr, because No such file or directory
set_attributes: failed to set time on ./fsroot-vs/usr/lib/firmware/nvidia/ga104, because No such file or directory
set_attributes: failed to set time on ./fsroot-vs/usr/lib/firmware/nvidia/ga106/gr/NET_img.bin, because No such file or directory
set_attributes: failed to set time on ./fsroot-vs/usr/lib/firmware/nvidia/ga106/gr/fecs_bl.bin, because No such file or directory
set_attributes: failed to set time on ./fsroot-vs/usr/lib/firmware/nvidia/ga106/gr/fecs_sig.bin, because No such file or directory
set_attributes: failed to set time on ./fsroot-vs/usr/lib/firmware/nvidia/ga106/gr/gpccs_bl.bin, because No such file or directory
set_attributes: failed to set time on ./fsroot-vs/usr/lib/firmware/nvidia/ga106/gr/gpccs_sig.bin, because No such file or directory
set_attributes: failed to set time on ./fsroot-vs/usr/lib/firmware/nvidia/ga106/gr, because No such file or directory
set_attributes: failed to set time on ./fsroot-vs/usr/lib/firmware/nvidia/ga106, because No such file or directory
set_attributes: failed to set time on ./fsroot-vs/usr/lib/firmware/nvidia/ga107/gr/NET_img.bin, because No such file or directory
set_attributes: failed to set time on ./fsroot-vs/usr/lib/firmware/nvidia/ga107/gr/fecs_bl.bin, because No such file or directory
set_attributes: failed to set time on ./fsroot-vs/usr/lib/firmware/nvidia/ga107/gr/fecs_sig.bin, because No such file or directory
set_attributes: failed to set time on ./fsroot-vs/usr/lib/firmware/nvidia/ga107/gr/gpccs_bl.bin, because No such file or directory
set_attributes: failed to set time on ./fsroot-vs/usr/lib/firmware/nvidia/ga107/gr/gpccs_sig.bin, because No such file or directory
set_attributes: failed to set time on ./fsroot-vs/usr/lib/firmware/nvidia/ga107/gr, because No such file or directory
set_attributes: failed to set time on ./fsroot-vs/usr/lib/firmware/nvidia/ga107, because No such file or directory
set_attributes: failed to set time on ./fsroot-vs/usr/lib/firmware/nvidia/gk20a/fecs_data.bin, because No such file or directory
set_attributes: failed to set time on ./fsroot-vs/usr/lib/firmware/nvidia/gk20a/fecs_inst.bin, because No such file or directory
set_attributes: failed to set time on ./fsroot-vs/usr/lib/firmware/nvidia/gk20a/gpccs_data.bin, because No such file or directory
set_attributes: failed to set time on ./fsroot-vs/usr/lib/firmware/nvidia/gk20a/gpccs_inst.bin, because No such file or directory
set_attributes: failed to set time on ./fsroot-vs/usr/lib/firmware/nvidia/gk20a/sw_bundle_init.bin, because No such file or directory
set_attributes: failed to set time on ./fsroot-vs/usr/lib/firmware/nvidia/gk20a/sw_ctx.bin, because No such file or directory
set_attributes: failed to set time on ./fsroot-vs/usr/lib/firmware/nvidia/gk20a/sw_method_init.bin, because No such file or directory
set_attributes: failed to set time on ./fsroot-vs/usr/lib/firmware/nvidia/gk20a/sw_nonctx.bin, because No such file or directory
set_attributes: failed to set time on ./fsroot-vs/usr/lib/firmware/nvidia/gk20a, because No such file or directory
set_attributes: failed to set time on ./fsroot-vs/usr/lib/firmware/nvidia/gm200/acr/bl.bin, because No such file or directory
set_attributes: failed to set time on ./fsroot-vs/usr/lib/firmware/nvidia/gm200/acr/ucode_load.bin, because No such file or directory
set_attributes: failed to set time on ./fsroot-vs/usr/lib/firmware/nvidia/gm200/acr/ucode_unload.bin, because No such file or directory
set_attributes: failed to set time on ./fsroot-vs/usr/lib/firmware/nvidia/gm200/acr, because No such file or directory
set_attributes: failed to set time on ./fsroot-vs/usr/lib/firmware/nvidia/gm200/gr/fecs_bl.bin, because No such file or directory
set_attributes: failed to set time on ./fsroot-vs/usr/lib/firmware/nvidia/gm200/gr/fecs_data.bin, because No such file or directory
set_attributes: failed to set time on ./fsroot-vs/usr/lib/firmware/nvidia/gm200/gr/fecs_inst.bin, because No such file or directory
set_attributes: failed to set time on ./fsroot-vs/usr/lib/firmware/nvidia/gm200/gr/fecs_sig.bin, because No such file or directory
set_attributes: failed to set time on ./fsroot-vs/usr/lib/firmware/nvidia/gm200/gr/gpccs_bl.bin, because No such file or directory
set_attributes: failed to set time on ./fsroot-vs/usr/lib/firmware/nvidia/gm200/gr/gpccs_data.bin, because No such file or directory
set_attributes: failed to set time on ./fsroot-vs/usr/lib/firmware/nvidia/gm200/gr/gpccs_inst.bin, because No such file or directory
set_attributes: failed to set time on ./fsroot-vs/usr/lib/firmware/nvidia/gm200/gr/gpccs_sig.bin, because No such file or directory
set_attributes: failed to set time on ./fsroot-vs/usr/lib/firmware/nvidia/gm200/gr/sw_bundle_init.bin, because No such file or directory
set_attributes: failed to set time on ./fsroot-vs/usr/lib/firmware/nvidia/gm200/gr/sw_ctx.bin, because No such file or directory
set_attributes: failed to set time on ./fsroot-vs/usr/lib/firmware/nvidia/gm200/gr/sw_method_init.bin, because No such file or directory
set_attributes: failed to set time on ./fsroot-vs/usr/lib/firmware/nvidia/gm200/gr/sw_nonctx.bin, because No such file or directory
set_attributes: failed to set time on ./fsroot-vs/usr/lib/firmware/nvidia/gm200/gr, because No such file or directory
set_attributes: failed to set time on ./fsroot-vs/usr/lib/firmware/nvidia/gm200, because No such file or directory
set_attributes: failed to set time on ./fsroot-vs/usr/lib/firmware/nvidia/gm204/acr, because No such file or directory
set_attributes: failed to set time on ./fsroot-vs/usr/lib/firmware/nvidia/gm204/gr/fecs_data.bin, because No such file or directory
set_attributes: failed to set time on ./fsroot-vs/usr/lib/firmware/nvidia/gm204/gr/fecs_sig.bin, because No such file or directory
set_attributes: failed to set time on ./fsroot-vs/usr/lib/firmware/nvidia/gm204/gr/gpccs_data.bin, because No such file or directory
set_attributes: failed to set time on ./fsroot-vs/usr/lib/firmware/nvidia/gm204/gr/gpccs_sig.bin, because No such file or directory
set_attributes: failed to set time on ./fsroot-vs/usr/lib/firmware/nvidia/gm204/gr, because No such file or directory
set_attributes: failed to set time on ./fsroot-vs/usr/lib/firmware/nvidia/gm204, because No such file or directory
set_attributes: failed to set time on ./fsroot-vs/usr/lib/firmware/nvidia/gm206/acr/ucode_load.bin, because No such file or directory
set_attributes: failed to set time on ./fsroot-vs/usr/lib/firmware/nvidia/gm206/acr/ucode_unload.bin, because No such file or directory
set_attributes: failed to set time on ./fsroot-vs/usr/lib/firmware/nvidia/gm206/acr, because No such file or directory
set_attributes: failed to set time on ./fsroot-vs/usr/lib/firmware/nvidia/gm206/gr/fecs_data.bin, because No such file or directory
set_attributes: failed to set time on ./fsroot-vs/usr/lib/firmware/nvidia/gm206/gr/fecs_sig.bin, because No such file or directory
set_attributes: failed to set time on ./fsroot-vs/usr/lib/firmware/nvidia/gm206/gr/gpccs_data.bin, because No such file or directory
set_attributes: failed to set time on ./fsroot-vs/usr/lib/firmware/nvidia/gm206/gr/gpccs_sig.bin, because No such file or directory
set_attributes: failed to set time on ./fsroot-vs/usr/lib/firmware/nvidia/gm206/gr, because No such file or directory
set_attributes: failed to set time on ./fsroot-vs/usr/lib/firmware/nvidia/gm206, because No such file or directory
set_attributes: failed to set time on ./fsroot-vs/usr/lib/firmware/nvidia/gm20b/acr/bl.bin, because No such file or directory
set_attributes: failed to set time on ./fsroot-vs/usr/lib/firmware/nvidia/gm20b/acr/ucode_load.bin, because No such file or directory
set_attributes: failed to set time on ./fsroot-vs/usr/lib/firmware/nvidia/gm20b/acr, because No such file or directory
set_attributes: failed to set time on ./fsroot-vs/usr/lib/firmware/nvidia/gm20b/gr/fecs_bl.bin, because No such file or directory
set_attributes: failed to set time on ./fsroot-vs/usr/lib/firmware/nvidia/gm20b/gr/fecs_data.bin, because No such file or directory
set_attributes: failed to set time on ./fsroot-vs/usr/lib/firmware/nvidia/gm20b/gr/fecs_inst.bin, because No such file or directory
set_attributes: failed to set time on ./fsroot-vs/usr/lib/firmware/nvidia/gm20b/gr/fecs_sig.bin, because No such file or directory
set_attributes: failed to set time on ./fsroot-vs/usr/lib/firmware/nvidia/gm20b/gr/gpccs_data.bin, because No such file or directory
set_attributes: failed to set time on ./fsroot-vs/usr/lib/firmware/nvidia/gm20b/gr/gpccs_inst.bin, because No such file or directory
set_attributes: failed to set time on ./fsroot-vs/usr/lib/firmware/nvidia/gm20b/gr/sw_bundle_init.bin, because No such file or directory
set_attributes: failed to set time on ./fsroot-vs/usr/lib/firmware/nvidia/gm20b/gr/sw_ctx.bin, because No such file or directory
set_attributes: failed to set time on ./fsroot-vs/usr/lib/firmware/nvidia/gm20b/gr/sw_nonctx.bin, because No such file or directory
set_attributes: failed to set time on ./fsroot-vs/usr/lib/firmware/nvidia/gm20b/gr, because No such file or directory
set_attributes: failed to set time on ./fsroot-vs/usr/lib/firmware/nvidia/gm20b/pmu/desc.bin, because No such file or directory
set_attributes: failed to set time on ./fsroot-vs/usr/lib/firmware/nvidia/gm20b/pmu/image.bin, because No such file or directory
set_attributes: failed to set time on ./fsroot-vs/usr/lib/firmware/nvidia/gm20b/pmu/sig.bin, because No such file or directory
set_attributes: failed to set time on ./fsroot-vs/usr/lib/firmware/nvidia/gm20b/pmu, because No such file or directory
set_attributes: failed to set time on ./fsroot-vs/usr/lib/firmware/nvidia/gm20b, because No such file or directory
set_attributes: failed to set time on ./fsroot-vs/usr/lib/firmware/nvidia/gp100/acr/bl.bin, because No such file or directory
set_attributes: failed to set time on ./fsroot-vs/usr/lib/firmware/nvidia/gp100/acr/ucode_load.bin, because No such file or directory
set_attributes: failed to set time on ./fsroot-vs/usr/lib/firmware/nvidia/gp100/acr/ucode_unload.bin, because No such file or directory
set_attributes: failed to set time on ./fsroot-vs/usr/lib/firmware/nvidia/gp100/acr, because No such file or directory
set_attributes: failed to set time on ./fsroot-vs/usr/lib/firmware/nvidia/gp100/gr/fecs_data.bin, because No such file or directory
set_attributes: failed to set time on ./fsroot-vs/usr/lib/firmware/nvidia/gp100/gr/fecs_inst.bin, because No such file or directory
set_attributes: failed to set time on ./fsroot-vs/usr/lib/firmware/nvidia/gp100/gr/fecs_sig.bin, because No such file or directory
set_attributes: failed to set time on ./fsroot-vs/usr/lib/firmware/nvidia/gp100/gr/gpccs_data.bin, because No such file or directory
set_attributes: failed to set time on ./fsroot-vs/usr/lib/firmware/nvidia/gp100/gr/gpccs_inst.bin, because No such file or directory
set_attributes: failed to set time on ./fsroot-vs/usr/lib/firmware/nvidia/gp100/gr/gpccs_sig.bin, because No such file or directory
set_attributes: failed to set time on ./fsroot-vs/usr/lib/firmware/nvidia/gp100/gr/sw_bundle_init.bin, because No such file or directory
set_attributes: failed to set time on ./fsroot-vs/usr/lib/firmware/nvidia/gp100/gr/sw_ctx.bin, because No such file or directory
set_attributes: failed to set time on ./fsroot-vs/usr/lib/firmware/nvidia/gp100/gr/sw_method_init.bin, because No such file or directory
set_attributes: failed to set time on ./fsroot-vs/usr/lib/firmware/nvidia/gp100/gr/sw_nonctx.bin, because No such file or directory
set_attributes: failed to set time on ./fsroot-vs/usr/lib/firmware/nvidia/gp100/gr, because No such file or directory
set_attributes: failed to set time on ./fsroot-vs/usr/lib/firmware/nvidia/gp100, because No such file or directory
set_attributes: failed to set time on ./fsroot-vs/usr/lib/firmware/nvidia/gp102/acr/bl.bin, because No such file or directory
set_attributes: failed to set time on ./fsroot-vs/usr/lib/firmware/nvidia/gp102/acr/ucode_load.bin, because No such file or directory
set_attributes: failed to set time on ./fsroot-vs/usr/lib/firmware/nvidia/gp102/acr/ucode_unload.bin, because No such file or directory
set_attributes: failed to set time on ./fsroot-vs/usr/lib/firmware/nvidia/gp102/acr/unload_bl.bin, because No such file or directory
set_attributes: failed to set time on ./fsroot-vs/usr/lib/firmware/nvidia/gp102/acr, because No such file or directory
set_attributes: failed to set time on ./fsroot-vs/usr/lib/firmware/nvidia/gp102/gr/fecs_data.bin, because No such file or directory
set_attributes: failed to set time on ./fsroot-vs/usr/lib/firmware/nvidia/gp102/gr/fecs_inst.bin, because No such file or directory
set_attributes: failed to set time on ./fsroot-vs/usr/lib/firmware/nvidia/gp102/gr/fecs_sig.bin, because No such file or directory
set_attributes: failed to set time on ./fsroot-vs/usr/lib/firmware/nvidia/gp102/gr/gpccs_data.bin, because No such file or directory
set_attributes: failed to set time on ./fsroot-vs/usr/lib/firmware/nvidia/gp102/gr/gpccs_inst.bin, because No such file or directory
set_attributes: failed to set time on ./fsroot-vs/usr/lib/firmware/nvidia/gp102/gr/gpccs_sig.bin, because No such file or directory
set_attributes: failed to set time on ./fsroot-vs/usr/lib/firmware/nvidia/gp102/gr/sw_bundle_init.bin, because No such file or directory
set_attributes: failed to set time on ./fsroot-vs/usr/lib/firmware/nvidia/gp102/gr/sw_ctx.bin, because No such file or directory
set_attributes: failed to set time on ./fsroot-vs/usr/lib/firmware/nvidia/gp102/gr/sw_method_init.bin, because No such file or directory
set_attributes: failed to set time on ./fsroot-vs/usr/lib/firmware/nvidia/gp102/gr/sw_nonctx.bin, because No such file or directory
set_attributes: failed to set time on ./fsroot-vs/usr/lib/firmware/nvidia/gp102/gr, because No such file or directory
set_attributes: failed to set time on ./fsroot-vs/usr/lib/firmware/nvidia/gp102/nvdec/scrubber.bin, because No such file or directory
set_attributes: failed to set time on ./fsroot-vs/usr/lib/firmware/nvidia/gp102/nvdec, because No such file or directory
set_attributes: failed to set time on ./fsroot-vs/usr/lib/firmware/nvidia/gp102/sec2/desc-1.bin, because No such file or directory
set_attributes: failed to set time on ./fsroot-vs/usr/lib/firmware/nvidia/gp102/sec2/desc.bin, because No such file or directory
set_attributes: failed to set time on ./fsroot-vs/usr/lib/firmware/nvidia/gp102/sec2/image-1.bin, because No such file or directory
set_attributes: failed to set time on ./fsroot-vs/usr/lib/firmware/nvidia/gp102/sec2/image.bin, because No such file or directory
set_attributes: failed to set time on ./fsroot-vs/usr/lib/firmware/nvidia/gp102/sec2/sig-1.bin, because No such file or directory
set_attributes: failed to set time on ./fsroot-vs/usr/lib/firmware/nvidia/gp102/sec2/sig.bin, because No such file or directory
set_attributes: failed to set time on ./fsroot-vs/usr/lib/firmware/nvidia/gp102/sec2, because No such file or directory
set_attributes: failed to set time on ./fsroot-vs/usr/lib/firmware/nvidia/gp102, because No such file or directory
set_attributes: failed to set time on ./fsroot-vs/usr/lib/firmware/nvidia/gp104/acr, because No such file or directory
set_attributes: failed to set time on ./fsroot-vs/usr/lib/firmware/nvidia/gp104/gr/fecs_data.bin, because No such file or directory
set_attributes: failed to set time on ./fsroot-vs/usr/lib/firmware/nvidia/gp104/gr/fecs_inst.bin, because No such file or directory
set_attributes: failed to set time on ./fsroot-vs/usr/lib/firmware/nvidia/gp104/gr/fecs_sig.bin, because No such file or directory
set_attributes: failed to set time on ./fsroot-vs/usr/lib/firmware/nvidia/gp104/gr/gpccs_data.bin, because No such file or directory
set_attributes: failed to set time on ./fsroot-vs/usr/lib/firmware/nvidia/gp104/gr/gpccs_inst.bin, because No such file or directory
set_attributes: failed to set time on ./fsroot-vs/usr/lib/firmware/nvidia/gp104/gr/gpccs_sig.bin, because No such file or directory
set_attributes: failed to set time on ./fsroot-vs/usr/lib/firmware/nvidia/gp104/gr, because No such file or directory
set_attributes: failed to set time on ./fsroot-vs/usr/lib/firmware/nvidia/gp104/nvdec, because No such file or directory
set_attributes: failed to set time on ./fsroot-vs/usr/lib/firmware/nvidia/gp104/sec2, because No such file or directory
set_attributes: failed to set time on ./fsroot-vs/usr/lib/firmware/nvidia/gp104, because No such file or directory
set_attributes: failed to set time on ./fsroot-vs/usr/lib/firmware/nvidia/gp106/acr, because No such file or directory
set_attributes: failed to set time on ./fsroot-vs/usr/lib/firmware/nvidia/gp106/gr/fecs_data.bin, because No such file or directory
set_attributes: failed to set time on ./fsroot-vs/usr/lib/firmware/nvidia/gp106/gr/fecs_sig.bin, because No such file or directory
set_attributes: failed to set time on ./fsroot-vs/usr/lib/firmware/nvidia/gp106/gr/gpccs_data.bin, because No such file or directory
set_attributes: failed to set time on ./fsroot-vs/usr/lib/firmware/nvidia/gp106/gr/gpccs_sig.bin, because No such file or directory
set_attributes: failed to set time on ./fsroot-vs/usr/lib/firmware/nvidia/gp106/gr, because No such file or directory
set_attributes: failed to set time on ./fsroot-vs/usr/lib/firmware/nvidia/gp106/nvdec, because No such file or directory
set_attributes: failed to set time on ./fsroot-vs/usr/lib/firmware/nvidia/gp106/sec2, because No such file or directory
set_attributes: failed to set time on ./fsroot-vs/usr/lib/firmware/nvidia/gp106, because No such file or directory
set_attributes: failed to set time on ./fsroot-vs/usr/lib/firmware/nvidia/gp107/acr, because No such file or directory
set_attributes: failed to set time on ./fsroot-vs/usr/lib/firmware/nvidia/gp107/gr/fecs_bl.bin, because No such file or directory
set_attributes: failed to set time on ./fsroot-vs/usr/lib/firmware/nvidia/gp107/gr/fecs_data.bin, because No such file or directory
set_attributes: failed to set time on ./fsroot-vs/usr/lib/firmware/nvidia/gp107/gr/fecs_inst.bin, because No such file or directory
set_attributes: failed to set time on ./fsroot-vs/usr/lib/firmware/nvidia/gp107/gr/fecs_sig.bin, because No such file or directory
set_attributes: failed to set time on ./fsroot-vs/usr/lib/firmware/nvidia/gp107/gr/gpccs_bl.bin, because No such file or directory
set_attributes: failed to set time on ./fsroot-vs/usr/lib/firmware/nvidia/gp107/gr/gpccs_data.bin, because No such file or directory
set_attributes: failed to set time on ./fsroot-vs/usr/lib/firmware/nvidia/gp107/gr/gpccs_inst.bin, because No such file or directory
set_attributes: failed to set time on ./fsroot-vs/usr/lib/firmware/nvidia/gp107/gr/gpccs_sig.bin, because No such file or directory
set_attributes: failed to set time on ./fsroot-vs/usr/lib/firmware/nvidia/gp107/gr/sw_ctx.bin, because No such file or directory
set_attributes: failed to set time on ./fsroot-vs/usr/lib/firmware/nvidia/gp107/gr/sw_nonctx.bin, because No such file or directory
set_attributes: failed to set time on ./fsroot-vs/usr/lib/firmware/nvidia/gp107/gr, because No such file or directory
set_attributes: failed to set time on ./fsroot-vs/usr/lib/firmware/nvidia/gp107/nvdec, because No such file or directory
set_attributes: failed to set time on ./fsroot-vs/usr/lib/firmware/nvidia/gp107/sec2, because No such file or directory
set_attributes: failed to set time on ./fsroot-vs/usr/lib/firmware/nvidia/gp107, because No such file or directory
set_attributes: failed to set time on ./fsroot-vs/usr/lib/firmware/nvidia/gp108/acr, because No such file or directory
set_attributes: failed to set time on ./fsroot-vs/usr/lib/firmware/nvidia/gp108/gr/fecs_bl.bin, because No such file or directory
set_attributes: failed to set time on ./fsroot-vs/usr/lib/firmware/nvidia/gp108/gr/fecs_data.bin, because No such file or directory
set_attributes: failed to set time on ./fsroot-vs/usr/lib/firmware/nvidia/gp108/gr/fecs_inst.bin, because No such file or directory
set_attributes: failed to set time on ./fsroot-vs/usr/lib/firmware/nvidia/gp108/gr/fecs_sig.bin, because No such file or directory
set_attributes: failed to set time on ./fsroot-vs/usr/lib/firmware/nvidia/gp108/gr/gpccs_bl.bin, because No such file or directory
set_attributes: failed to set time on ./fsroot-vs/usr/lib/firmware/nvidia/gp108/gr/gpccs_data.bin, because No such file or directory
set_attributes: failed to set time on ./fsroot-vs/usr/lib/firmware/nvidia/gp108/gr/gpccs_inst.bin, because No such file or directory
set_attributes: failed to set time on ./fsroot-vs/usr/lib/firmware/nvidia/gp108/gr/gpccs_sig.bin, because No such file or directory
set_attributes: failed to set time on ./fsroot-vs/usr/lib/firmware/nvidia/gp108/gr/sw_bundle_init.bin, because No such file or directory
set_attributes: failed to set time on ./fsroot-vs/usr/lib/firmware/nvidia/gp108/gr/sw_ctx.bin, because No such file or directory
set_attributes: failed to set time on ./fsroot-vs/usr/lib/firmware/nvidia/gp108/gr/sw_method_init.bin, because No such file or directory
set_attributes: failed to set time on ./fsroot-vs/usr/lib/firmware/nvidia/gp108/gr/sw_nonctx.bin, because No such file or directory
set_attributes: failed to set time on ./fsroot-vs/usr/lib/firmware/nvidia/gp108/gr, because No such file or directory
set_attributes: failed to set time on ./fsroot-vs/usr/lib/firmware/nvidia/gp108/nvdec, because No such file or directory
set_attributes: failed to set time on ./fsroot-vs/usr/lib/firmware/nvidia/gp108/sec2, because No such file or directory
set_attributes: failed to set time on ./fsroot-vs/usr/lib/firmware/nvidia/gp108, because No such file or directory
[==============/ ] 16958/67776 25%
[================\ ] 19371/67776 28%
[=====================\ ] 24757/67776 36%
[=========================/ ] 29671/67776 43%
[=============================/ ] 33629/67776 49%
[================================\ ] 37204/67776 54%
[===================================| ] 41259/67776 60%
[=========================================/ ] 47491/67776 70%
[============================================/ ] 50567/67776 74%
[============================================\ ] 51510/67776 76%
[====================================================| ] 60613/67776 89%
[=======================================================| ] 63765/67776 94%
[===========================================================/] 67776/67776 100%
created 25922 files
created 3484 directories
created 2373 symlinks
created 5351 devices
created 0 fifos
created 0 sockets
created 5 hardlinks
[ FAIL LOG END ] [ target/sonic-vs.bin ]
make: *** [slave.mk:1435: target/sonic-vs.bin] Error 1
[ finished ] [ target/docker-sonic-vs.gz ]
make[1]: *** [Makefile.work:611: all] Error 2
make[1]: Leaving directory '/var/lib/jenkins/workspace/DevOps-test2/platform-vs'
make: *** [Makefile:53: all] Error 2
|