Content

상위 폴더로 이동
+++ --- Applying local submodule patches --- +++
  already applied: sonic-utilities
  already applied: sonic-swss
  already applied: sonic-swss-new
  already applied: sonic-sairedis-vslib
  already applied: sonic-sairedis-meta
  already applied: sonic-sairedis-SAI
  already applied: sonic-sairedis-SAI-apidef
  already applied: sonic-mgmt-framework
+++ --- Making all --- +++
./scripts/run_with_retry make BLDENV=bookworm -f Makefile.work all
make[1]: Entering directory '/var/lib/jenkins/workspace/DevOps-test2/platform-broadcom'
"SECURE_UPGRADE_PROD_SIGNING_TOOL": ""
~/workspace/DevOps-test2/platform-broadcom/src/sonic-build-hooks ~/workspace/DevOps-test2/platform-broadcom
make[2]: Entering directory '/var/lib/jenkins/workspace/DevOps-test2/platform-broadcom/src/sonic-build-hooks'
dpkg-deb: building package 'sonic-build-hooks' in 'buildinfo/sonic-build-hooks_1.0_all.deb'.
make[2]: Leaving directory '/var/lib/jenkins/workspace/DevOps-test2/platform-broadcom/src/sonic-build-hooks'
~/workspace/DevOps-test2/platform-broadcom
Checking sonic-slave-base image: sonic-slave-bookworm:2f250bfbb4a
Checking sonic-slave-user image: sonic-slave-bookworm-jenkins:65c8aaa3f92
SONiC Build System

Build Configuration
"CONFIGURED_PLATFORM"             : "broadcom"
"CONFIGURED_ARCH"                 : "amd64"
"SONIC_CONFIG_PRINT_DEPENDENCIES" : ""
"SONIC_BUILD_JOBS"                : "1"
"SONIC_CONFIG_MAKE_JOBS"          : "112"
"USE_NATIVE_DOCKERD_FOR_BUILD"    : ""
"SONIC_USE_DOCKER_BUILDKIT"       : ""
"USERNAME"                        : "admin"
"PASSWORD"                        : "YourPaSsWoRd"
"CHANGE_DEFAULT_PASSWORD"         : "n"
"SECURE_UPGRADE_MODE"             : "no_sign"
"SECURE_UPGRADE_DEV_SIGNING_KEY"  : ""
"SECURE_UPGRADE_SIGNING_CERT"     : ""
"SECURE_UPGRADE_PROD_SIGNING_TOOL": ""
"SECURE_UPGRADE_PROD_TOOL_ARGS"   : ""
"ONIE_IMAGE_PART_SIZE"            : ""
"SHUTDOWN_BGP_ON_START"           : ""
"ENABLE_PFCWD_ON_START"           : ""
"SONIC_BUFFER_MODEL"              : ""
"INSTALL_DEBUG_TOOLS"             : ""
"ROUTING_STACK"                   : "frr"
"FRR_USER_UID"                    : "300"
"FRR_USER_GID"                    : "300"
"ENABLE_SYNCD_RPC"                : ""
"SAITHRIFT_V2"                    : ""
"ENABLE_ORGANIZATION_EXTENSIONS"  : "y"
"HTTP_PROXY"                      : ""
"HTTPS_PROXY"                     : ""
"NO_PROXY"                        : ""
"ENABLE_ZTP"                      : ""
"INCLUDE_PDE"                     : ""
"SONIC_DEBUGGING_ON"              : ""
"SONIC_PROFILING_ON"              : ""
"KERNEL_PROCURE_METHOD"           : "build"
"BUILD_TIMESTAMP"                 : "20260917.130538"
"BUILD_LOG_TIMESTAMP"             : "none"
"SONIC_IMAGE_VERSION"             : "etri-202505.3-8610ff460"
"BLDENV"                          : "bookworm"
"VS_PREPARE_MEM"                  : "yes"
"INCLUDE_MGMT_FRAMEWORK"          : "y"
"INCLUDE_ICCPD"                   : "n"
"INCLUDE_STP"                     : "y"
"INCLUDE_SYSTEM_TELEMETRY"        : "y"
"INCLUDE_SYSTEM_GNMI"             : "y"
"INCLUDE_SYSTEM_BMP"              : "y"
"INCLUDE_SYSTEM_EVENTD"           : "y"
"ENABLE_HOST_SERVICE_ON_START"    : "y"
"INCLUDE_RESTAPI"                 : "n"
"INCLUDE_SFLOW"                   : "y"
"INCLUDE_NAT"                     : "y"
"INCLUDE_DHCP_RELAY"              : "y"
"INCLUDE_DHCP_SERVER"             : "n"
"INCLUDE_P4RT"                    : "n"
"INCLUDE_VS_DASH_SAI"             : "y"
"INCLUDE_KUBERNETES"              : "n"
"INCLUDE_KUBERNETES_MASTER"       : "n"
"INCLUDE_MACSEC"                  : "y"
"INCLUDE_MUX"                     : "y"
"INCLUDE_TEAMD"                   : "y"
"INCLUDE_DASH_HA"                 : "y"
"INCLUDE_ROUTER_ADVERTISER"       : "y"
"INCLUDE_BOOTCHART                : "y"
"ENABLE_BOOTCHART                 : "n"
"INCLUDE_FIPS"                    : "y"
"ENABLE_TRANSLIB_WRITE"           : ""
"ENABLE_NATIVE_WRITE"             : "y"
"ENABLE_DIALOUT"                  : ""
"ENABLE_AUTO_TECH_SUPPORT"        : "y"
"PDDF_SUPPORT"                    : "y"
"MULTIARCH_QEMU_ENVIRON"          : "n"
"SONIC_VERSION_CONTROL_COMPONENTS": "py2,py3,web,git,docker"
"ENABLE_ASAN"                     : "n"
"DEFAULT_CONTAINER_REGISTRY"      : "publicmirror.azurecr.io/"
"CROSS_BUILD_ENVIRON"             : "n"
"LEGACY_SONIC_MGMT_DOCKER"        : "y"
"INCLUDE_EXTERNAL_PATCHES"        : "n"
"PTF_ENV_PY_VER"                  : "py3"
"ENABLE_MULTIDB"                  : ""

mv: cannot move '/etc/apt/sources.list.d/debian.sources' to '/etc/apt/sources.list.d/debian.sources.back': Permission denied
fatal: not a git repository (or any of the parent directories): .git
"SONIC_DPKG_CACHE_METHOD"         : "none"

[ building ] [ target/debs/bookworm/libsaibcm-dev_13.2.1.7_amd64.deb ] 
[ finished ] [ target/debs/bookworm/libsaibcm-dev_13.2.1.7_amd64.deb ] 
[ building ] [ target/debs/bookworm/libnl-3-200_3.7.0-0.2+b1sonic1_amd64.deb-install ] 
[ finished ] [ target/debs/bookworm/libnl-3-200_3.7.0-0.2+b1sonic1_amd64.deb-install ] 
[ building ] [ target/debs/bookworm/libnl-3-dev_3.7.0-0.2+b1sonic1_amd64.deb-install ] 
[ finished ] [ target/debs/bookworm/libnl-3-dev_3.7.0-0.2+b1sonic1_amd64.deb-install ] 
[ building ] [ target/debs/bookworm/libnl-genl-3-200_3.7.0-0.2+b1sonic1_amd64.deb-install ] 
[ finished ] [ target/debs/bookworm/libnl-genl-3-200_3.7.0-0.2+b1sonic1_amd64.deb-install ] 
[ building ] [ target/debs/bookworm/libnl-genl-3-dev_3.7.0-0.2+b1sonic1_amd64.deb-install ] 
[ finished ] [ target/debs/bookworm/libnl-genl-3-dev_3.7.0-0.2+b1sonic1_amd64.deb-install ] 
[ building ] [ target/debs/bookworm/libnl-route-3-200_3.7.0-0.2+b1sonic1_amd64.deb-install ] 
[ finished ] [ target/debs/bookworm/libnl-route-3-200_3.7.0-0.2+b1sonic1_amd64.deb-install ] 
[ building ] [ target/debs/bookworm/libnl-route-3-dev_3.7.0-0.2+b1sonic1_amd64.deb-install ] 
[ finished ] [ target/debs/bookworm/libnl-route-3-dev_3.7.0-0.2+b1sonic1_amd64.deb-install ] 
[ building ] [ target/debs/bookworm/libnl-nf-3-200_3.7.0-0.2+b1sonic1_amd64.deb-install ] 
[ finished ] [ target/debs/bookworm/libnl-nf-3-200_3.7.0-0.2+b1sonic1_amd64.deb-install ] 
[ building ] [ target/debs/bookworm/libnl-nf-3-dev_3.7.0-0.2+b1sonic1_amd64.deb-install ] 
[ finished ] [ target/debs/bookworm/libnl-nf-3-dev_3.7.0-0.2+b1sonic1_amd64.deb-install ] 
[ building ] [ target/debs/bookworm/libnl-cli-3-200_3.7.0-0.2+b1sonic1_amd64.deb-install ] 
[ finished ] [ target/debs/bookworm/libnl-cli-3-200_3.7.0-0.2+b1sonic1_amd64.deb-install ] 
[ building ] [ target/debs/bookworm/libnl-cli-3-dev_3.7.0-0.2+b1sonic1_amd64.deb-install ] 
[ finished ] [ target/debs/bookworm/libnl-cli-3-dev_3.7.0-0.2+b1sonic1_amd64.deb-install ] 
[ building ] [ target/debs/bookworm/libyang_1.0.73_amd64.deb-install ] 
[ finished ] [ target/debs/bookworm/libyang_1.0.73_amd64.deb-install ] 
[ building ] [ target/debs/bookworm/libyang-dev_1.0.73_amd64.deb-install ] 
[ finished ] [ target/debs/bookworm/libyang-dev_1.0.73_amd64.deb-install ] 
[ building ] [ target/debs/bookworm/libyang-cpp_1.0.73_amd64.deb-install ] 
[ finished ] [ target/debs/bookworm/libyang-cpp_1.0.73_amd64.deb-install ] 
[ building ] [ target/debs/bookworm/python3-yang_1.0.73_amd64.deb-install ] 
[ finished ] [ target/debs/bookworm/python3-yang_1.0.73_amd64.deb-install ] 
[ building ] [ target/debs/bookworm/libswsscommon_1.0.0_amd64.deb-install ] 
[ finished ] [ target/debs/bookworm/libswsscommon_1.0.0_amd64.deb-install ] 
[ building ] [ target/debs/bookworm/libswsscommon-dev_1.0.0_amd64.deb-install ] 
[ finished ] [ target/debs/bookworm/libswsscommon-dev_1.0.0_amd64.deb-install ] 
[ building ] [ target/debs/bookworm/libsairedis_1.0.0_amd64.deb-install ] 
[ finished ] [ target/debs/bookworm/libsairedis_1.0.0_amd64.deb-install ] 
[ building ] [ target/debs/bookworm/libsaibcm_13.2.1.7_amd64.deb-install ] 
[ finished ] [ target/debs/bookworm/libsaibcm_13.2.1.7_amd64.deb-install ] 
[ building ] [ target/debs/bookworm/libsaibcm-dev_13.2.1.7_amd64.deb-install ] 
[ finished ] [ target/debs/bookworm/libsaibcm-dev_13.2.1.7_amd64.deb-install ] 
[ FAIL LOG START ] [ target/debs/bookworm/libsaibcm-dev_13.2.1.7_amd64.deb-install ]
Build start time: Thu Sep 17 04:06:13 UTC 2026
target/debs/bookworm/libsaibcm-dev_13.2.1.7_amd64.deb does not exist
[  FAIL LOG END  ] [ target/debs/bookworm/libsaibcm-dev_13.2.1.7_amd64.deb-install ]
make: *** [slave.mk:874: target/debs/bookworm/libsaibcm-dev_13.2.1.7_amd64.deb-install] Error 1
make[1]: *** [Makefile.work:611: all] Error 2
make[1]: Leaving directory '/var/lib/jenkins/workspace/DevOps-test2/platform-broadcom'
make: *** [Makefile:53: all] Error 2