+++ --- Applying local submodule patches --- +++
already applied: sonic-utilities
already applied: sonic-swss
already applied: sonic-swss-new
already applied: sonic-sairedis-vslib
already applied: sonic-sairedis-meta
already applied: sonic-sairedis-SAI
already applied: sonic-sairedis-SAI-apidef
already applied: sonic-mgmt-framework
+++ --- Making all --- +++
./scripts/run_with_retry make BLDENV=bookworm -f Makefile.work all
make[1]: Entering directory '/var/lib/jenkins/workspace/DevOps-test2/platform-broadcom'
"SECURE_UPGRADE_PROD_SIGNING_TOOL": ""
~/workspace/DevOps-test2/platform-broadcom/src/sonic-build-hooks ~/workspace/DevOps-test2/platform-broadcom
make[2]: Entering directory '/var/lib/jenkins/workspace/DevOps-test2/platform-broadcom/src/sonic-build-hooks'
dpkg-deb: building package 'sonic-build-hooks' in 'buildinfo/sonic-build-hooks_1.0_all.deb'.
make[2]: Leaving directory '/var/lib/jenkins/workspace/DevOps-test2/platform-broadcom/src/sonic-build-hooks'
~/workspace/DevOps-test2/platform-broadcom
Checking sonic-slave-base image: sonic-slave-bookworm:2f250bfbb4a
Checking sonic-slave-user image: sonic-slave-bookworm-jenkins:65c8aaa3f92
SONiC Build System
Build Configuration
"CONFIGURED_PLATFORM" : "broadcom"
"CONFIGURED_ARCH" : "amd64"
"SONIC_CONFIG_PRINT_DEPENDENCIES" : ""
"SONIC_BUILD_JOBS" : "1"
"SONIC_CONFIG_MAKE_JOBS" : "112"
"USE_NATIVE_DOCKERD_FOR_BUILD" : ""
"SONIC_USE_DOCKER_BUILDKIT" : ""
"USERNAME" : "admin"
"PASSWORD" : "YourPaSsWoRd"
"CHANGE_DEFAULT_PASSWORD" : "n"
"SECURE_UPGRADE_MODE" : "no_sign"
"SECURE_UPGRADE_DEV_SIGNING_KEY" : ""
"SECURE_UPGRADE_SIGNING_CERT" : ""
"SECURE_UPGRADE_PROD_SIGNING_TOOL": ""
"SECURE_UPGRADE_PROD_TOOL_ARGS" : ""
"ONIE_IMAGE_PART_SIZE" : ""
"SHUTDOWN_BGP_ON_START" : ""
"ENABLE_PFCWD_ON_START" : ""
"SONIC_BUFFER_MODEL" : ""
"INSTALL_DEBUG_TOOLS" : ""
"ROUTING_STACK" : "frr"
"FRR_USER_UID" : "300"
"FRR_USER_GID" : "300"
"ENABLE_SYNCD_RPC" : ""
"SAITHRIFT_V2" : ""
"ENABLE_ORGANIZATION_EXTENSIONS" : "y"
"HTTP_PROXY" : ""
"HTTPS_PROXY" : ""
"NO_PROXY" : ""
"ENABLE_ZTP" : ""
"INCLUDE_PDE" : ""
"SONIC_DEBUGGING_ON" : ""
"SONIC_PROFILING_ON" : ""
"KERNEL_PROCURE_METHOD" : "build"
"BUILD_TIMESTAMP" : "20260917.160054"
"BUILD_LOG_TIMESTAMP" : "none"
"SONIC_IMAGE_VERSION" : "etri-202505.4-8610ff460"
"BLDENV" : "bookworm"
"VS_PREPARE_MEM" : "yes"
"INCLUDE_MGMT_FRAMEWORK" : "y"
"INCLUDE_ICCPD" : "n"
"INCLUDE_STP" : "y"
"INCLUDE_SYSTEM_TELEMETRY" : "y"
"INCLUDE_SYSTEM_GNMI" : "y"
"INCLUDE_SYSTEM_BMP" : "y"
"INCLUDE_SYSTEM_EVENTD" : "y"
"ENABLE_HOST_SERVICE_ON_START" : "y"
"INCLUDE_RESTAPI" : "n"
"INCLUDE_SFLOW" : "y"
"INCLUDE_NAT" : "y"
"INCLUDE_DHCP_RELAY" : "y"
"INCLUDE_DHCP_SERVER" : "n"
"INCLUDE_P4RT" : "n"
"INCLUDE_VS_DASH_SAI" : "y"
"INCLUDE_KUBERNETES" : "n"
"INCLUDE_KUBERNETES_MASTER" : "n"
"INCLUDE_MACSEC" : "y"
"INCLUDE_MUX" : "y"
"INCLUDE_TEAMD" : "y"
"INCLUDE_DASH_HA" : "y"
"INCLUDE_ROUTER_ADVERTISER" : "y"
"INCLUDE_BOOTCHART : "y"
"ENABLE_BOOTCHART : "n"
"INCLUDE_FIPS" : "y"
"ENABLE_TRANSLIB_WRITE" : ""
"ENABLE_NATIVE_WRITE" : "y"
"ENABLE_DIALOUT" : ""
"ENABLE_AUTO_TECH_SUPPORT" : "y"
"PDDF_SUPPORT" : "y"
"MULTIARCH_QEMU_ENVIRON" : "n"
"SONIC_VERSION_CONTROL_COMPONENTS": "py2,py3,web,git,docker"
"ENABLE_ASAN" : "n"
"DEFAULT_CONTAINER_REGISTRY" : "publicmirror.azurecr.io/"
"CROSS_BUILD_ENVIRON" : "n"
"LEGACY_SONIC_MGMT_DOCKER" : "y"
"INCLUDE_EXTERNAL_PATCHES" : "n"
"PTF_ENV_PY_VER" : "py3"
"ENABLE_MULTIDB" : ""
mv: cannot move '/etc/apt/sources.list.d/debian.sources' to '/etc/apt/sources.list.d/debian.sources.back': Permission denied
fatal: not a git repository (or any of the parent directories): .git
"SONIC_DPKG_CACHE_METHOD" : "none"
[ building ] [ target/debs/bookworm/libyang_1.0.73_amd64.deb ]
[ finished ] [ target/debs/bookworm/libyang_1.0.73_amd64.deb ]
[ building ] [ target/debs/bookworm/libyang-cpp_1.0.73_amd64.deb ]
[ finished ] [ target/debs/bookworm/libyang-cpp_1.0.73_amd64.deb ]
[ building ] [ target/debs/bookworm/python3-yang_1.0.73_amd64.deb ]
[ finished ] [ target/debs/bookworm/python3-yang_1.0.73_amd64.deb ]
[ building ] [ target/debs/bookworm/libyang_1.0.73_amd64.deb-install ]
[ finished ] [ target/debs/bookworm/libyang_1.0.73_amd64.deb-install ]
[ building ] [ target/debs/bookworm/libyang-cpp_1.0.73_amd64.deb-install ]
[ finished ] [ target/debs/bookworm/libyang-cpp_1.0.73_amd64.deb-install ]
[ building ] [ target/debs/bookworm/python3-yang_1.0.73_amd64.deb-install ]
[ finished ] [ target/debs/bookworm/python3-yang_1.0.73_amd64.deb-install ]
[ building ] [ target/python-wheels/bookworm/sonic_yang_models-1.0-py3-none-any.whl ]
[ finished ] [ target/python-wheels/bookworm/sonic_yang_models-1.0-py3-none-any.whl ]
[ building ] [ target/python-wheels/bookworm/sonic_yang_models-1.0-py3-none-any.whl-install ]
[ finished ] [ target/python-wheels/bookworm/sonic_yang_models-1.0-py3-none-any.whl-install ]
[ building ] [ target/python-wheels/bookworm/sonic_yang_mgmt-1.0-py3-none-any.whl ]
[ finished ] [ target/python-wheels/bookworm/sonic_yang_mgmt-1.0-py3-none-any.whl ]
[ building ] [ target/debs/bookworm/libyang-dev_1.0.73_amd64.deb ]
[ finished ] [ target/debs/bookworm/libyang-dev_1.0.73_amd64.deb ]
[ building ] [ target/python-wheels/bookworm/sonic_yang_mgmt-1.0-py3-none-any.whl-install ]
[ finished ] [ target/python-wheels/bookworm/sonic_yang_mgmt-1.0-py3-none-any.whl-install ]
[ building ] [ target/debs/bookworm/libnl-3-200_3.7.0-0.2+b1sonic1_amd64.deb-install ]
[ finished ] [ target/debs/bookworm/libnl-3-200_3.7.0-0.2+b1sonic1_amd64.deb-install ]
[ building ] [ target/debs/bookworm/libnl-3-dev_3.7.0-0.2+b1sonic1_amd64.deb-install ]
[ finished ] [ target/debs/bookworm/libnl-3-dev_3.7.0-0.2+b1sonic1_amd64.deb-install ]
[ building ] [ target/debs/bookworm/libnl-genl-3-200_3.7.0-0.2+b1sonic1_amd64.deb-install ]
[ finished ] [ target/debs/bookworm/libnl-genl-3-200_3.7.0-0.2+b1sonic1_amd64.deb-install ]
[ building ] [ target/debs/bookworm/libnl-genl-3-dev_3.7.0-0.2+b1sonic1_amd64.deb-install ]
[ finished ] [ target/debs/bookworm/libnl-genl-3-dev_3.7.0-0.2+b1sonic1_amd64.deb-install ]
[ building ] [ target/debs/bookworm/libnl-route-3-200_3.7.0-0.2+b1sonic1_amd64.deb-install ]
[ finished ] [ target/debs/bookworm/libnl-route-3-200_3.7.0-0.2+b1sonic1_amd64.deb-install ]
[ building ] [ target/debs/bookworm/libnl-route-3-dev_3.7.0-0.2+b1sonic1_amd64.deb-install ]
[ finished ] [ target/debs/bookworm/libnl-route-3-dev_3.7.0-0.2+b1sonic1_amd64.deb-install ]
[ building ] [ target/debs/bookworm/libnl-nf-3-200_3.7.0-0.2+b1sonic1_amd64.deb-install ]
[ finished ] [ target/debs/bookworm/libnl-nf-3-200_3.7.0-0.2+b1sonic1_amd64.deb-install ]
[ building ] [ target/debs/bookworm/libnl-nf-3-dev_3.7.0-0.2+b1sonic1_amd64.deb-install ]
[ finished ] [ target/debs/bookworm/libnl-nf-3-dev_3.7.0-0.2+b1sonic1_amd64.deb-install ]
[ building ] [ target/debs/bookworm/libnl-cli-3-200_3.7.0-0.2+b1sonic1_amd64.deb-install ]
[ finished ] [ target/debs/bookworm/libnl-cli-3-200_3.7.0-0.2+b1sonic1_amd64.deb-install ]
[ building ] [ target/debs/bookworm/libnl-cli-3-dev_3.7.0-0.2+b1sonic1_amd64.deb-install ]
[ finished ] [ target/debs/bookworm/libnl-cli-3-dev_3.7.0-0.2+b1sonic1_amd64.deb-install ]
[ building ] [ target/debs/bookworm/libyang-dev_1.0.73_amd64.deb-install ]
[ finished ] [ target/debs/bookworm/libyang-dev_1.0.73_amd64.deb-install ]
[ building ] [ target/debs/bookworm/libswsscommon_1.0.0_amd64.deb ]
[ finished ] [ target/debs/bookworm/libswsscommon_1.0.0_amd64.deb ]
[ building ] [ target/debs/bookworm/python3-swsscommon_1.0.0_amd64.deb ]
[ finished ] [ target/debs/bookworm/python3-swsscommon_1.0.0_amd64.deb ]
[ building ] [ target/debs/bookworm/sonic-db-cli_1.0.0_amd64.deb ]
[ finished ] [ target/debs/bookworm/sonic-db-cli_1.0.0_amd64.deb ]
[ building ] [ target/debs/bookworm/libswsscommon-dev_1.0.0_amd64.deb ]
[ finished ] [ target/debs/bookworm/libswsscommon-dev_1.0.0_amd64.deb ]
[ building ] [ target/debs/bookworm/libswsscommon_1.0.0_amd64.deb-install ]
[ finished ] [ target/debs/bookworm/libswsscommon_1.0.0_amd64.deb-install ]
[ building ] [ target/debs/bookworm/libswsscommon-dev_1.0.0_amd64.deb-install ]
[ finished ] [ target/debs/bookworm/libswsscommon-dev_1.0.0_amd64.deb-install ]
[ building ] [ target/debs/bookworm/sonic-eventd_1.0.0-0_amd64.deb ]
[ finished ] [ target/debs/bookworm/sonic-eventd_1.0.0-0_amd64.deb ]
[ building ] [ target/debs/bookworm/sonic-rsyslog-plugin_1.0.0-0_amd64.deb ]
[ finished ] [ target/debs/bookworm/sonic-rsyslog-plugin_1.0.0-0_amd64.deb ]
[ building ] [ target/python-wheels/bookworm/redis_dump_load-1.1-py3-none-any.whl-install ]
[ finished ] [ target/python-wheels/bookworm/redis_dump_load-1.1-py3-none-any.whl-install ]
[ building ] [ target/python-wheels/bookworm/swsssdk-2.0.1-py3-none-any.whl-install ]
[ finished ] [ target/python-wheels/bookworm/swsssdk-2.0.1-py3-none-any.whl-install ]
[ building ] [ target/debs/bookworm/python3-swsscommon_1.0.0_amd64.deb-install ]
[ finished ] [ target/debs/bookworm/python3-swsscommon_1.0.0_amd64.deb-install ]
[ building ] [ target/python-wheels/bookworm/sonic_py_common-1.0-py3-none-any.whl ]
[ finished ] [ target/python-wheels/bookworm/sonic_py_common-1.0-py3-none-any.whl ]
[ building ] [ target/python-wheels/bookworm/sonic_py_common-1.0-py3-none-any.whl-install ]
[ finished ] [ target/python-wheels/bookworm/sonic_py_common-1.0-py3-none-any.whl-install ]
[ building ] [ target/python-wheels/bookworm/sonic_containercfgd-1.0-py3-none-any.whl ]
[ finished ] [ target/python-wheels/bookworm/sonic_containercfgd-1.0-py3-none-any.whl ]
[ building ] [ target/python-wheels/bookworm/sonic_config_engine-1.0-py3-none-any.whl ]
[ finished ] [ target/python-wheels/bookworm/sonic_config_engine-1.0-py3-none-any.whl ]
[ building ] [ target/docker-base-bookworm.gz-load ]
[ finished ] [ target/docker-base-bookworm.gz-load ]
[ building ] [ target/docker-config-engine-bookworm.gz ]
[ finished ] [ target/docker-config-engine-bookworm.gz ]
[ building ] [ target/docker-config-engine-bookworm.gz-load ]
[ finished ] [ target/docker-config-engine-bookworm.gz-load ]
[ building ] [ target/docker-auditd-watchdog.gz ]
[ finished ] [ target/docker-auditd-watchdog.gz ]
[ building ] [ target/docker-auditd.gz ]
[ finished ] [ target/docker-auditd.gz ]
[ building ] [ target/docker-bmp-watchdog.gz ]
[ finished ] [ target/docker-bmp-watchdog.gz ]
[ building ] [ target/debs/bookworm/sonic-bmp_0.1_amd64.deb ]
[ finished ] [ target/debs/bookworm/sonic-bmp_0.1_amd64.deb ]
[ building ] [ target/python-wheels/bookworm/sonic_config_engine-1.0-py3-none-any.whl-install ]
[ finished ] [ target/python-wheels/bookworm/sonic_config_engine-1.0-py3-none-any.whl-install ]
[ building ] [ target/python-wheels/bookworm/sonic_platform_common-1.0-py3-none-any.whl ]
[ finished ] [ target/python-wheels/bookworm/sonic_platform_common-1.0-py3-none-any.whl ]
[ building ] [ target/python-wheels/bookworm/sonic_platform_common-1.0-py3-none-any.whl-install ]
[ finished ] [ target/python-wheels/bookworm/sonic_platform_common-1.0-py3-none-any.whl-install ]
[ building ] [ target/python-wheels/bookworm/sonic_utilities-1.2-py3-none-any.whl ]
[ finished ] [ target/python-wheels/bookworm/sonic_utilities-1.2-py3-none-any.whl ]
[ building ] [ target/python-wheels/bookworm/sonic_utilities-1.2-py3-none-any.whl-install ]
[ finished ] [ target/python-wheels/bookworm/sonic_utilities-1.2-py3-none-any.whl-install ]
[ building ] [ target/python-wheels/bookworm/sonic_bmpcfgd_services-1.0-py3-none-any.whl ]
[ finished ] [ target/python-wheels/bookworm/sonic_bmpcfgd_services-1.0-py3-none-any.whl ]
[ building ] [ target/debs/bookworm/sonic-bmp_0.1_amd64.deb-install ]
[ finished ] [ target/debs/bookworm/sonic-bmp_0.1_amd64.deb-install ]
[ building ] [ target/docker-sonic-bmp.gz ]
[ finished ] [ target/docker-sonic-bmp.gz ]
[ building ] [ target/debs/bookworm/dash-ha_1.0.0_amd64.deb ]
[ finished ] [ target/debs/bookworm/dash-ha_1.0.0_amd64.deb ]
[ building ] [ target/debs/bookworm/libsairedis_1.0.0_amd64.deb ]
[ finished ] [ target/debs/bookworm/libsairedis_1.0.0_amd64.deb ]
[ building ] [ target/debs/bookworm/libsairedis-dev_1.0.0_amd64.deb ]
[ finished ] [ target/debs/bookworm/libsairedis-dev_1.0.0_amd64.deb ]
[ building ] [ target/debs/bookworm/libsaimetadata-dev_1.0.0_amd64.deb ]
[ finished ] [ target/debs/bookworm/libsaimetadata-dev_1.0.0_amd64.deb ]
[ building ] [ target/debs/bookworm/libsaivs-dev_1.0.0_amd64.deb ]
[ finished ] [ target/debs/bookworm/libsaivs-dev_1.0.0_amd64.deb ]
[ building ] [ target/debs/bookworm/stp_1.0.0_amd64.deb ]
[ finished ] [ target/debs/bookworm/stp_1.0.0_amd64.deb ]
[ building ] [ target/debs/bookworm/libsairedis_1.0.0_amd64.deb-install ]
[ finished ] [ target/debs/bookworm/libsairedis_1.0.0_amd64.deb-install ]
[ building ] [ target/debs/bookworm/libsairedis-dev_1.0.0_amd64.deb-install ]
[ finished ] [ target/debs/bookworm/libsairedis-dev_1.0.0_amd64.deb-install ]
[ building ] [ target/debs/bookworm/libsaimetadata_1.0.0_amd64.deb-install ]
[ finished ] [ target/debs/bookworm/libsaimetadata_1.0.0_amd64.deb-install ]
[ building ] [ target/debs/bookworm/libsaimetadata-dev_1.0.0_amd64.deb-install ]
[ finished ] [ target/debs/bookworm/libsaimetadata-dev_1.0.0_amd64.deb-install ]
[ building ] [ target/debs/bookworm/libteam5_1.31-1_amd64.deb-install ]
[ finished ] [ target/debs/bookworm/libteam5_1.31-1_amd64.deb-install ]
[ building ] [ target/debs/bookworm/libteamdctl0_1.31-1_amd64.deb-install ]
[ finished ] [ target/debs/bookworm/libteamdctl0_1.31-1_amd64.deb-install ]
[ building ] [ target/debs/bookworm/libteam-dev_1.31-1_amd64.deb-install ]
[ finished ] [ target/debs/bookworm/libteam-dev_1.31-1_amd64.deb-install ]
[ building ] [ target/debs/bookworm/libteam-utils_1.31-1_amd64.deb-install ]
[ finished ] [ target/debs/bookworm/libteam-utils_1.31-1_amd64.deb-install ]
[ building ] [ target/debs/bookworm/libsaivs_1.0.0_amd64.deb-install ]
[ finished ] [ target/debs/bookworm/libsaivs_1.0.0_amd64.deb-install ]
[ building ] [ target/debs/bookworm/libsaivs-dev_1.0.0_amd64.deb-install ]
dpkg-query: package 'libsaibcm-dev' is not installed and no information is available
Use dpkg --info (= dpkg-deb --info) to examine archive files.
[ finished ] [ target/debs/bookworm/libsaivs-dev_1.0.0_amd64.deb-install ]
[ building ] [ target/debs/bookworm/stp_1.0.0_amd64.deb-install ]
[ finished ] [ target/debs/bookworm/stp_1.0.0_amd64.deb-install ]
[ building ] [ target/debs/bookworm/libdashapi_1.0.0_amd64.deb-install ]
[ finished ] [ target/debs/bookworm/libdashapi_1.0.0_amd64.deb-install ]
[ building ] [ target/debs/bookworm/swss_1.0.0_amd64.deb ]
[ finished ] [ target/debs/bookworm/swss_1.0.0_amd64.deb ]
[ building ] [ target/docker-swss-layer-bookworm.gz ]
[ finished ] [ target/docker-swss-layer-bookworm.gz ]
[ building ] [ target/docker-swss-layer-bookworm.gz-load ]
[ finished ] [ target/docker-swss-layer-bookworm.gz-load ]
[ building ] [ target/docker-dash-ha.gz ]
[ finished ] [ target/docker-dash-ha.gz ]
[ building ] [ target/docker-database.gz ]
[ finished ] [ target/docker-database.gz ]
[ building ] [ target/docker-eventd.gz ]
[ finished ] [ target/docker-eventd.gz ]
[ building ] [ target/debs/bookworm/frr-snmp_10.3-sonic-0_amd64.deb ]
[ finished ] [ target/debs/bookworm/frr-snmp_10.3-sonic-0_amd64.deb ]
[ building ] [ target/python-wheels/bookworm/sonic_bgpcfgd-1.0-py3-none-any.whl ]
[ finished ] [ target/python-wheels/bookworm/sonic_bgpcfgd-1.0-py3-none-any.whl ]
[ building ] [ target/python-wheels/bookworm/sonic_frr_mgmt_framework-1.0-py3-none-any.whl ]
[ finished ] [ target/python-wheels/bookworm/sonic_frr_mgmt_framework-1.0-py3-none-any.whl ]
[ building ] [ target/docker-fpm-frr.gz ]
[ finished ] [ target/docker-fpm-frr.gz ]
[ building ] [ target/docker-gnmi-watchdog.gz ]
[ finished ] [ target/docker-gnmi-watchdog.gz ]
[ building ] [ target/debs/bookworm/sonic-mgmt-common_1.0.0_amd64.deb ]
[ finished ] [ target/debs/bookworm/sonic-mgmt-common_1.0.0_amd64.deb ]
[ building ] [ target/debs/bookworm/sonic-mgmt-common_1.0.0_amd64.deb-install ]
[ finished ] [ target/debs/bookworm/sonic-mgmt-common_1.0.0_amd64.deb-install ]
[ building ] [ target/debs/bookworm/sonic-mgmt-common-codegen_1.0.0_amd64.deb-install ]
[ finished ] [ target/debs/bookworm/sonic-mgmt-common-codegen_1.0.0_amd64.deb-install ]
[ building ] [ target/debs/bookworm/sonic-gnmi_0.1_amd64.deb ]
[ finished ] [ target/debs/bookworm/sonic-gnmi_0.1_amd64.deb ]
[ building ] [ target/docker-sonic-gnmi.gz ]
[ finished ] [ target/docker-sonic-gnmi.gz ]
[ building ] [ target/python-wheels/bookworm/sonic_d-2.0.0-py3-none-any.whl ]
[ finished ] [ target/python-wheels/bookworm/sonic_d-2.0.0-py3-none-any.whl ]
[ building ] [ target/docker-lldp.gz ]
[ finished ] [ target/docker-lldp.gz ]
[ building ] [ target/debs/bookworm/sonic-linkmgrd_1.0.0-1_amd64.deb ]
[ finished ] [ target/debs/bookworm/sonic-linkmgrd_1.0.0-1_amd64.deb ]
[ building ] [ target/docker-mux.gz ]
[ finished ] [ target/docker-mux.gz ]
[ building ] [ target/docker-nat.gz ]
[ finished ] [ target/docker-nat.gz ]
[ building ] [ target/docker-orchagent.gz ]
[ finished ] [ target/docker-orchagent.gz ]
[ building ] [ target/python-wheels/bookworm/sonic_ledd-1.1-py3-none-any.whl ]
[ finished ] [ target/python-wheels/bookworm/sonic_ledd-1.1-py3-none-any.whl ]
[ building ] [ target/python-wheels/bookworm/sonic_pcied-1.0-py3-none-any.whl ]
[ finished ] [ target/python-wheels/bookworm/sonic_pcied-1.0-py3-none-any.whl ]
[ building ] [ target/python-wheels/bookworm/sonic_psud-1.0-py3-none-any.whl ]
[ finished ] [ target/python-wheels/bookworm/sonic_psud-1.0-py3-none-any.whl ]
[ building ] [ target/python-wheels/bookworm/sonic_syseepromd-1.0-py3-none-any.whl ]
[ finished ] [ target/python-wheels/bookworm/sonic_syseepromd-1.0-py3-none-any.whl ]
[ building ] [ target/python-wheels/bookworm/sonic_thermalctld-1.0-py3-none-any.whl ]
[ finished ] [ target/python-wheels/bookworm/sonic_thermalctld-1.0-py3-none-any.whl ]
[ building ] [ target/python-wheels/bookworm/sonic_sensormond-1.0-py3-none-any.whl ]
[ finished ] [ target/python-wheels/bookworm/sonic_sensormond-1.0-py3-none-any.whl ]
[ building ] [ target/python-wheels/bookworm/sonic_xcvrd-1.0-py3-none-any.whl ]
[ finished ] [ target/python-wheels/bookworm/sonic_xcvrd-1.0-py3-none-any.whl ]
[ building ] [ target/python-wheels/bookworm/sonic_ycabled-1.0-py3-none-any.whl ]
[ finished ] [ target/python-wheels/bookworm/sonic_ycabled-1.0-py3-none-any.whl ]
[ building ] [ target/python-wheels/bookworm/sonic_chassisd-1.0-py3-none-any.whl ]
[ finished ] [ target/python-wheels/bookworm/sonic_chassisd-1.0-py3-none-any.whl ]
[ building ] [ target/python-wheels/bookworm/sonic_stormond-1.0-py3-none-any.whl ]
[ finished ] [ target/python-wheels/bookworm/sonic_stormond-1.0-py3-none-any.whl ]
[ building ] [ target/docker-platform-monitor.gz ]
[ finished ] [ target/docker-platform-monitor.gz ]
[ building ] [ target/docker-ptp.gz ]
[ finished ] [ target/docker-ptp.gz ]
[ building ] [ target/docker-router-advertiser.gz ]
[ finished ] [ target/docker-router-advertiser.gz ]
[ building ] [ target/docker-sflow.gz ]
[ finished ] [ target/docker-sflow.gz ]
[ building ] [ target/python-wheels/bookworm/asyncsnmp-2.1.0-py3-none-any.whl ]
[ finished ] [ target/python-wheels/bookworm/asyncsnmp-2.1.0-py3-none-any.whl ]
[ building ] [ target/docker-snmp.gz ]
[ finished ] [ target/docker-snmp.gz ]
[ building ] [ target/debs/bookworm/sonic-mgmt-framework_1.0-01_amd64.deb ]
[ finished ] [ target/debs/bookworm/sonic-mgmt-framework_1.0-01_amd64.deb ]
[ building ] [ target/docker-sonic-mgmt-framework.gz ]
[ finished ] [ target/docker-sonic-mgmt-framework.gz ]
[ building ] [ target/docker-stp.gz ]
[ finished ] [ target/docker-stp.gz ]
[ building ] [ target/debs/bookworm/sysmgr_1.0.0_amd64.deb ]
[ finished ] [ target/debs/bookworm/sysmgr_1.0.0_amd64.deb ]
[ building ] [ target/docker-sysmgr.gz ]
[ finished ] [ target/docker-sysmgr.gz ]
[ building ] [ target/docker-teamd.gz ]
[ finished ] [ target/docker-teamd.gz ]
[ building ] [ target/docker-sonic-gnmi.gz-load ]
[ finished ] [ target/docker-sonic-gnmi.gz-load ]
[ building ] [ target/docker-sonic-telemetry.gz ]
[ finished ] [ target/docker-sonic-telemetry.gz ]
[ building ] [ target/debs/bookworm/libsaibcm_13.2.1.7_amd64.deb-install ]
[ finished ] [ target/debs/bookworm/libsaibcm_13.2.1.7_amd64.deb-install ]
[ building ] [ target/debs/bookworm/libsaibcm-dev_13.2.1.7_amd64.deb-install ]
dpkg-query: package 'libsaivs-dev' is not installed and no information is available
Use dpkg --info (= dpkg-deb --info) to examine archive files.
[ finished ] [ target/debs/bookworm/libsaibcm-dev_13.2.1.7_amd64.deb-install ]
[ building ] [ target/debs/bookworm/syncd_1.0.0_amd64.deb ]
[ finished ] [ target/debs/bookworm/syncd_1.0.0_amd64.deb ]
[ building ] [ target/docker-syncd-brcm.gz ]
[ finished ] [ target/docker-syncd-brcm.gz ]
[ building ] [ target/docker-syncd-brcm-dnx.gz ]
[ finished ] [ target/docker-syncd-brcm-dnx.gz ]
[ building ] [ target/docker-gbsyncd-credo.gz ]
[ finished ] [ target/docker-gbsyncd-credo.gz ]
[ building ] [ target/docker-gbsyncd-broncos.gz ]
[ finished ] [ target/docker-gbsyncd-broncos.gz ]
[ building ] [ target/debs/bookworm/sonic-dhcpmon_1.0.0-0_amd64.deb ]
[ finished ] [ target/debs/bookworm/sonic-dhcpmon_1.0.0-0_amd64.deb ]
[ building ] [ target/debs/bookworm/sonic-dhcp6relay_1.0.0-0_amd64.deb ]
[ finished ] [ target/debs/bookworm/sonic-dhcp6relay_1.0.0-0_amd64.deb ]
[ building ] [ target/python-wheels/bookworm/sonic_dhcp_utilities-1.0-py3-none-any.whl ]
[ finished ] [ target/python-wheels/bookworm/sonic_dhcp_utilities-1.0-py3-none-any.whl ]
[ building ] [ target/docker-dhcp-relay.gz ]
/sonic/dockers/docker-dhcp-relay/cli-plugin-tests /sonic
/sonic
[ finished ] [ target/docker-dhcp-relay.gz ]
[ building ] [ target/debs/bookworm/wpasupplicant_2.9.0-14_amd64.deb ]
[ finished ] [ target/debs/bookworm/wpasupplicant_2.9.0-14_amd64.deb ]
[ building ] [ target/docker-macsec.gz ]
/sonic/dockers/docker-macsec/cli-plugin-tests /sonic
/sonic
[ finished ] [ target/docker-macsec.gz ]
[ building ] [ target/python-wheels/bookworm/sonic_ctrmgrd-1.0.0-py3-none-any.whl ]
[ finished ] [ target/python-wheels/bookworm/sonic_ctrmgrd-1.0.0-py3-none-any.whl ]
[ building ] [ target/python-wheels/bookworm/system_health-1.0-py3-none-any.whl ]
[ finished ] [ target/python-wheels/bookworm/system_health-1.0-py3-none-any.whl ]
[ building ] [ target/python-wheels/bookworm/sonic_host_services-1.0-py3-none-any.whl ]
[ finished ] [ target/python-wheels/bookworm/sonic_host_services-1.0-py3-none-any.whl ]
[ building ] [ target/sonic-broadcom.bin__broadcom-dnx__rfs.squashfs ]
[ finished ] [ target/sonic-broadcom.bin__broadcom-dnx__rfs.squashfs ]
[ building ] [ target/sonic-broadcom.bin__broadcom__rfs.squashfs ]
[ finished ] [ target/sonic-broadcom.bin__broadcom__rfs.squashfs ]
basename: missing operand
Try 'basename --help' for more information.
[ building ] [ target/sonic-broadcom.bin ]
[ finished ] [ target/sonic-broadcom.bin ]
basename: missing operand
Try 'basename --help' for more information.
[ building ] [ target/sonic-aboot-broadcom.swi ]
[ finished ] [ target/sonic-aboot-broadcom.swi ]
[ FAIL LOG START ] [ target/sonic-aboot-broadcom.swi ]
Build start time: Thu Sep 17 09:51:22 UTC 2026
++ '[' -f .arch ']'
++ cat .arch
+ CONFIGURED_ARCH=amd64
+ DOCKER_VERSION=5:24.0.2-1~debian.12~bookworm
+ CONTAINERD_IO_VERSION=1.6.21-1
+ LINUX_KERNEL_VERSION=6.1.0-29-2
+ FILESYSTEM_ROOT=./fsroot
+ PLATFORM_DIR=platform
+ HOSTNAME=sonic
+ DEFAULT_USERINFO='Default admin user,,,'
+ BUILD_TOOL_PATH=src/sonic-build-hooks/buildinfo
+ TRUSTED_GPG_DIR=src/sonic-build-hooks/buildinfo/trusted.gpg.d
+ . ./onie-image.conf
++ : 32768
++ : x86_64
++ : broadcom
++ ONIEIMAGE_VERSION=r0
++ FILESYSTEM_ROOT=./fsroot-broadcom
++ FILESYSTEM_SQUASHFS=fs.squashfs
++ INSTALLER_PAYLOAD=fs.zip
++ FILESYSTEM_DOCKERFS=dockerfs.tar.gz
++ DOCKERFS_DIR=docker
++ DOCKER_RAMFS_SIZE=3500M
++ OUTPUT_ONIE_IMAGE=target/sonic-broadcom.bin
++ OUTPUT_RAW_IMAGE=target/sonic-broadcom.raw
++ RAW_IMAGE_DISK_SIZE=1700
++ OUTPUT_KVM_IMAGE=target/sonic-broadcom.img
++ KVM_IMAGE_DISK_SIZE=16
++ OUTPUT_ABOOT_IMAGE=target/sonic-aboot-broadcom.swi
++ ABOOT_BOOT_IMAGE=.sonic-boot.swi
++ OUTPUT_KVM_4ASIC_IMAGE=target/sonic-4asic-broadcom.img
++ OUTPUT_KVM_6ASIC_IMAGE=target/sonic-6asic-broadcom.img
++ OUTPUT_DSC_IMAGE=target/sonic-broadcom.tar
+ '[' -n 32768 ']'
+ '[' -n fs.zip ']'
+ '[' -n fs.squashfs ']'
+ '[' aboot = aboot ']'
+ TARGET_BOOTLOADER=aboot
+ [[ y != y ]]
+ [[ n == y ]]
+ [[ y == y ]]
+ echo '[INFO] RFS build: second stage'
[INFO] RFS build: second stage
+ sudo mount proc /proc -t proc
+ sudo fuser -vm ./fsroot-broadcom
USER PID ACCESS COMMAND
/sonic/fsroot-broadcom:
root kernel mount /usr/sbin/docker-init
jenkins 1 ..ce. docker-init
jenkins 7 ..c.. bash
jenkins 8 ..c.. make
root 31847 ....m dockerd
root 31926 ....m containerd
jenkins 665531 ..c.. bash
jenkins 665640 ..c.. build_debian.sh
jenkins 665641 ..c.. process_log.sh
root 665649 ..c.. sudo
+ sudo rm -rf ./fsroot-broadcom
rm: cannot remove './fsroot-broadcom/var/lib/docker': Device or resource busy
[ FAIL LOG END ] [ target/sonic-aboot-broadcom.swi ]
make: *** [slave.mk:1435: target/sonic-aboot-broadcom.swi] Error 1
make[1]: *** [Makefile.work:611: all] Error 2
make[1]: Leaving directory '/var/lib/jenkins/workspace/DevOps-test2/platform-broadcom'
make: *** [Makefile:53: all] Error 2
|