+++ --- Applying local submodule patches --- +++
already applied: sonic-utilities
already applied: sonic-swss
already applied: sonic-swss-new
already applied: sonic-sairedis-vslib
already applied: sonic-sairedis-meta
already applied: sonic-sairedis-SAI
already applied: sonic-sairedis-SAI-apidef
already applied: sonic-mgmt-framework
+++ --- Making all --- +++
./scripts/run_with_retry make BLDENV=bookworm -f Makefile.work all
make[1]: Entering directory '/var/lib/jenkins/workspace/DevOps-test2/platform-broadcom'
"SECURE_UPGRADE_PROD_SIGNING_TOOL": ""
~/workspace/DevOps-test2/platform-broadcom/src/sonic-build-hooks ~/workspace/DevOps-test2/platform-broadcom
make[2]: Entering directory '/var/lib/jenkins/workspace/DevOps-test2/platform-broadcom/src/sonic-build-hooks'
dpkg-deb: building package 'sonic-build-hooks' in 'buildinfo/sonic-build-hooks_1.0_all.deb'.
make[2]: Leaving directory '/var/lib/jenkins/workspace/DevOps-test2/platform-broadcom/src/sonic-build-hooks'
~/workspace/DevOps-test2/platform-broadcom
Checking sonic-slave-base image: sonic-slave-bookworm:2f250bfbb4a
Checking sonic-slave-user image: sonic-slave-bookworm-jenkins:65c8aaa3f92
SONiC Build System
Build Configuration
"CONFIGURED_PLATFORM" : "broadcom"
"CONFIGURED_ARCH" : "amd64"
"SONIC_CONFIG_PRINT_DEPENDENCIES" : ""
"SONIC_BUILD_JOBS" : "1"
"SONIC_CONFIG_MAKE_JOBS" : "112"
"USE_NATIVE_DOCKERD_FOR_BUILD" : ""
"SONIC_USE_DOCKER_BUILDKIT" : ""
"USERNAME" : "admin"
"PASSWORD" : "YourPaSsWoRd"
"CHANGE_DEFAULT_PASSWORD" : "n"
"SECURE_UPGRADE_MODE" : "no_sign"
"SECURE_UPGRADE_DEV_SIGNING_KEY" : ""
"SECURE_UPGRADE_SIGNING_CERT" : ""
"SECURE_UPGRADE_PROD_SIGNING_TOOL": ""
"SECURE_UPGRADE_PROD_TOOL_ARGS" : ""
"ONIE_IMAGE_PART_SIZE" : ""
"SHUTDOWN_BGP_ON_START" : ""
"ENABLE_PFCWD_ON_START" : ""
"SONIC_BUFFER_MODEL" : ""
"INSTALL_DEBUG_TOOLS" : ""
"ROUTING_STACK" : "frr"
"FRR_USER_UID" : "300"
"FRR_USER_GID" : "300"
"ENABLE_SYNCD_RPC" : ""
"SAITHRIFT_V2" : ""
"ENABLE_ORGANIZATION_EXTENSIONS" : "y"
"HTTP_PROXY" : ""
"HTTPS_PROXY" : ""
"NO_PROXY" : ""
"ENABLE_ZTP" : ""
"INCLUDE_PDE" : ""
"SONIC_DEBUGGING_ON" : ""
"SONIC_PROFILING_ON" : ""
"KERNEL_PROCURE_METHOD" : "build"
"BUILD_TIMESTAMP" : "20260922.122413"
"BUILD_LOG_TIMESTAMP" : "none"
"SONIC_IMAGE_VERSION" : "etri-202505.9-8610ff460"
"BLDENV" : "bookworm"
"VS_PREPARE_MEM" : "yes"
"INCLUDE_MGMT_FRAMEWORK" : "y"
"INCLUDE_ICCPD" : "n"
"INCLUDE_STP" : "y"
"INCLUDE_SYSTEM_TELEMETRY" : "y"
"INCLUDE_SYSTEM_GNMI" : "y"
"INCLUDE_SYSTEM_BMP" : "y"
"INCLUDE_SYSTEM_EVENTD" : "y"
"ENABLE_HOST_SERVICE_ON_START" : "y"
"INCLUDE_RESTAPI" : "n"
"INCLUDE_SFLOW" : "y"
"INCLUDE_NAT" : "y"
"INCLUDE_DHCP_RELAY" : "y"
"INCLUDE_DHCP_SERVER" : "n"
"INCLUDE_P4RT" : "n"
"INCLUDE_VS_DASH_SAI" : "y"
"INCLUDE_KUBERNETES" : "n"
"INCLUDE_KUBERNETES_MASTER" : "n"
"INCLUDE_MACSEC" : "y"
"INCLUDE_MUX" : "y"
"INCLUDE_TEAMD" : "y"
"INCLUDE_DASH_HA" : "y"
"INCLUDE_ROUTER_ADVERTISER" : "y"
"INCLUDE_BOOTCHART : "y"
"ENABLE_BOOTCHART : "n"
"INCLUDE_FIPS" : "y"
"ENABLE_TRANSLIB_WRITE" : ""
"ENABLE_NATIVE_WRITE" : "y"
"ENABLE_DIALOUT" : ""
"ENABLE_AUTO_TECH_SUPPORT" : "y"
"PDDF_SUPPORT" : "y"
"MULTIARCH_QEMU_ENVIRON" : "n"
"SONIC_VERSION_CONTROL_COMPONENTS": "py2,py3,web,git,docker"
"ENABLE_ASAN" : "n"
"DEFAULT_CONTAINER_REGISTRY" : "publicmirror.azurecr.io/"
"CROSS_BUILD_ENVIRON" : "n"
"LEGACY_SONIC_MGMT_DOCKER" : "y"
"INCLUDE_EXTERNAL_PATCHES" : "n"
"PTF_ENV_PY_VER" : "py3"
"ENABLE_MULTIDB" : ""
mv: cannot move '/etc/apt/sources.list.d/debian.sources' to '/etc/apt/sources.list.d/debian.sources.back': Permission denied
fatal: not a git repository (or any of the parent directories): .git
"SONIC_DPKG_CACHE_METHOD" : "none"
[ building ] [ target/python-wheels/bookworm/redis_dump_load-1.1-py3-none-any.whl-install ]
[ finished ] [ target/python-wheels/bookworm/redis_dump_load-1.1-py3-none-any.whl-install ]
[ building ] [ target/python-wheels/bookworm/swsssdk-2.0.1-py3-none-any.whl-install ]
[ finished ] [ target/python-wheels/bookworm/swsssdk-2.0.1-py3-none-any.whl-install ]
[ building ] [ target/python-wheels/bookworm/sonic_py_common-1.0-py3-none-any.whl-install ]
[ finished ] [ target/python-wheels/bookworm/sonic_py_common-1.0-py3-none-any.whl-install ]
[ building ] [ target/python-wheels/bookworm/sonic_yang_models-1.0-py3-none-any.whl-install ]
[ finished ] [ target/python-wheels/bookworm/sonic_yang_models-1.0-py3-none-any.whl-install ]
[ building ] [ target/python-wheels/bookworm/sonic_yang_mgmt-1.0-py3-none-any.whl-install ]
[ finished ] [ target/python-wheels/bookworm/sonic_yang_mgmt-1.0-py3-none-any.whl-install ]
[ building ] [ target/python-wheels/bookworm/sonic_config_engine-1.0-py3-none-any.whl-install ]
[ finished ] [ target/python-wheels/bookworm/sonic_config_engine-1.0-py3-none-any.whl-install ]
[ building ] [ target/python-wheels/bookworm/sonic_platform_common-1.0-py3-none-any.whl-install ]
[ finished ] [ target/python-wheels/bookworm/sonic_platform_common-1.0-py3-none-any.whl-install ]
[ building ] [ target/python-wheels/bookworm/sonic_utilities-1.2-py3-none-any.whl-install ]
[ finished ] [ target/python-wheels/bookworm/sonic_utilities-1.2-py3-none-any.whl-install ]
[ building ] [ target/debs/bookworm/libnl-3-200_3.7.0-0.2+b1sonic1_amd64.deb-install ]
[ finished ] [ target/debs/bookworm/libnl-3-200_3.7.0-0.2+b1sonic1_amd64.deb-install ]
[ building ] [ target/debs/bookworm/libnl-3-dev_3.7.0-0.2+b1sonic1_amd64.deb-install ]
[ finished ] [ target/debs/bookworm/libnl-3-dev_3.7.0-0.2+b1sonic1_amd64.deb-install ]
[ building ] [ target/debs/bookworm/libnl-genl-3-200_3.7.0-0.2+b1sonic1_amd64.deb-install ]
[ finished ] [ target/debs/bookworm/libnl-genl-3-200_3.7.0-0.2+b1sonic1_amd64.deb-install ]
[ building ] [ target/debs/bookworm/libnl-genl-3-dev_3.7.0-0.2+b1sonic1_amd64.deb-install ]
[ finished ] [ target/debs/bookworm/libnl-genl-3-dev_3.7.0-0.2+b1sonic1_amd64.deb-install ]
[ building ] [ target/debs/bookworm/libnl-route-3-200_3.7.0-0.2+b1sonic1_amd64.deb-install ]
[ finished ] [ target/debs/bookworm/libnl-route-3-200_3.7.0-0.2+b1sonic1_amd64.deb-install ]
[ building ] [ target/debs/bookworm/libnl-route-3-dev_3.7.0-0.2+b1sonic1_amd64.deb-install ]
[ finished ] [ target/debs/bookworm/libnl-route-3-dev_3.7.0-0.2+b1sonic1_amd64.deb-install ]
[ building ] [ target/debs/bookworm/libnl-nf-3-200_3.7.0-0.2+b1sonic1_amd64.deb-install ]
[ finished ] [ target/debs/bookworm/libnl-nf-3-200_3.7.0-0.2+b1sonic1_amd64.deb-install ]
[ building ] [ target/debs/bookworm/libnl-nf-3-dev_3.7.0-0.2+b1sonic1_amd64.deb-install ]
[ finished ] [ target/debs/bookworm/libnl-nf-3-dev_3.7.0-0.2+b1sonic1_amd64.deb-install ]
[ building ] [ target/debs/bookworm/libnl-cli-3-200_3.7.0-0.2+b1sonic1_amd64.deb-install ]
[ finished ] [ target/debs/bookworm/libnl-cli-3-200_3.7.0-0.2+b1sonic1_amd64.deb-install ]
[ building ] [ target/debs/bookworm/libnl-cli-3-dev_3.7.0-0.2+b1sonic1_amd64.deb-install ]
[ finished ] [ target/debs/bookworm/libnl-cli-3-dev_3.7.0-0.2+b1sonic1_amd64.deb-install ]
[ building ] [ target/debs/bookworm/libyang_1.0.73_amd64.deb-install ]
[ finished ] [ target/debs/bookworm/libyang_1.0.73_amd64.deb-install ]
[ building ] [ target/debs/bookworm/libyang-dev_1.0.73_amd64.deb-install ]
[ finished ] [ target/debs/bookworm/libyang-dev_1.0.73_amd64.deb-install ]
[ building ] [ target/debs/bookworm/libyang-cpp_1.0.73_amd64.deb-install ]
[ finished ] [ target/debs/bookworm/libyang-cpp_1.0.73_amd64.deb-install ]
[ building ] [ target/debs/bookworm/python3-yang_1.0.73_amd64.deb-install ]
[ finished ] [ target/debs/bookworm/python3-yang_1.0.73_amd64.deb-install ]
[ building ] [ target/debs/bookworm/libswsscommon_1.0.0_amd64.deb-install ]
[ finished ] [ target/debs/bookworm/libswsscommon_1.0.0_amd64.deb-install ]
[ building ] [ target/debs/bookworm/python3-swsscommon_1.0.0_amd64.deb-install ]
[ finished ] [ target/debs/bookworm/python3-swsscommon_1.0.0_amd64.deb-install ]
[ building ] [ target/python-wheels/bookworm/sonic_bmpcfgd_services-1.0-py3-none-any.whl ]
[ finished ] [ target/python-wheels/bookworm/sonic_bmpcfgd_services-1.0-py3-none-any.whl ]
[ building ] [ target/docker-config-engine-bookworm.gz-load ]
[ finished ] [ target/docker-config-engine-bookworm.gz-load ]
[ building ] [ target/debs/bookworm/libswsscommon-dev_1.0.0_amd64.deb-install ]
[ finished ] [ target/debs/bookworm/libswsscommon-dev_1.0.0_amd64.deb-install ]
[ building ] [ target/debs/bookworm/sonic-bmp_0.1_amd64.deb-install ]
[ finished ] [ target/debs/bookworm/sonic-bmp_0.1_amd64.deb-install ]
[ building ] [ target/docker-sonic-bmp.gz ]
[ finished ] [ target/docker-sonic-bmp.gz ]
[ building ] [ target/debs/bookworm/libsairedis_1.0.0_amd64.deb-install ]
[ finished ] [ target/debs/bookworm/libsairedis_1.0.0_amd64.deb-install ]
[ building ] [ target/debs/bookworm/libsairedis-dev_1.0.0_amd64.deb-install ]
[ finished ] [ target/debs/bookworm/libsairedis-dev_1.0.0_amd64.deb-install ]
[ building ] [ target/debs/bookworm/libsaimetadata_1.0.0_amd64.deb-install ]
[ finished ] [ target/debs/bookworm/libsaimetadata_1.0.0_amd64.deb-install ]
[ building ] [ target/debs/bookworm/libsaimetadata-dev_1.0.0_amd64.deb-install ]
[ finished ] [ target/debs/bookworm/libsaimetadata-dev_1.0.0_amd64.deb-install ]
[ building ] [ target/debs/bookworm/libteam5_1.31-1_amd64.deb-install ]
[ finished ] [ target/debs/bookworm/libteam5_1.31-1_amd64.deb-install ]
[ building ] [ target/debs/bookworm/libteamdctl0_1.31-1_amd64.deb-install ]
[ finished ] [ target/debs/bookworm/libteamdctl0_1.31-1_amd64.deb-install ]
[ building ] [ target/debs/bookworm/libteam-dev_1.31-1_amd64.deb-install ]
[ finished ] [ target/debs/bookworm/libteam-dev_1.31-1_amd64.deb-install ]
[ building ] [ target/debs/bookworm/libteam-utils_1.31-1_amd64.deb-install ]
[ finished ] [ target/debs/bookworm/libteam-utils_1.31-1_amd64.deb-install ]
[ building ] [ target/debs/bookworm/libsaivs_1.0.0_amd64.deb-install ]
[ finished ] [ target/debs/bookworm/libsaivs_1.0.0_amd64.deb-install ]
[ building ] [ target/debs/bookworm/libsaivs-dev_1.0.0_amd64.deb-install ]
dpkg-query: package 'libsaibcm-dev' is not installed and no information is available
Use dpkg --info (= dpkg-deb --info) to examine archive files.
[ finished ] [ target/debs/bookworm/libsaivs-dev_1.0.0_amd64.deb-install ]
[ building ] [ target/debs/bookworm/stp_1.0.0_amd64.deb-install ]
[ finished ] [ target/debs/bookworm/stp_1.0.0_amd64.deb-install ]
[ building ] [ target/debs/bookworm/libdashapi_1.0.0_amd64.deb-install ]
[ finished ] [ target/debs/bookworm/libdashapi_1.0.0_amd64.deb-install ]
[ building ] [ target/debs/bookworm/swss_1.0.0_amd64.deb ]
[ finished ] [ target/debs/bookworm/swss_1.0.0_amd64.deb ]
[ building ] [ target/docker-swss-layer-bookworm.gz ]
[ finished ] [ target/docker-swss-layer-bookworm.gz ]
[ building ] [ target/docker-swss-layer-bookworm.gz-load ]
[ finished ] [ target/docker-swss-layer-bookworm.gz-load ]
[ building ] [ target/docker-dash-ha.gz ]
[ finished ] [ target/docker-dash-ha.gz ]
[ building ] [ target/docker-eventd.gz ]
[ finished ] [ target/docker-eventd.gz ]
[ building ] [ target/docker-fpm-frr.gz ]
[ finished ] [ target/docker-fpm-frr.gz ]
[ building ] [ target/docker-sonic-gnmi.gz ]
[ finished ] [ target/docker-sonic-gnmi.gz ]
[ building ] [ target/docker-lldp.gz ]
[ finished ] [ target/docker-lldp.gz ]
[ building ] [ target/docker-mux.gz ]
[ finished ] [ target/docker-mux.gz ]
[ building ] [ target/docker-nat.gz ]
[ finished ] [ target/docker-nat.gz ]
[ building ] [ target/docker-orchagent.gz ]
[ finished ] [ target/docker-orchagent.gz ]
[ building ] [ target/docker-platform-monitor.gz ]
[ finished ] [ target/docker-platform-monitor.gz ]
[ building ] [ target/docker-sflow.gz ]
[ finished ] [ target/docker-sflow.gz ]
[ building ] [ target/docker-snmp.gz ]
[ finished ] [ target/docker-snmp.gz ]
[ building ] [ target/docker-stp.gz ]
[ finished ] [ target/docker-stp.gz ]
[ building ] [ target/docker-teamd.gz ]
[ finished ] [ target/docker-teamd.gz ]
[ building ] [ target/docker-sonic-gnmi.gz-load ]
[ finished ] [ target/docker-sonic-gnmi.gz-load ]
[ building ] [ target/docker-sonic-telemetry.gz ]
[ finished ] [ target/docker-sonic-telemetry.gz ]
[ building ] [ target/docker-syncd-brcm-dnx.gz ]
[ finished ] [ target/docker-syncd-brcm-dnx.gz ]
[ building ] [ target/docker-gbsyncd-credo.gz ]
[ finished ] [ target/docker-gbsyncd-credo.gz ]
[ building ] [ target/docker-gbsyncd-broncos.gz ]
[ finished ] [ target/docker-gbsyncd-broncos.gz ]
[ building ] [ target/docker-dhcp-relay.gz ]
/sonic/dockers/docker-dhcp-relay/cli-plugin-tests /sonic
/sonic
[ finished ] [ target/docker-dhcp-relay.gz ]
[ building ] [ target/docker-macsec.gz ]
/sonic/dockers/docker-macsec/cli-plugin-tests /sonic
/sonic
[ finished ] [ target/docker-macsec.gz ]
[ building ] [ target/python-wheels/bookworm/sonic_host_services-1.0-py3-none-any.whl ]
[ finished ] [ target/python-wheels/bookworm/sonic_host_services-1.0-py3-none-any.whl ]
[ building ] [ target/sonic-broadcom.bin__broadcom__rfs.squashfs ]
[ finished ] [ target/sonic-broadcom.bin__broadcom__rfs.squashfs ]
basename: missing operand
Try 'basename --help' for more information.
[ building ] [ target/sonic-broadcom.bin ]
[ finished ] [ target/sonic-broadcom.bin ]
[ FAIL LOG START ] [ target/sonic-broadcom.bin ]
Build start time: Tue Sep 22 03:57:19 UTC 2026
++ '[' -f .arch ']'
++ cat .arch
+ CONFIGURED_ARCH=amd64
+ DOCKER_VERSION=5:24.0.2-1~debian.12~bookworm
+ CONTAINERD_IO_VERSION=1.6.21-1
+ LINUX_KERNEL_VERSION=6.1.0-29-2
+ FILESYSTEM_ROOT=./fsroot
+ PLATFORM_DIR=platform
+ HOSTNAME=sonic
+ DEFAULT_USERINFO='Default admin user,,,'
+ BUILD_TOOL_PATH=src/sonic-build-hooks/buildinfo
+ TRUSTED_GPG_DIR=src/sonic-build-hooks/buildinfo/trusted.gpg.d
+ . ./onie-image.conf
++ : 32768
++ : x86_64
++ : broadcom
++ ONIEIMAGE_VERSION=r0
++ FILESYSTEM_ROOT=./fsroot-broadcom
++ FILESYSTEM_SQUASHFS=fs.squashfs
++ INSTALLER_PAYLOAD=fs.zip
++ FILESYSTEM_DOCKERFS=dockerfs.tar.gz
++ DOCKERFS_DIR=docker
++ DOCKER_RAMFS_SIZE=3500M
++ OUTPUT_ONIE_IMAGE=target/sonic-broadcom.bin
++ OUTPUT_RAW_IMAGE=target/sonic-broadcom.raw
++ RAW_IMAGE_DISK_SIZE=1700
++ OUTPUT_KVM_IMAGE=target/sonic-broadcom.img
++ KVM_IMAGE_DISK_SIZE=16
++ OUTPUT_ABOOT_IMAGE=target/sonic-aboot-broadcom.swi
++ ABOOT_BOOT_IMAGE=.sonic-boot.swi
++ OUTPUT_KVM_4ASIC_IMAGE=target/sonic-4asic-broadcom.img
++ OUTPUT_KVM_6ASIC_IMAGE=target/sonic-6asic-broadcom.img
++ OUTPUT_DSC_IMAGE=target/sonic-broadcom.tar
+ '[' -n 32768 ']'
+ '[' -n fs.zip ']'
+ '[' -n fs.squashfs ']'
+ '[' onie = aboot ']'
+ [[ y != y ]]
+ [[ n == y ]]
+ [[ y == y ]]
+ echo '[INFO] RFS build: second stage'
[INFO] RFS build: second stage
+ sudo mount proc /proc -t proc
+ sudo fuser -vm ./fsroot-broadcom
USER PID ACCESS COMMAND
/sonic/fsroot-broadcom:
root kernel mount /usr/sbin/docker-init
jenkins 1 ..ce. docker-init
jenkins 7 ..c.. bash
jenkins 8 ..c.. make
root 9847 ....m dockerd
root 9929 ....m containerd
jenkins 258643 ..c.. bash
jenkins 258752 ..c.. build_debian.sh
jenkins 258753 ..c.. process_log.sh
root 258761 ..c.. sudo
+ sudo rm -rf ./fsroot-broadcom
+ sudo unsquashfs -d ./fsroot-broadcom target/sonic-broadcom.bin__broadcom__rfs.squashfs
Parallel unsquashfs: Using 112 processors
33651 inodes (34124 blocks) to write
[======/ ] 7439/67775 10%
[==========- ] 12595/67775 18%
[==================\ ] 20748/67775 30%
[============================| ] 33073/67775 48%
[========================================/ ] 46667/67775 68%
[===========================================================/] 67775/67775 100%
created 25922 files
created 3484 directories
created 2373 symlinks
created 5351 devices
created 0 fifos
created 0 sockets
created 5 hardlinks
+ pushd ./fsroot-broadcom
/sonic/fsroot-broadcom /sonic
+ sudo mount --bind . .
+ popd
/sonic
+ trap_push 'sudo LANG=C chroot $FILESYSTEM_ROOT umount /proc || true'
+ local oldcmd=true
+ local 'newcmd=sudo LANG=C chroot $FILESYSTEM_ROOT umount /proc || true; true'
+ trap -- 'sudo LANG=C chroot $FILESYSTEM_ROOT umount /proc || true; true' EXIT INT TERM HUP
+ _trap_push 'sudo LANG=C chroot $FILESYSTEM_ROOT umount /proc || true; true'
+ local 'next=sudo LANG=C chroot $FILESYSTEM_ROOT umount /proc || true; true'
++ echo 'sudo LANG=C chroot $FILESYSTEM_ROOT umount /proc || true; true'
++ sed -e 's/'\''/'\''\\'\'''\''/g'
+ eval 'trap_push() {
local oldcmd='\''sudo LANG=C chroot $FILESYSTEM_ROOT umount /proc || true; true'\''
local newcmd="$1; $oldcmd"
trap -- "$newcmd" EXIT INT TERM HUP
_trap_push "$newcmd"
}'
+ sudo LANG=C chroot ./fsroot-broadcom mount proc /proc -t proc
+ export build_version=etri-202505.9-8610ff460
+ build_version=etri-202505.9-8610ff460
++ cat ./fsroot-broadcom/etc/debian_version
+ export debian_version=12.15
+ debian_version=12.15
+ export kernel_version=6.1.0-29-2-amd64
+ kernel_version=6.1.0-29-2-amd64
+ export asic_type=broadcom
+ asic_type=broadcom
+ export asic_subtype=broadcom
+ asic_subtype=broadcom
++ git rev-parse --short HEAD
+ export commit_id=8610ff460
+ commit_id=8610ff460
++ git rev-parse --abbrev-ref HEAD
+ export branch=etri-202505
+ branch=etri-202505
++ '[' -f ./fsroot-broadcom/etc/sonic/sonic_release ']'
++ cat ./fsroot-broadcom/etc/sonic/sonic_release
+ export release=202505
+ release=202505
++ date -u
+ export 'build_date=Tue Sep 22 03:57:42 UTC 2026'
+ build_date='Tue Sep 22 03:57:42 UTC 2026'
+ export build_number=9
+ build_number=9
+ export built_by=jenkins@w2sh
+ built_by=jenkins@w2sh
+ export sonic_os_version=12
+ sonic_os_version=12
+ j2 files/build_templates/sonic_version.yml.j2
+ sudo tee ./fsroot-broadcom/etc/sonic/sonic_version.yml
---
build_version: 'etri-202505.9-8610ff460'
debian_version: '12.15'
kernel_version: '6.1.0-29-2-amd64'
asic_type: broadcom
asic_subtype: 'broadcom'
commit_id: '8610ff460'
branch: 'etri-202505'
release: '202505'
build_date: Tue Sep 22 03:57:42 UTC 2026
build_number: 9
built_by: jenkins@w2sh
libswsscommon: 1.0.0
sonic_utilities: 1.2
sonic_os_version: 12
secure_boot_image: 'no'
+ '[' -f sonic_debian_extension.sh ']'
+ ./sonic_debian_extension.sh ./fsroot-broadcom platform bookworm
++ '[' -f .arch ']'
++ cat .arch
+ CONFIGURED_ARCH=amd64
++ '[' -f .platform ']'
++ cat .platform
+ CONFIGURED_PLATFORM=broadcom
+ . functions.sh
++ _trap_push true
++ local next=true
+++ echo true
+++ sed -e 's/'\''/'\''\\'\'''\''/g'
++ eval 'trap_push() {
local oldcmd='\''true'\''
local newcmd="$1; $oldcmd"
trap -- "$newcmd" EXIT INT TERM HUP
_trap_push "$newcmd"
}'
+ BUILD_SCRIPTS_DIR=files/build_scripts
+ BUILD_TEMPLATES=files/build_templates
+ IMAGE_CONFIGS=files/image_config
+ SCRIPTS_DIR=files/scripts
+ DOCKER_SCRIPTS_DIR=files/docker
+ DOCKER_CTL_DIR=/usr/lib/docker/
+ DOCKER_CTL_SCRIPT=/usr/lib/docker//docker.sh
+ FILESYSTEM_ROOT_USR=./fsroot-broadcom/usr
+ FILESYSTEM_ROOT_USR_LIB=./fsroot-broadcom/usr/lib/
+ FILESYSTEM_ROOT_USR_LIB_SYSTEMD_SYSTEM=./fsroot-broadcom/usr/lib//systemd/system
+ FILESYSTEM_ROOT_USR_LIB_SYSTEMD_NETWORK=./fsroot-broadcom/usr/lib//systemd/network
+ FILESYSTEM_ROOT_USR_SHARE=./fsroot-broadcom/usr/share
+ FILESYSTEM_ROOT_USR_SHARE_SONIC=./fsroot-broadcom/usr/share/sonic
+ FILESYSTEM_ROOT_USR_SHARE_SONIC_SCRIPTS=./fsroot-broadcom/usr/share/sonic/scripts
+ FILESYSTEM_ROOT_USR_SHARE_SONIC_TEMPLATES=./fsroot-broadcom/usr/share/sonic/templates
+ FILESYSTEM_ROOT_USR_SHARE_SONIC_FIRMWARE=./fsroot-broadcom/usr/share/sonic/firmware
+ FILESYSTEM_ROOT_ETC=./fsroot-broadcom/etc
+ FILESYSTEM_ROOT_ETC_SONIC=./fsroot-broadcom/etc/sonic
+ GENERATED_SERVICE_FILE=./fsroot-broadcom/etc/sonic/generated_services.conf
+ trap_push clean_sys
+ local oldcmd=true
+ local 'newcmd=clean_sys; true'
+ trap -- 'clean_sys; true' EXIT INT TERM HUP
+ _trap_push 'clean_sys; true'
+ local 'next=clean_sys; true'
++ echo 'clean_sys; true'
++ sed -e 's/'\''/'\''\\'\'''\''/g'
+ eval 'trap_push() {
local oldcmd='\''clean_sys; true'\''
local newcmd="$1; $oldcmd"
trap -- "$newcmd" EXIT INT TERM HUP
_trap_push "$newcmd"
}'
+ sudo LANG=C chroot ./fsroot-broadcom mount sysfs /sys -t sysfs
+ sudo bash -c 'echo "DOCKER_OPTS="--storage-driver=overlay2"" >> ./fsroot-broadcom/etc/default/docker'
+ sudo mkdir -p ./fsroot-broadcom//usr/lib/docker/
+ sudo cp files/docker/docker ./fsroot-broadcom//usr/lib/docker//docker.sh
+ [[ n == y ]]
+ [[ n == y ]]
+ sudo chroot ./fsroot-broadcom /usr/lib/docker//docker.sh start
Starting Docker: docker.
+ sudo LANG=C DEBIAN_FRONTEND=noninteractive chroot ./fsroot-broadcom apt-get update
Hit:1 https://download.docker.com/linux/debian bookworm InRelease
Hit:2 http://debian-archive.trafficmanager.net/debian bookworm InRelease
Hit:3 http://debian-archive.trafficmanager.net/debian bookworm-updates InRelease
Hit:4 http://debian-archive.trafficmanager.net/debian bookworm-backports InRelease
Hit:5 http://debian-archive.trafficmanager.net/debian-security bookworm-security InRelease
Reading package lists...
+ sudo LANG=C DEBIAN_FRONTEND=noninteractive chroot ./fsroot-broadcom apt-get -y install efitools
Reading package lists...
Building dependency tree...
Reading state information...
The following additional packages will be installed:
sbsigntool
The following NEW packages will be installed:
efitools sbsigntool
0 upgraded, 2 newly installed, 0 to remove and 5 not upgraded.
Need to get 204 kB of archives.
After this operation, 1480 kB of additional disk space will be used.
Get:1 http://debian-archive.trafficmanager.net/debian bookworm/main amd64 sbsigntool amd64 0.9.4-3.1 [68.4 kB]
Get:2 http://debian-archive.trafficmanager.net/debian bookworm/main amd64 efitools amd64 1.9.2-3 [135 kB]
debconf: delaying package configuration, since apt-utils is not installed
Fetched 204 kB in 2s (128 kB/s)
E: Can not write log (Is /dev/pts mounted?) - posix_openpt (19: No such device)
Selecting previously unselected package sbsigntool.
(Reading database ... 26714 files and directories currently installed.)
Preparing to unpack .../sbsigntool_0.9.4-3.1_amd64.deb ...
Unpacking sbsigntool (0.9.4-3.1) ...
Selecting previously unselected package efitools.
Preparing to unpack .../efitools_1.9.2-3_amd64.deb ...
Unpacking efitools (1.9.2-3) ...
Setting up sbsigntool (0.9.4-3.1) ...
Setting up efitools (1.9.2-3) ...
+ sudo LANG=C DEBIAN_FRONTEND=noninteractive chroot ./fsroot-broadcom apt-get -y install mokutil
Reading package lists...
Building dependency tree...
Reading state information...
The following NEW packages will be installed:
mokutil
0 upgraded, 1 newly installed, 0 to remove and 5 not upgraded.
Need to get 26.9 kB of archives.
After this operation, 81.9 kB of additional disk space will be used.
Get:1 http://debian-archive.trafficmanager.net/debian bookworm/main amd64 mokutil amd64 0.6.0-2 [26.9 kB]
debconf: delaying package configuration, since apt-utils is not installed
Fetched 26.9 kB in 6s (4249 B/s)
E: Can not write log (Is /dev/pts mounted?) - posix_openpt (19: No such device)
Selecting previously unselected package mokutil.
(Reading database ... 26767 files and directories currently installed.)
Preparing to unpack .../mokutil_0.6.0-2_amd64.deb ...
Unpacking mokutil (0.6.0-2) ...
Setting up mokutil (0.6.0-2) ...
+ sudo cp files/image_config/environment/environment ./fsroot-broadcom/etc/
+ sudo cp files/image_config/environment/motd ./fsroot-broadcom/etc/
+ sudo cp files/image_config/environment/logout_message ./fsroot-broadcom/etc/
+ sudo mkdir -p ./fsroot-broadcom/etc/sonic/
+ sudo mkdir -p ./fsroot-broadcom/etc/modprobe.d/
+ sudo mkdir -p ./fsroot-broadcom/var/cache/sonic/
+ sudo mkdir -p ./fsroot-broadcom/usr/share/sonic/templates/
+ sudo mkdir -p ./fsroot-broadcom/usr/share/sonic/firmware/
+ sudo mkdir -p ./fsroot-broadcom/usr/lib//systemd/system
+ install_deb_package target/debs/bookworm/sonic-nettools_0.0.1-0_amd64.deb
+ deb_packages=target/debs/bookworm/sonic-nettools_0.0.1-0_amd64.deb
+ [[ -z target/debs/bookworm/sonic-nettools_0.0.1-0_amd64.deb ]]
+ sudo cp target/debs/bookworm/sonic-nettools_0.0.1-0_amd64.deb ./fsroot-broadcom/
++ basename -a target/debs/bookworm/sonic-nettools_0.0.1-0_amd64.deb
+ basename_deb_packages=sonic-nettools_0.0.1-0_amd64.deb
+ sudo LANG=C DEBIAN_FRONTEND=noninteractive chroot ./fsroot-broadcom dpkg -i sonic-nettools_0.0.1-0_amd64.deb
Selecting previously unselected package sonic-nettools.
(Reading database ... 26773 files and directories currently installed.)
Preparing to unpack sonic-nettools_0.0.1-0_amd64.deb ...
Unpacking sonic-nettools (0.0.1-0) ...
Setting up sonic-nettools (0.0.1-0) ...
+ cd ./fsroot-broadcom
+ sudo rm -f sonic-nettools_0.0.1-0_amd64.deb
+ sudo setcap cap_net_raw=+ep ./fsroot-broadcom/usr/bin/wol
+ sudo bash -c 'echo "d /dev/shm/monit/ 0755 root root" > ./fsroot-broadcom/etc/tmpfiles.d/tmpfs-monit.conf'
+ sudo bash -c 'echo "d /dev/shm/logrotate/ 0755 root root" > ./fsroot-broadcom/etc/tmpfiles.d/tmpfs-logrotate.conf'
+ install_deb_package target/debs/bookworm/ifupdown2_3.0.0-1_all.deb
+ deb_packages=target/debs/bookworm/ifupdown2_3.0.0-1_all.deb
+ [[ -z target/debs/bookworm/ifupdown2_3.0.0-1_all.deb ]]
+ sudo cp target/debs/bookworm/ifupdown2_3.0.0-1_all.deb ./fsroot-broadcom/
++ basename -a target/debs/bookworm/ifupdown2_3.0.0-1_all.deb
+ basename_deb_packages=ifupdown2_3.0.0-1_all.deb
+ sudo LANG=C DEBIAN_FRONTEND=noninteractive chroot ./fsroot-broadcom dpkg -i ifupdown2_3.0.0-1_all.deb
Selecting previously unselected package ifupdown2.
(Reading database ... 26776 files and directories currently installed.)
Preparing to unpack ifupdown2_3.0.0-1_all.deb ...
Unpacking ifupdown2 (3.0.0-1) ...
Setting up ifupdown2 (3.0.0-1) ...
ifupdown2.postinst: Warning: No 'iface lo' definition found in /etc/network/interfaces
ifupdown2.postinst: Warning: No 'auto lo' statement found in /etc/network/interfaces
Created symlink /etc/systemd/system/basic.target.wants/networking.service -> /lib/systemd/system/networking.service.
Created symlink /etc/systemd/system/network.target.wants/networking.service -> /lib/systemd/system/networking.service.
Created symlink /etc/systemd/system/shutdown.target.wants/networking.service -> /lib/systemd/system/networking.service.
+ cd ./fsroot-broadcom
+ sudo rm -f ifupdown2_3.0.0-1_all.deb
+ sudo LANG=C DEBIAN_FRONTEND=noninteractive chroot ./fsroot-broadcom apt-get -y install python3-dev
Reading package lists...
Building dependency tree...
Reading state information...
The following additional packages will be installed:
libc-dev-bin libc6-dev libcrypt-dev libexpat1-dev libjs-jquery
libjs-sphinxdoc libjs-underscore libnsl-dev libpython3-dev libpython3.11-dev
libtirpc-dev linux-libc-dev python3.11-dev rpcsvc-proto zlib1g-dev
Suggested packages:
glibc-doc manpages-dev
Recommended packages:
manpages manpages-dev libc-devtools javascript-common
The following NEW packages will be installed:
libc-dev-bin libc6-dev libcrypt-dev libexpat1-dev libjs-jquery
libjs-sphinxdoc libjs-underscore libnsl-dev libpython3-dev libpython3.11-dev
libtirpc-dev linux-libc-dev python3-dev python3.11-dev rpcsvc-proto
zlib1g-dev
0 upgraded, 16 newly installed, 0 to remove and 6 not upgraded.
Need to get 11.8 MB of archives.
After this operation, 52.0 MB of additional disk space will be used.
Get:1 http://debian-archive.trafficmanager.net/debian bookworm/main amd64 libc-dev-bin amd64 2.36-9+deb12u14 [48.1 kB]
Get:2 http://debian-archive.trafficmanager.net/debian-security bookworm-security/main amd64 linux-libc-dev amd64 6.1.187-1 [2357 kB]
Get:3 http://debian-archive.trafficmanager.net/debian bookworm/main amd64 libcrypt-dev amd64 1:4.4.33-2 [118 kB]
Get:4 http://debian-archive.trafficmanager.net/debian bookworm/main amd64 libtirpc-dev amd64 1.3.3+ds-1 [191 kB]
Get:5 http://debian-archive.trafficmanager.net/debian bookworm/main amd64 libnsl-dev amd64 1.3.0-2 [66.4 kB]
Get:6 http://debian-archive.trafficmanager.net/debian bookworm/main amd64 rpcsvc-proto amd64 1.4.3-1 [63.3 kB]
Get:7 http://debian-archive.trafficmanager.net/debian bookworm/main amd64 libc6-dev amd64 2.36-9+deb12u14 [1904 kB]
Get:8 http://debian-archive.trafficmanager.net/debian-security bookworm-security/main amd64 libexpat1-dev amd64 2.5.0-1+deb12u3 [155 kB]
Get:9 http://debian-archive.trafficmanager.net/debian bookworm/main amd64 libjs-jquery all 3.6.1+dfsg+~3.5.14-1 [326 kB]
Get:10 http://debian-archive.trafficmanager.net/debian bookworm/main amd64 libjs-underscore all 1.13.4~dfsg+~1.11.4-3 [116 kB]
Get:11 http://debian-archive.trafficmanager.net/debian bookworm/main amd64 libjs-sphinxdoc all 5.3.0-4 [130 kB]
Get:12 http://debian-archive.trafficmanager.net/debian bookworm/main amd64 zlib1g-dev amd64 1:1.2.13.dfsg-1 [916 kB]
Get:13 http://debian-archive.trafficmanager.net/debian bookworm/main amd64 libpython3.11-dev amd64 3.11.2-6+deb12u8 [4738 kB]
Get:14 http://debian-archive.trafficmanager.net/debian bookworm/main amd64 libpython3-dev amd64 3.11.2-1+b1 [9572 B]
Get:15 http://debian-archive.trafficmanager.net/debian bookworm/main amd64 python3.11-dev amd64 3.11.2-6+deb12u8 [619 kB]
Get:16 http://debian-archive.trafficmanager.net/debian bookworm/main amd64 python3-dev amd64 3.11.2-1+b1 [26.2 kB]
debconf: delaying package configuration, since apt-utils is not installed
Fetched 11.8 MB in 3s (3872 kB/s)
E: Can not write log (Is /dev/pts mounted?) - posix_openpt (19: No such device)
Selecting previously unselected package libc-dev-bin.
(Reading database ... 26895 files and directories currently installed.)
Preparing to unpack .../00-libc-dev-bin_2.36-9+deb12u14_amd64.deb ...
Unpacking libc-dev-bin (2.36-9+deb12u14) ...
Selecting previously unselected package linux-libc-dev:amd64.
Preparing to unpack .../01-linux-libc-dev_6.1.187-1_amd64.deb ...
Unpacking linux-libc-dev:amd64 (6.1.187-1) ...
Selecting previously unselected package libcrypt-dev:amd64.
Preparing to unpack .../02-libcrypt-dev_1%3a4.4.33-2_amd64.deb ...
Unpacking libcrypt-dev:amd64 (1:4.4.33-2) ...
Selecting previously unselected package libtirpc-dev:amd64.
Preparing to unpack .../03-libtirpc-dev_1.3.3+ds-1_amd64.deb ...
Unpacking libtirpc-dev:amd64 (1.3.3+ds-1) ...
Selecting previously unselected package libnsl-dev:amd64.
Preparing to unpack .../04-libnsl-dev_1.3.0-2_amd64.deb ...
Unpacking libnsl-dev:amd64 (1.3.0-2) ...
Selecting previously unselected package rpcsvc-proto.
Preparing to unpack .../05-rpcsvc-proto_1.4.3-1_amd64.deb ...
Unpacking rpcsvc-proto (1.4.3-1) ...
Selecting previously unselected package libc6-dev:amd64.
Preparing to unpack .../06-libc6-dev_2.36-9+deb12u14_amd64.deb ...
Unpacking libc6-dev:amd64 (2.36-9+deb12u14) ...
Selecting previously unselected package libexpat1-dev:amd64.
Preparing to unpack .../07-libexpat1-dev_2.5.0-1+deb12u3_amd64.deb ...
Unpacking libexpat1-dev:amd64 (2.5.0-1+deb12u3) ...
Selecting previously unselected package libjs-jquery.
Preparing to unpack .../08-libjs-jquery_3.6.1+dfsg+~3.5.14-1_all.deb ...
Unpacking libjs-jquery (3.6.1+dfsg+~3.5.14-1) ...
Selecting previously unselected package libjs-underscore.
Preparing to unpack .../09-libjs-underscore_1.13.4~dfsg+~1.11.4-3_all.deb ...
Unpacking libjs-underscore (1.13.4~dfsg+~1.11.4-3) ...
Selecting previously unselected package libjs-sphinxdoc.
Preparing to unpack .../10-libjs-sphinxdoc_5.3.0-4_all.deb ...
Unpacking libjs-sphinxdoc (5.3.0-4) ...
Selecting previously unselected package zlib1g-dev:amd64.
Preparing to unpack .../11-zlib1g-dev_1%3a1.2.13.dfsg-1_amd64.deb ...
Unpacking zlib1g-dev:amd64 (1:1.2.13.dfsg-1) ...
Selecting previously unselected package libpython3.11-dev:amd64.
Preparing to unpack .../12-libpython3.11-dev_3.11.2-6+deb12u8_amd64.deb ...
Unpacking libpython3.11-dev:amd64 (3.11.2-6+deb12u8) ...
Selecting previously unselected package libpython3-dev:amd64.
Preparing to unpack .../13-libpython3-dev_3.11.2-1+b1_amd64.deb ...
Unpacking libpython3-dev:amd64 (3.11.2-1+b1) ...
Selecting previously unselected package python3.11-dev.
Preparing to unpack .../14-python3.11-dev_3.11.2-6+deb12u8_amd64.deb ...
Unpacking python3.11-dev (3.11.2-6+deb12u8) ...
Selecting previously unselected package python3-dev.
Preparing to unpack .../15-python3-dev_3.11.2-1+b1_amd64.deb ...
Unpacking python3-dev (3.11.2-1+b1) ...
Setting up linux-libc-dev:amd64 (6.1.187-1) ...
Setting up libtirpc-dev:amd64 (1.3.3+ds-1) ...
Setting up rpcsvc-proto (1.4.3-1) ...
Setting up libnsl-dev:amd64 (1.3.0-2) ...
Setting up libcrypt-dev:amd64 (1:4.4.33-2) ...
Setting up libjs-jquery (3.6.1+dfsg+~3.5.14-1) ...
Setting up libc-dev-bin (2.36-9+deb12u14) ...
Setting up libjs-underscore (1.13.4~dfsg+~1.11.4-3) ...
Setting up libjs-sphinxdoc (5.3.0-4) ...
Setting up libc6-dev:amd64 (2.36-9+deb12u14) ...
Setting up libexpat1-dev:amd64 (2.5.0-1+deb12u3) ...
Setting up zlib1g-dev:amd64 (1:1.2.13.dfsg-1) ...
Setting up libpython3.11-dev:amd64 (3.11.2-6+deb12u8) ...
Setting up libpython3-dev:amd64 (3.11.2-1+b1) ...
Setting up python3.11-dev (3.11.2-6+deb12u8) ...
Setting up python3-dev (3.11.2-1+b1) ...
+ sudo LANG=C DEBIAN_FRONTEND=noninteractive chroot ./fsroot-broadcom apt-get -y install j2cli
Reading package lists...
Building dependency tree...
Reading state information...
The following additional packages will be installed:
python3-jinja2 python3-markupsafe python3-yaml
Suggested packages:
python-jinja2-doc
Recommended packages:
python3-babel
The following NEW packages will be installed:
j2cli python3-jinja2 python3-markupsafe python3-yaml
0 upgraded, 4 newly installed, 0 to remove and 6 not upgraded.
Need to get 268 kB of archives.
After this operation, 1167 kB of additional disk space will be used.
Get:1 http://debian-archive.trafficmanager.net/debian bookworm/main amd64 python3-markupsafe amd64 2.1.2-1+b1 [13.2 kB]
Get:2 http://debian-archive.trafficmanager.net/debian bookworm/main amd64 python3-jinja2 all 3.1.2-1+deb12u3 [120 kB]
Get:3 http://debian-archive.trafficmanager.net/debian bookworm/main amd64 python3-yaml amd64 6.0-3+b2 [119 kB]
Get:4 http://debian-archive.trafficmanager.net/debian bookworm/main amd64 j2cli all 0.3.12b-4 [15.2 kB]
debconf: delaying package configuration, since apt-utils is not installed
Fetched 268 kB in 5s (53.2 kB/s)
E: Can not write log (Is /dev/pts mounted?) - posix_openpt (19: No such device)
Selecting previously unselected package python3-markupsafe.
(Reading database ... 28942 files and directories currently installed.)
Preparing to unpack .../python3-markupsafe_2.1.2-1+b1_amd64.deb ...
Unpacking python3-markupsafe (2.1.2-1+b1) ...
Selecting previously unselected package python3-jinja2.
Preparing to unpack .../python3-jinja2_3.1.2-1+deb12u3_all.deb ...
Unpacking python3-jinja2 (3.1.2-1+deb12u3) ...
Selecting previously unselected package python3-yaml.
Preparing to unpack .../python3-yaml_6.0-3+b2_amd64.deb ...
Unpacking python3-yaml (6.0-3+b2) ...
Selecting previously unselected package j2cli.
Preparing to unpack .../j2cli_0.3.12b-4_all.deb ...
Unpacking j2cli (0.3.12b-4) ...
Setting up python3-yaml (6.0-3+b2) ...
Setting up python3-markupsafe (2.1.2-1+b1) ...
Setting up python3-jinja2 (3.1.2-1+deb12u3) ...
Setting up j2cli (0.3.12b-4) ...
+ sudo https_proxy= LANG=C chroot ./fsroot-broadcom pip3 install redis==3.5.3
Collecting redis==3.5.3
Downloading redis-3.5.3-py2.py3-none-any.whl (72 kB)
━━━━━━━━━━━━━━━━━━━━━━━━━━━━━━━━━━━━━━━ 72.1/72.1 kB 276.1 kB/s eta 0:00:00
Installing collected packages: redis
Successfully installed redis-3.5.3
WARNING: Running pip as the 'root' user can result in broken permissions and conflicting behaviour with the system package manager. It is recommended to use a virtual environment instead: https://pip.pypa.io/warnings/venv
+ install_pip_package target/python-wheels/bookworm/redis_dump_load-1.1-py3-none-any.whl
+ pip_wheel=target/python-wheels/bookworm/redis_dump_load-1.1-py3-none-any.whl
+ [[ -z target/python-wheels/bookworm/redis_dump_load-1.1-py3-none-any.whl ]]
+ sudo cp target/python-wheels/bookworm/redis_dump_load-1.1-py3-none-any.whl ./fsroot-broadcom/
++ basename -a target/python-wheels/bookworm/redis_dump_load-1.1-py3-none-any.whl
+ basename_pip_wheel=redis_dump_load-1.1-py3-none-any.whl
+ sudo https_proxy= LANG=C chroot ./fsroot-broadcom pip3 install redis_dump_load-1.1-py3-none-any.whl
Processing /redis_dump_load-1.1-py3-none-any.whl
Requirement already satisfied: redis in /usr/local/lib/python3.11/dist-packages (from redis-dump-load==1.1) (3.5.3)
Installing collected packages: redis-dump-load
Successfully installed redis-dump-load-1.1
WARNING: Running pip as the 'root' user can result in broken permissions and conflicting behaviour with the system package manager. It is recommended to use a virtual environment instead: https://pip.pypa.io/warnings/venv
+ cd ./fsroot-broadcom
+ sudo rm -f redis_dump_load-1.1-py3-none-any.whl
+ sudo https_proxy= LANG=C chroot ./fsroot-broadcom pip3 install psutil
Collecting psutil
Downloading psutil-7.0.0-cp36-abi3-manylinux_2_12_x86_64.manylinux2010_x86_64.manylinux_2_17_x86_64.manylinux2014_x86_64.whl (277 kB)
━━━━━━━━━━━━━━━━━━━━━━━━━━━━━━━━━━━━━━━ 278.0/278.0 kB 9.3 MB/s eta 0:00:00
Installing collected packages: psutil
Successfully installed psutil-7.0.0
WARNING: Running pip as the 'root' user can result in broken permissions and conflicting behaviour with the system package manager. It is recommended to use a virtual environment instead: https://pip.pypa.io/warnings/venv
+ sudo https_proxy= LANG=C chroot ./fsroot-broadcom pip3 install blkinfo
Collecting blkinfo
Downloading blkinfo-0.2.0.tar.gz (7.9 kB)
Preparing metadata (setup.py): started
Preparing metadata (setup.py): finished with status 'done'
Building wheels for collected packages: blkinfo
Building wheel for blkinfo (setup.py): started
Building wheel for blkinfo (setup.py): finished with status 'done'
Created wheel for blkinfo: filename=blkinfo-0.2.0-py3-none-any.whl size=7665 sha256=c153b9094486844c90304b57b492bdbb7fa9fd3f94bd3669f7865cd15bffa3d4
Stored in directory: /root/.cache/pip/wheels/bf/db/4f/2a25c37f82ea2114b3fe37f772b48956834073ddf3c9e6265e
Successfully built blkinfo
Installing collected packages: blkinfo
Successfully installed blkinfo-0.2.0
WARNING: Running pip as the 'root' user can result in broken permissions and conflicting behaviour with the system package manager. It is recommended to use a virtual environment instead: https://pip.pypa.io/warnings/venv
+ sudo https_proxy= LANG=C chroot ./fsroot-broadcom pip3 install ipaddr
Collecting ipaddr
Downloading ipaddr-2.2.0.tar.gz (26 kB)
Preparing metadata (setup.py): started
Preparing metadata (setup.py): finished with status 'done'
Building wheels for collected packages: ipaddr
Building wheel for ipaddr (setup.py): started
Building wheel for ipaddr (setup.py): finished with status 'done'
Created wheel for ipaddr: filename=ipaddr-2.2.0-py3-none-any.whl size=18281 sha256=3fc0d1d587ef632edbe42b6a6eac8ad617166142a3a67edaf82120e4cc509412
Stored in directory: /root/.cache/pip/wheels/1b/f4/54/ce8b4b51b444da2d12c64f5a99b6e4b526f341f803d4c9f5ac
Successfully built ipaddr
Installing collected packages: ipaddr
Successfully installed ipaddr-2.2.0
WARNING: Running pip as the 'root' user can result in broken permissions and conflicting behaviour with the system package manager. It is recommended to use a virtual environment instead: https://pip.pypa.io/warnings/venv
+ [[ amd64 == amd64 ]]
+ sudo https_proxy= LANG=C chroot ./fsroot-broadcom pip3 install grpcio==1.58.0
Collecting grpcio==1.58.0
Downloading grpcio-1.58.0-cp311-cp311-manylinux_2_17_x86_64.manylinux2014_x86_64.whl (5.3 MB)
━━━━━━━━━━━━━━━━━━━━━━━━━━━━━━━━━━━━━━━━ 5.3/5.3 MB 24.2 MB/s eta 0:00:00
Installing collected packages: grpcio
Successfully installed grpcio-1.58.0
WARNING: Running pip as the 'root' user can result in broken permissions and conflicting behaviour with the system package manager. It is recommended to use a virtual environment instead: https://pip.pypa.io/warnings/venv
+ sudo https_proxy= LANG=C chroot ./fsroot-broadcom pip3 install grpcio-tools==1.58.0
Collecting grpcio-tools==1.58.0
Downloading grpcio_tools-1.58.0-cp311-cp311-manylinux_2_17_x86_64.manylinux2014_x86_64.whl (2.6 MB)
━━━━━━━━━━━━━━━━━━━━━━━━━━━━━━━━━━━━━━━━ 2.6/2.6 MB 11.5 MB/s eta 0:00:00
Collecting protobuf<5.0dev,>=4.21.6
Downloading protobuf-4.25.6-cp37-abi3-manylinux2014_x86_64.whl (294 kB)
━━━━━━━━━━━━━━━━━━━━━━━━━━━━━━━━━━━━━━ 294.6/294.6 kB 47.0 MB/s eta 0:00:00
Requirement already satisfied: grpcio>=1.58.0 in /usr/local/lib/python3.11/dist-packages (from grpcio-tools==1.58.0) (1.58.0)
Requirement already satisfied: setuptools in /usr/lib/python3/dist-packages (from grpcio-tools==1.58.0) (66.1.1)
Installing collected packages: protobuf, grpcio-tools
Successfully installed grpcio-tools-1.58.0 protobuf-4.25.6
WARNING: Running pip as the 'root' user can result in broken permissions and conflicting behaviour with the system package manager. It is recommended to use a virtual environment instead: https://pip.pypa.io/warnings/venv
+ sudo https_proxy= LANG=C chroot ./fsroot-broadcom pip3 install smbus2
Collecting smbus2
Downloading smbus2-0.5.0-py2.py3-none-any.whl (11 kB)
Installing collected packages: smbus2
Successfully installed smbus2-0.5.0
WARNING: Running pip as the 'root' user can result in broken permissions and conflicting behaviour with the system package manager. It is recommended to use a virtual environment instead: https://pip.pypa.io/warnings/venv
+ sudo https_proxy= LANG=C chroot ./fsroot-broadcom pip3 install telnetlib3
Collecting telnetlib3
Downloading telnetlib3-2.0.4-py2.py3-none-any.whl (93 kB)
━━━━━━━━━━━━━━━━━━━━━━━━━━━━━━━━━━━━━━━━ 93.3/93.3 kB 5.1 MB/s eta 0:00:00
Installing collected packages: telnetlib3
Successfully installed telnetlib3-2.0.4
WARNING: Running pip as the 'root' user can result in broken permissions and conflicting behaviour with the system package manager. It is recommended to use a virtual environment instead: https://pip.pypa.io/warnings/venv
+ install_pip_package target/python-wheels/bookworm/sonic_py_common-1.0-py3-none-any.whl
+ pip_wheel=target/python-wheels/bookworm/sonic_py_common-1.0-py3-none-any.whl
+ [[ -z target/python-wheels/bookworm/sonic_py_common-1.0-py3-none-any.whl ]]
+ sudo cp target/python-wheels/bookworm/sonic_py_common-1.0-py3-none-any.whl ./fsroot-broadcom/
++ basename -a target/python-wheels/bookworm/sonic_py_common-1.0-py3-none-any.whl
+ basename_pip_wheel=sonic_py_common-1.0-py3-none-any.whl
+ sudo https_proxy= LANG=C chroot ./fsroot-broadcom pip3 install sonic_py_common-1.0-py3-none-any.whl
Processing /sonic_py_common-1.0-py3-none-any.whl
Collecting natsort
Downloading natsort-8.4.0-py3-none-any.whl (38 kB)
Collecting pyyaml
Downloading PyYAML-6.0.1-cp311-cp311-manylinux_2_17_x86_64.manylinux2014_x86_64.whl (757 kB)
━━━━━━━━━━━━━━━━━━━━━━━━━━━━━━━━━━━━━━ 757.7/757.7 kB 14.2 MB/s eta 0:00:00
Requirement already satisfied: redis-dump-load in /usr/local/lib/python3.11/dist-packages (from sonic-py-common==1.0) (1.1)
Requirement already satisfied: redis in /usr/local/lib/python3.11/dist-packages (from redis-dump-load->sonic-py-common==1.0) (3.5.3)
Installing collected packages: pyyaml, natsort, sonic-py-common
Attempting uninstall: pyyaml
Found existing installation: PyYAML 6.0
Not uninstalling pyyaml at /usr/lib/python3/dist-packages, outside environment /usr
Can't uninstall 'PyYAML'. No files were found to uninstall.
Successfully installed natsort-8.4.0 pyyaml-6.0.1 sonic-py-common-1.0
WARNING: Running pip as the 'root' user can result in broken permissions and conflicting behaviour with the system package manager. It is recommended to use a virtual environment instead: https://pip.pypa.io/warnings/venv
+ cd ./fsroot-broadcom
+ sudo rm -f sonic_py_common-1.0-py3-none-any.whl
+ [[ amd64 == armhf ]]
+ [[ amd64 == arm64 ]]
+ install_deb_package target/debs/bookworm/libyang_1.0.73_amd64.deb target/debs/bookworm/libyang-cpp_1.0.73_amd64.deb target/debs/bookworm/python3-yang_1.0.73_amd64.deb
+ deb_packages='target/debs/bookworm/libyang_1.0.73_amd64.deb target/debs/bookworm/libyang-cpp_1.0.73_amd64.deb target/debs/bookworm/python3-yang_1.0.73_amd64.deb'
+ [[ -z target/debs/bookworm/libyang_1.0.73_amd64.deb target/debs/bookworm/libyang-cpp_1.0.73_amd64.deb target/debs/bookworm/python3-yang_1.0.73_amd64.deb ]]
+ sudo cp target/debs/bookworm/libyang_1.0.73_amd64.deb target/debs/bookworm/libyang-cpp_1.0.73_amd64.deb target/debs/bookworm/python3-yang_1.0.73_amd64.deb ./fsroot-broadcom/
++ basename -a target/debs/bookworm/libyang_1.0.73_amd64.deb target/debs/bookworm/libyang-cpp_1.0.73_amd64.deb target/debs/bookworm/python3-yang_1.0.73_amd64.deb
+ basename_deb_packages='libyang_1.0.73_amd64.deb
libyang-cpp_1.0.73_amd64.deb
python3-yang_1.0.73_amd64.deb'
+ sudo LANG=C DEBIAN_FRONTEND=noninteractive chroot ./fsroot-broadcom dpkg -i libyang_1.0.73_amd64.deb libyang-cpp_1.0.73_amd64.deb python3-yang_1.0.73_amd64.deb
Selecting previously unselected package libyang.
(Reading database ... 29060 files and directories currently installed.)
Preparing to unpack libyang_1.0.73_amd64.deb ...
Unpacking libyang (1.0.73) ...
Selecting previously unselected package libyang-cpp.
Preparing to unpack libyang-cpp_1.0.73_amd64.deb ...
Unpacking libyang-cpp (1.0.73) ...
Selecting previously unselected package python3-yang.
Preparing to unpack python3-yang_1.0.73_amd64.deb ...
Unpacking python3-yang (1.0.73) ...
dpkg: dependency problems prevent configuration of libyang:
libyang depends on libpcre3; however:
Package libpcre3 is not installed.
dpkg: error processing package libyang (--install):
dependency problems - leaving unconfigured
dpkg: dependency problems prevent configuration of libyang-cpp:
libyang-cpp depends on libyang (= 1.0.73); however:
Package libyang is not configured yet.
dpkg: error processing package libyang-cpp (--install):
dependency problems - leaving unconfigured
dpkg: dependency problems prevent configuration of python3-yang:
python3-yang depends on libyang (= 1.0.73); however:
Package libyang is not configured yet.
python3-yang depends on libyang-cpp (= 1.0.73); however:
Package libyang-cpp is not configured yet.
dpkg: error processing package python3-yang (--install):
dependency problems - leaving unconfigured
Processing triggers for libc-bin (2.36-9+deb12u14) ...
Errors were encountered while processing:
libyang
libyang-cpp
python3-yang
+ sudo LANG=C DEBIAN_FRONTEND=noninteractive chroot ./fsroot-broadcom apt-get -y install -f
Reading package lists...
Building dependency tree...
Reading state information...
Correcting dependencies... Done
The following additional packages will be installed:
libpcre3
The following NEW packages will be installed:
libpcre3
0 upgraded, 1 newly installed, 0 to remove and 6 not upgraded.
3 not fully installed or removed.
Need to get 341 kB of archives.
After this operation, 696 kB of additional disk space will be used.
Get:1 http://debian-archive.trafficmanager.net/debian bookworm/main amd64 libpcre3 amd64 2:8.39-15 [341 kB]
debconf: delaying package configuration, since apt-utils is not installed
Fetched 341 kB in 3s (111 kB/s)
E: Can not write log (Is /dev/pts mounted?) - posix_openpt (19: No such device)
Selecting previously unselected package libpcre3:amd64.
(Reading database ... 29087 files and directories currently installed.)
Preparing to unpack .../libpcre3_2%3a8.39-15_amd64.deb ...
Unpacking libpcre3:amd64 (2:8.39-15) ...
Setting up libpcre3:amd64 (2:8.39-15) ...
Setting up libyang (1.0.73) ...
Setting up libyang-cpp (1.0.73) ...
Setting up python3-yang (1.0.73) ...
Processing triggers for libc-bin (2.36-9+deb12u14) ...
+ cd ./fsroot-broadcom
+ sudo rm -f libyang_1.0.73_amd64.deb libyang-cpp_1.0.73_amd64.deb python3-yang_1.0.73_amd64.deb
+ install_pip_package target/python-wheels/bookworm/sonic_yang_models-1.0-py3-none-any.whl
+ pip_wheel=target/python-wheels/bookworm/sonic_yang_models-1.0-py3-none-any.whl
+ [[ -z target/python-wheels/bookworm/sonic_yang_models-1.0-py3-none-any.whl ]]
+ sudo cp target/python-wheels/bookworm/sonic_yang_models-1.0-py3-none-any.whl ./fsroot-broadcom/
++ basename -a target/python-wheels/bookworm/sonic_yang_models-1.0-py3-none-any.whl
+ basename_pip_wheel=sonic_yang_models-1.0-py3-none-any.whl
+ sudo https_proxy= LANG=C chroot ./fsroot-broadcom pip3 install sonic_yang_models-1.0-py3-none-any.whl
Processing /sonic_yang_models-1.0-py3-none-any.whl
Installing collected packages: sonic-yang-models
Successfully installed sonic-yang-models-1.0
WARNING: Running pip as the 'root' user can result in broken permissions and conflicting behaviour with the system package manager. It is recommended to use a virtual environment instead: https://pip.pypa.io/warnings/venv
+ cd ./fsroot-broadcom
+ sudo rm -f sonic_yang_models-1.0-py3-none-any.whl
+ install_pip_package target/python-wheels/bookworm/sonic_yang_mgmt-1.0-py3-none-any.whl
+ pip_wheel=target/python-wheels/bookworm/sonic_yang_mgmt-1.0-py3-none-any.whl
+ [[ -z target/python-wheels/bookworm/sonic_yang_mgmt-1.0-py3-none-any.whl ]]
+ sudo cp target/python-wheels/bookworm/sonic_yang_mgmt-1.0-py3-none-any.whl ./fsroot-broadcom/
++ basename -a target/python-wheels/bookworm/sonic_yang_mgmt-1.0-py3-none-any.whl
+ basename_pip_wheel=sonic_yang_mgmt-1.0-py3-none-any.whl
+ sudo https_proxy= LANG=C chroot ./fsroot-broadcom pip3 install sonic_yang_mgmt-1.0-py3-none-any.whl
Processing /sonic_yang_mgmt-1.0-py3-none-any.whl
Collecting ijson==3.2.3
Downloading ijson-3.2.3-cp311-cp311-manylinux_2_17_x86_64.manylinux2014_x86_64.whl (116 kB)
━━━━━━━━━━━━━━━━━━━━━━━━━━━━━━━━━━━━━━━ 116.5/116.5 kB 6.5 MB/s eta 0:00:00
Collecting jsondiff>=1.2.0
Downloading jsondiff-2.2.1-py3-none-any.whl (13 kB)
Collecting jsonpointer>=1.9
Downloading jsonpointer-3.0.0-py2.py3-none-any.whl (7.6 kB)
Collecting tabulate==0.9.0
Downloading tabulate-0.9.0-py3-none-any.whl (35 kB)
Collecting xmltodict==0.12.0
Downloading xmltodict-0.12.0-py2.py3-none-any.whl (9.2 kB)
Requirement already satisfied: pyyaml in /usr/local/lib/python3.11/dist-packages (from jsondiff>=1.2.0->sonic-yang-mgmt==1.0) (6.0.1)
Installing collected packages: ijson, xmltodict, tabulate, jsonpointer, jsondiff, sonic-yang-mgmt
Successfully installed ijson-3.2.3 jsondiff-2.2.1 jsonpointer-3.0.0 sonic-yang-mgmt-1.0 tabulate-0.9.0 xmltodict-0.12.0
WARNING: Running pip as the 'root' user can result in broken permissions and conflicting behaviour with the system package manager. It is recommended to use a virtual environment instead: https://pip.pypa.io/warnings/venv
+ cd ./fsroot-broadcom
+ sudo rm -f sonic_yang_mgmt-1.0-py3-none-any.whl
+ sudo https_proxy= LANG=C chroot ./fsroot-broadcom pip3 install pyangbind==0.8.2
Collecting pyangbind==0.8.2
Downloading pyangbind-0.8.2-py3-none-any.whl (51 kB)
━━━━━━━━━━━━━━━━━━━━━━━━━━━━━━━━━━━━━━━━ 51.7/51.7 kB 3.4 MB/s eta 0:00:00
Collecting pyang
Downloading pyang-2.6.1-py2.py3-none-any.whl (594 kB)
━━━━━━━━━━━━━━━━━━━━━━━━━━━━━━━━━━━━━━ 594.7/594.7 kB 20.7 MB/s eta 0:00:00
Collecting bitarray
Downloading bitarray-2.8.1-cp311-cp311-manylinux_2_17_x86_64.manylinux2014_x86_64.whl (296 kB)
━━━━━━━━━━━━━━━━━━━━━━━━━━━━━━━━━━━━━━ 296.1/296.1 kB 30.4 MB/s eta 0:00:00
Collecting lxml
Downloading lxml-4.9.1-cp311-cp311-manylinux_2_17_x86_64.manylinux2014_x86_64.manylinux_2_24_x86_64.whl (7.0 MB)
━━━━━━━━━━━━━━━━━━━━━━━━━━━━━━━━━━━━━━━━ 7.0/7.0 MB 77.6 MB/s eta 0:00:00
Collecting regex
Downloading regex-2024.11.6-cp311-cp311-manylinux_2_17_x86_64.manylinux2014_x86_64.whl (792 kB)
━━━━━━━━━━━━━━━━━━━━━━━━━━━━━━━━━━━━━━ 792.7/792.7 kB 91.4 MB/s eta 0:00:00
Collecting six
Downloading six-1.16.0-py2.py3-none-any.whl (11 kB)
Collecting enum34
Downloading enum34-1.1.10-py3-none-any.whl (11 kB)
Installing collected packages: enum34, bitarray, six, regex, lxml, pyang, pyangbind
Successfully installed bitarray-2.8.1 enum34-1.1.10 lxml-4.9.1 pyang-2.6.1 pyangbind-0.8.2 regex-2024.11.6 six-1.16.0
WARNING: Running pip as the 'root' user can result in broken permissions and conflicting behaviour with the system package manager. It is recommended to use a virtual environment instead: https://pip.pypa.io/warnings/venv
+ sudo https_proxy= LANG=C chroot ./fsroot-broadcom pip3 uninstall -y enum34
Found existing installation: enum34 1.1.10
Uninstalling enum34-1.1.10:
Successfully uninstalled enum34-1.1.10
WARNING: Running pip as the 'root' user can result in broken permissions and conflicting behaviour with the system package manager. It is recommended to use a virtual environment instead: https://pip.pypa.io/warnings/venv
+ install_pip_package target/python-wheels/bookworm/sonic_config_engine-1.0-py3-none-any.whl
+ pip_wheel=target/python-wheels/bookworm/sonic_config_engine-1.0-py3-none-any.whl
+ [[ -z target/python-wheels/bookworm/sonic_config_engine-1.0-py3-none-any.whl ]]
+ sudo cp target/python-wheels/bookworm/sonic_config_engine-1.0-py3-none-any.whl ./fsroot-broadcom/
++ basename -a target/python-wheels/bookworm/sonic_config_engine-1.0-py3-none-any.whl
+ basename_pip_wheel=sonic_config_engine-1.0-py3-none-any.whl
+ sudo https_proxy= LANG=C chroot ./fsroot-broadcom pip3 install sonic_config_engine-1.0-py3-none-any.whl
Processing /sonic_config_engine-1.0-py3-none-any.whl
Requirement already satisfied: Jinja2>=2.10 in /usr/lib/python3/dist-packages (from sonic-config-engine==1.0) (3.1.2)
Requirement already satisfied: bitarray==2.8.1 in /usr/local/lib/python3.11/dist-packages (from sonic-config-engine==1.0) (2.8.1)
Collecting ipaddress==1.0.23
Downloading ipaddress-1.0.23-py2.py3-none-any.whl (18 kB)
Requirement already satisfied: lxml==4.9.1 in /usr/local/lib/python3.11/dist-packages (from sonic-config-engine==1.0) (4.9.1)
Collecting netaddr==0.8.0
Downloading netaddr-0.8.0-py2.py3-none-any.whl (1.9 MB)
━━━━━━━━━━━━━━━━━━━━━━━━━━━━━━━━━━━━━━━━ 1.9/1.9 MB 41.6 MB/s eta 0:00:00
Requirement already satisfied: pyyaml==6.0.1 in /usr/local/lib/python3.11/dist-packages (from sonic-config-engine==1.0) (6.0.1)
Requirement already satisfied: sonic-py-common in /usr/local/lib/python3.11/dist-packages (from sonic-config-engine==1.0) (1.0)
Requirement already satisfied: sonic-yang-mgmt>=1.0 in /usr/local/lib/python3.11/dist-packages (from sonic-config-engine==1.0) (1.0)
Requirement already satisfied: sonic-yang-models>=1.0 in /usr/local/lib/python3.11/dist-packages (from sonic-config-engine==1.0) (1.0)
Requirement already satisfied: ijson==3.2.3 in /usr/local/lib/python3.11/dist-packages (from sonic-yang-mgmt>=1.0->sonic-config-engine==1.0) (3.2.3)
Requirement already satisfied: jsondiff>=1.2.0 in /usr/local/lib/python3.11/dist-packages (from sonic-yang-mgmt>=1.0->sonic-config-engine==1.0) (2.2.1)
Requirement already satisfied: jsonpointer>=1.9 in /usr/local/lib/python3.11/dist-packages (from sonic-yang-mgmt>=1.0->sonic-config-engine==1.0) (3.0.0)
Requirement already satisfied: tabulate==0.9.0 in /usr/local/lib/python3.11/dist-packages (from sonic-yang-mgmt>=1.0->sonic-config-engine==1.0) (0.9.0)
Requirement already satisfied: xmltodict==0.12.0 in /usr/local/lib/python3.11/dist-packages (from sonic-yang-mgmt>=1.0->sonic-config-engine==1.0) (0.12.0)
Requirement already satisfied: natsort in /usr/local/lib/python3.11/dist-packages (from sonic-py-common->sonic-config-engine==1.0) (8.4.0)
Requirement already satisfied: redis-dump-load in /usr/local/lib/python3.11/dist-packages (from sonic-py-common->sonic-config-engine==1.0) (1.1)
Requirement already satisfied: redis in /usr/local/lib/python3.11/dist-packages (from redis-dump-load->sonic-py-common->sonic-config-engine==1.0) (3.5.3)
Installing collected packages: netaddr, ipaddress, sonic-config-engine
Successfully installed ipaddress-1.0.23 netaddr-0.8.0 sonic-config-engine-1.0
WARNING: Running pip as the 'root' user can result in broken permissions and conflicting behaviour with the system package manager. It is recommended to use a virtual environment instead: https://pip.pypa.io/warnings/venv
+ cd ./fsroot-broadcom
+ sudo rm -f sonic_config_engine-1.0-py3-none-any.whl
+ install_pip_package target/python-wheels/bookworm/sonic_platform_common-1.0-py3-none-any.whl
+ pip_wheel=target/python-wheels/bookworm/sonic_platform_common-1.0-py3-none-any.whl
+ [[ -z target/python-wheels/bookworm/sonic_platform_common-1.0-py3-none-any.whl ]]
+ sudo cp target/python-wheels/bookworm/sonic_platform_common-1.0-py3-none-any.whl ./fsroot-broadcom/
++ basename -a target/python-wheels/bookworm/sonic_platform_common-1.0-py3-none-any.whl
+ basename_pip_wheel=sonic_platform_common-1.0-py3-none-any.whl
+ sudo https_proxy= LANG=C chroot ./fsroot-broadcom pip3 install sonic_platform_common-1.0-py3-none-any.whl
Processing /sonic_platform_common-1.0-py3-none-any.whl
Requirement already satisfied: PyYAML in /usr/local/lib/python3.11/dist-packages (from sonic-platform-common==1.0) (6.0.1)
Requirement already satisfied: natsort in /usr/local/lib/python3.11/dist-packages (from sonic-platform-common==1.0) (8.4.0)
Requirement already satisfied: redis in /usr/local/lib/python3.11/dist-packages (from sonic-platform-common==1.0) (3.5.3)
Requirement already satisfied: sonic-config-engine in /usr/local/lib/python3.11/dist-packages (from sonic-platform-common==1.0) (1.0)
Requirement already satisfied: sonic-py-common in /usr/local/lib/python3.11/dist-packages (from sonic-platform-common==1.0) (1.0)
Requirement already satisfied: Jinja2>=2.10 in /usr/lib/python3/dist-packages (from sonic-config-engine->sonic-platform-common==1.0) (3.1.2)
Requirement already satisfied: bitarray==2.8.1 in /usr/local/lib/python3.11/dist-packages (from sonic-config-engine->sonic-platform-common==1.0) (2.8.1)
Requirement already satisfied: ipaddress==1.0.23 in /usr/local/lib/python3.11/dist-packages (from sonic-config-engine->sonic-platform-common==1.0) (1.0.23)
Requirement already satisfied: lxml==4.9.1 in /usr/local/lib/python3.11/dist-packages (from sonic-config-engine->sonic-platform-common==1.0) (4.9.1)
Requirement already satisfied: netaddr==0.8.0 in /usr/local/lib/python3.11/dist-packages (from sonic-config-engine->sonic-platform-common==1.0) (0.8.0)
Requirement already satisfied: sonic-yang-mgmt>=1.0 in /usr/local/lib/python3.11/dist-packages (from sonic-config-engine->sonic-platform-common==1.0) (1.0)
Requirement already satisfied: sonic-yang-models>=1.0 in /usr/local/lib/python3.11/dist-packages (from sonic-config-engine->sonic-platform-common==1.0) (1.0)
Requirement already satisfied: redis-dump-load in /usr/local/lib/python3.11/dist-packages (from sonic-py-common->sonic-platform-common==1.0) (1.1)
Requirement already satisfied: ijson==3.2.3 in /usr/local/lib/python3.11/dist-packages (from sonic-yang-mgmt>=1.0->sonic-config-engine->sonic-platform-common==1.0) (3.2.3)
Requirement already satisfied: jsondiff>=1.2.0 in /usr/local/lib/python3.11/dist-packages (from sonic-yang-mgmt>=1.0->sonic-config-engine->sonic-platform-common==1.0) (2.2.1)
Requirement already satisfied: jsonpointer>=1.9 in /usr/local/lib/python3.11/dist-packages (from sonic-yang-mgmt>=1.0->sonic-config-engine->sonic-platform-common==1.0) (3.0.0)
Requirement already satisfied: tabulate==0.9.0 in /usr/local/lib/python3.11/dist-packages (from sonic-yang-mgmt>=1.0->sonic-config-engine->sonic-platform-common==1.0) (0.9.0)
Requirement already satisfied: xmltodict==0.12.0 in /usr/local/lib/python3.11/dist-packages (from sonic-yang-mgmt>=1.0->sonic-config-engine->sonic-platform-common==1.0) (0.12.0)
Installing collected packages: sonic-platform-common
Successfully installed sonic-platform-common-1.0
WARNING: Running pip as the 'root' user can result in broken permissions and conflicting behaviour with the system package manager. It is recommended to use a virtual environment instead: https://pip.pypa.io/warnings/venv
+ cd ./fsroot-broadcom
+ sudo rm -f sonic_platform_common-1.0-py3-none-any.whl
+ install_pip_package target/python-wheels/bookworm/sonic_platform_pddf_common-1.0-py3-none-any.whl
+ pip_wheel=target/python-wheels/bookworm/sonic_platform_pddf_common-1.0-py3-none-any.whl
+ [[ -z target/python-wheels/bookworm/sonic_platform_pddf_common-1.0-py3-none-any.whl ]]
+ sudo cp target/python-wheels/bookworm/sonic_platform_pddf_common-1.0-py3-none-any.whl ./fsroot-broadcom/
++ basename -a target/python-wheels/bookworm/sonic_platform_pddf_common-1.0-py3-none-any.whl
+ basename_pip_wheel=sonic_platform_pddf_common-1.0-py3-none-any.whl
+ sudo https_proxy= LANG=C chroot ./fsroot-broadcom pip3 install sonic_platform_pddf_common-1.0-py3-none-any.whl
Processing /sonic_platform_pddf_common-1.0-py3-none-any.whl
Collecting jsonschema==2.6.0
Downloading jsonschema-2.6.0-py2.py3-none-any.whl (39 kB)
Installing collected packages: jsonschema, sonic-platform-pddf-common
Successfully installed jsonschema-2.6.0 sonic-platform-pddf-common-1.0
WARNING: Running pip as the 'root' user can result in broken permissions and conflicting behaviour with the system package manager. It is recommended to use a virtual environment instead: https://pip.pypa.io/warnings/venv
+ cd ./fsroot-broadcom
+ sudo rm -f sonic_platform_pddf_common-1.0-py3-none-any.whl
+ install_pip_package target/python-wheels/bookworm/system_health-1.0-py3-none-any.whl
+ pip_wheel=target/python-wheels/bookworm/system_health-1.0-py3-none-any.whl
+ [[ -z target/python-wheels/bookworm/system_health-1.0-py3-none-any.whl ]]
+ sudo cp target/python-wheels/bookworm/system_health-1.0-py3-none-any.whl ./fsroot-broadcom/
++ basename -a target/python-wheels/bookworm/system_health-1.0-py3-none-any.whl
+ basename_pip_wheel=system_health-1.0-py3-none-any.whl
+ sudo https_proxy= LANG=C chroot ./fsroot-broadcom pip3 install system_health-1.0-py3-none-any.whl
Processing /system_health-1.0-py3-none-any.whl
Requirement already satisfied: docker in /usr/local/lib/python3.11/dist-packages (from system-health==1.0) (7.1.0)
Requirement already satisfied: natsort in /usr/local/lib/python3.11/dist-packages (from system-health==1.0) (8.4.0)
Requirement already satisfied: sonic-py-common in /usr/local/lib/python3.11/dist-packages (from system-health==1.0) (1.0)
Requirement already satisfied: requests>=2.26.0 in /usr/local/lib/python3.11/dist-packages (from docker->system-health==1.0) (2.31.0)
Requirement already satisfied: urllib3>=1.26.0 in /usr/local/lib/python3.11/dist-packages (from docker->system-health==1.0) (2.3.0)
Requirement already satisfied: pyyaml in /usr/local/lib/python3.11/dist-packages (from sonic-py-common->system-health==1.0) (6.0.1)
Requirement already satisfied: redis-dump-load in /usr/local/lib/python3.11/dist-packages (from sonic-py-common->system-health==1.0) (1.1)
Requirement already satisfied: charset-normalizer<4,>=2 in /usr/local/lib/python3.11/dist-packages (from requests>=2.26.0->docker->system-health==1.0) (3.4.1)
Requirement already satisfied: idna<4,>=2.5 in /usr/local/lib/python3.11/dist-packages (from requests>=2.26.0->docker->system-health==1.0) (3.10)
Requirement already satisfied: certifi>=2017.4.17 in /usr/local/lib/python3.11/dist-packages (from requests>=2.26.0->docker->system-health==1.0) (2025.1.31)
Requirement already satisfied: redis in /usr/local/lib/python3.11/dist-packages (from redis-dump-load->sonic-py-common->system-health==1.0) (3.5.3)
Installing collected packages: system-health
Successfully installed system-health-1.0
WARNING: Running pip as the 'root' user can result in broken permissions and conflicting behaviour with the system package manager. It is recommended to use a virtual environment instead: https://pip.pypa.io/warnings/venv
+ cd ./fsroot-broadcom
+ sudo rm -f system_health-1.0-py3-none-any.whl
+ sudo LANG=C DEBIAN_FRONTEND=noninteractive chroot ./fsroot-broadcom apt-get -y install python3-m2crypto python3-cryptography python3-cffi python3-nacl
Reading package lists...
Building dependency tree...
Reading state information...
The following additional packages will be installed:
python3-cffi-backend python3-ply python3-pycparser
Suggested packages:
python-cryptography-doc python3-cryptography-vectors python-m2crypto-doc
python-nacl-doc python-ply-doc
The following NEW packages will be installed:
python3-cffi python3-cffi-backend python3-cryptography python3-m2crypto
python3-nacl python3-ply python3-pycparser
0 upgraded, 7 newly installed, 0 to remove and 6 not upgraded.
Need to get 1225 kB of archives.
After this operation, 5933 kB of additional disk space will be used.
Get:1 http://debian-archive.trafficmanager.net/debian bookworm/main amd64 python3-cffi-backend amd64 1.15.1-5+b1 [84.6 kB]
Get:2 http://debian-archive.trafficmanager.net/debian bookworm/main amd64 python3-ply all 3.11-5 [65.8 kB]
Get:3 http://debian-archive.trafficmanager.net/debian bookworm/main amd64 python3-pycparser all 2.21-1 [78.8 kB]
Get:4 http://debian-archive.trafficmanager.net/debian bookworm/main amd64 python3-cffi all 1.15.1-5 [86.2 kB]
Get:5 http://debian-archive.trafficmanager.net/debian bookworm/main amd64 python3-cryptography amd64 38.0.4-3+deb12u1 [665 kB]
Get:6 http://debian-archive.trafficmanager.net/debian bookworm/main amd64 python3-m2crypto amd64 0.38.0-4+b1 [185 kB]
Get:7 http://debian-archive.trafficmanager.net/debian bookworm/main amd64 python3-nacl amd64 1.5.0-2 [59.3 kB]
debconf: delaying package configuration, since apt-utils is not installed
Fetched 1225 kB in 6s (216 kB/s)
E: Can not write log (Is /dev/pts mounted?) - posix_openpt (19: No such device)
Selecting previously unselected package python3-cffi-backend:amd64.
(Reading database ... 29100 files and directories currently installed.)
Preparing to unpack .../0-python3-cffi-backend_1.15.1-5+b1_amd64.deb ...
Unpacking python3-cffi-backend:amd64 (1.15.1-5+b1) ...
Selecting previously unselected package python3-ply.
Preparing to unpack .../1-python3-ply_3.11-5_all.deb ...
Unpacking python3-ply (3.11-5) ...
Selecting previously unselected package python3-pycparser.
Preparing to unpack .../2-python3-pycparser_2.21-1_all.deb ...
Unpacking python3-pycparser (2.21-1) ...
Selecting previously unselected package python3-cffi.
Preparing to unpack .../3-python3-cffi_1.15.1-5_all.deb ...
Unpacking python3-cffi (1.15.1-5) ...
Selecting previously unselected package python3-cryptography.
Preparing to unpack .../4-python3-cryptography_38.0.4-3+deb12u1_amd64.deb ...
Unpacking python3-cryptography (38.0.4-3+deb12u1) ...
Selecting previously unselected package python3-m2crypto.
Preparing to unpack .../5-python3-m2crypto_0.38.0-4+b1_amd64.deb ...
Unpacking python3-m2crypto (0.38.0-4+b1) ...
Selecting previously unselected package python3-nacl.
Preparing to unpack .../6-python3-nacl_1.5.0-2_amd64.deb ...
Unpacking python3-nacl (1.5.0-2) ...
Setting up python3-ply (3.11-5) ...
Setting up python3-pycparser (2.21-1) ...
Setting up python3-m2crypto (0.38.0-4+b1) ...
Setting up python3-cffi-backend:amd64 (1.15.1-5+b1) ...
Setting up python3-cffi (1.15.1-5) ...
Setting up python3-cryptography (38.0.4-3+deb12u1) ...
Setting up python3-nacl (1.5.0-2) ...
+ sudo LANG=C DEBIAN_FRONTEND=noninteractive chroot ./fsroot-broadcom apt-get -y install libffi-dev
Reading package lists...
Building dependency tree...
Reading state information...
The following NEW packages will be installed:
libffi-dev
0 upgraded, 1 newly installed, 0 to remove and 6 not upgraded.
Need to get 59.4 kB of archives.
After this operation, 323 kB of additional disk space will be used.
Get:1 http://debian-archive.trafficmanager.net/debian bookworm/main amd64 libffi-dev amd64 3.4.4-1 [59.4 kB]
debconf: delaying package configuration, since apt-utils is not installed
Fetched 59.4 kB in 1s (40.7 kB/s)
E: Can not write log (Is /dev/pts mounted?) - posix_openpt (19: No such device)
Selecting previously unselected package libffi-dev:amd64.
(Reading database ... 29556 files and directories currently installed.)
Preparing to unpack .../libffi-dev_3.4.4-1_amd64.deb ...
Unpacking libffi-dev:amd64 (3.4.4-1) ...
Setting up libffi-dev:amd64 (3.4.4-1) ...
+ install_pip_package target/python-wheels/bookworm/sonic_utilities-1.2-py3-none-any.whl
+ pip_wheel=target/python-wheels/bookworm/sonic_utilities-1.2-py3-none-any.whl
+ [[ -z target/python-wheels/bookworm/sonic_utilities-1.2-py3-none-any.whl ]]
+ sudo cp target/python-wheels/bookworm/sonic_utilities-1.2-py3-none-any.whl ./fsroot-broadcom/
++ basename -a target/python-wheels/bookworm/sonic_utilities-1.2-py3-none-any.whl
+ basename_pip_wheel=sonic_utilities-1.2-py3-none-any.whl
+ sudo https_proxy= LANG=C chroot ./fsroot-broadcom pip3 install sonic_utilities-1.2-py3-none-any.whl
Processing /sonic_utilities-1.2-py3-none-any.whl
Collecting bcrypt==3.2.2
Downloading bcrypt-3.2.2-cp36-abi3-manylinux_2_17_x86_64.manylinux2014_x86_64.manylinux_2_24_x86_64.whl (62 kB)
━━━━━━━━━━━━━━━━━━━━━━━━━━━━━━━━━━━━━━━━ 62.3/62.3 kB 3.3 MB/s eta 0:00:00
Collecting click-log>=0.3.2
Downloading click_log-0.4.0-py2.py3-none-any.whl (4.3 kB)
Collecting click==7.0
Downloading Click-7.0-py2.py3-none-any.whl (81 kB)
━━━━━━━━━━━━━━━━━━━━━━━━━━━━━━━━━━━━━━━━ 81.3/81.3 kB 10.9 MB/s eta 0:00:00
Requirement already satisfied: cryptography>=3.3.2 in /usr/lib/python3/dist-packages (from sonic-utilities==1.2) (38.0.4)
Collecting docker-image-py>=0.1.10
Downloading docker_image_py-0.1.13-py3-none-any.whl (8.9 kB)
Requirement already satisfied: docker>=4.4.4 in /usr/local/lib/python3.11/dist-packages (from sonic-utilities==1.2) (7.1.0)
Collecting enlighten>=1.8.0
Downloading enlighten-1.13.0-py2.py3-none-any.whl (42 kB)
━━━━━━━━━━━━━━━━━━━━━━━━━━━━━━━━━━━━━━━━ 42.0/42.0 kB 25.4 MB/s eta 0:00:00
Collecting filelock>=3.0.12
Downloading filelock-3.17.0-py3-none-any.whl (16 kB)
Requirement already satisfied: ipaddress>=1.0.23 in /usr/local/lib/python3.11/dist-packages (from sonic-utilities==1.2) (1.0.23)
Requirement already satisfied: jinja2>=2.11.3 in /usr/lib/python3/dist-packages (from sonic-utilities==1.2) (3.1.2)
Requirement already satisfied: jsondiff>=1.2.0 in /usr/local/lib/python3.11/dist-packages (from sonic-utilities==1.2) (2.2.1)
Collecting jsonpatch>=1.32.0
Downloading jsonpatch-1.33-py2.py3-none-any.whl (12 kB)
Requirement already satisfied: jsonpointer>=1.9 in /usr/local/lib/python3.11/dist-packages (from sonic-utilities==1.2) (3.0.0)
Collecting lazy-object-proxy
Downloading lazy_object_proxy-1.10.0-cp311-cp311-manylinux_2_5_x86_64.manylinux1_x86_64.manylinux_2_17_x86_64.manylinux2014_x86_64.whl (69 kB)
━━━━━━━━━━━━━━━━━━━━━━━━━━━━━━━━━━━━━━━━ 69.8/69.8 kB 33.7 MB/s eta 0:00:00
Requirement already satisfied: m2crypto>=0.31.0 in /usr/lib/python3/dist-packages (from sonic-utilities==1.2) (0.38.0)
Requirement already satisfied: natsort>=6.2.1 in /usr/local/lib/python3.11/dist-packages (from sonic-utilities==1.2) (8.4.0)
Requirement already satisfied: netaddr>=0.8.0 in /usr/local/lib/python3.11/dist-packages (from sonic-utilities==1.2) (0.8.0)
Collecting netifaces>=0.10.7
Downloading netifaces-0.11.0.tar.gz (30 kB)
Preparing metadata (setup.py): started
Preparing metadata (setup.py): finished with status 'done'
Collecting paramiko==2.11.0
Downloading paramiko-2.11.0-py2.py3-none-any.whl (212 kB)
━━━━━━━━━━━━━━━━━━━━━━━━━━━━━━━━━━━━━━ 212.9/212.9 kB 61.6 MB/s eta 0:00:00
Collecting pexpect>=4.8.0
Downloading pexpect-4.9.0-py2.py3-none-any.whl (63 kB)
━━━━━━━━━━━━━━━━━━━━━━━━━━━━━━━━━━━━━━━━ 63.8/63.8 kB 39.4 MB/s eta 0:00:00
Collecting prettyprinter>=0.18.0
Downloading prettyprinter-0.18.0-py2.py3-none-any.whl (48 kB)
━━━━━━━━━━━━━━━━━━━━━━━━━━━━━━━━━━━━━━━━ 48.0/48.0 kB 29.5 MB/s eta 0:00:00
Requirement already satisfied: protobuf in /usr/local/lib/python3.11/dist-packages (from sonic-utilities==1.2) (4.25.6)
Collecting pyroute2==0.7.12
Downloading pyroute2-0.7.12-py3-none-any.whl (460 kB)
━━━━━━━━━━━━━━━━━━━━━━━━━━━━━━━━━━━━━━ 460.5/460.5 kB 66.5 MB/s eta 0:00:00
Requirement already satisfied: requests<=2.31.0,>=2.25.0 in /usr/local/lib/python3.11/dist-packages (from sonic-utilities==1.2) (2.31.0)
Collecting scp==0.14.5
Downloading scp-0.14.5-py2.py3-none-any.whl (8.7 kB)
Collecting semantic-version>=2.8.5
Downloading semantic_version-2.10.0-py2.py3-none-any.whl (15 kB)
Requirement already satisfied: six==1.16.0 in /usr/local/lib/python3.11/dist-packages (from sonic-utilities==1.2) (1.16.0)
Requirement already satisfied: sonic-config-engine in /usr/local/lib/python3.11/dist-packages (from sonic-utilities==1.2) (1.0)
Requirement already satisfied: sonic-platform-common in /usr/local/lib/python3.11/dist-packages (from sonic-utilities==1.2) (1.0)
Requirement already satisfied: sonic-py-common in /usr/local/lib/python3.11/dist-packages (from sonic-utilities==1.2) (1.0)
Requirement already satisfied: sonic-yang-mgmt in /usr/local/lib/python3.11/dist-packages (from sonic-utilities==1.2) (1.0)
Requirement already satisfied: tabulate==0.9.0 in /usr/local/lib/python3.11/dist-packages (from sonic-utilities==1.2) (0.9.0)
Collecting toposort==1.6
Downloading toposort-1.6-py2.py3-none-any.whl (9.5 kB)
Requirement already satisfied: urllib3>=2 in /usr/local/lib/python3.11/dist-packages (from sonic-utilities==1.2) (2.3.0)
Collecting www-authenticate==0.9.2
Downloading www-authenticate-0.9.2.tar.gz (2.4 kB)
Preparing metadata (setup.py): started
Preparing metadata (setup.py): finished with status 'done'
Requirement already satisfied: xmltodict==0.12.0 in /usr/local/lib/python3.11/dist-packages (from sonic-utilities==1.2) (0.12.0)
Requirement already satisfied: cffi>=1.1 in /usr/lib/python3/dist-packages (from bcrypt==3.2.2->sonic-utilities==1.2) (1.15.1)
Requirement already satisfied: pynacl>=1.0.1 in /usr/lib/python3/dist-packages (from paramiko==2.11.0->sonic-utilities==1.2) (1.5.0)
Requirement already satisfied: regex>=2019.4.14 in /usr/local/lib/python3.11/dist-packages (from docker-image-py>=0.1.10->sonic-utilities==1.2) (2024.11.6)
Collecting blessed>=1.17.7
Downloading blessed-1.20.0-py2.py3-none-any.whl (58 kB)
━━━━━━━━━━━━━━━━━━━━━━━━━━━━━━━━━━━━━━━━ 58.4/58.4 kB 34.5 MB/s eta 0:00:00
Collecting prefixed>=0.3.2
Downloading prefixed-0.9.0-py2.py3-none-any.whl (13 kB)
Requirement already satisfied: pyyaml in /usr/local/lib/python3.11/dist-packages (from jsondiff>=1.2.0->sonic-utilities==1.2) (6.0.1)
Collecting ptyprocess>=0.5
Downloading ptyprocess-0.7.0-py2.py3-none-any.whl (13 kB)
Collecting Pygments>=2.2.0
Downloading pygments-2.19.1-py3-none-any.whl (1.2 MB)
━━━━━━━━━━━━━━━━━━━━━━━━━━━━━━━━━━━━━━━━ 1.2/1.2 MB 75.9 MB/s eta 0:00:00
Collecting colorful>=0.4.0
Downloading colorful-0.5.6-py2.py3-none-any.whl (201 kB)
━━━━━━━━━━━━━━━━━━━━━━━━━━━━━━━━━━━━━━ 201.4/201.4 kB 87.1 MB/s eta 0:00:00
Requirement already satisfied: charset-normalizer<4,>=2 in /usr/local/lib/python3.11/dist-packages (from requests<=2.31.0,>=2.25.0->sonic-utilities==1.2) (3.4.1)
Requirement already satisfied: idna<4,>=2.5 in /usr/local/lib/python3.11/dist-packages (from requests<=2.31.0,>=2.25.0->sonic-utilities==1.2) (3.10)
Requirement already satisfied: certifi>=2017.4.17 in /usr/local/lib/python3.11/dist-packages (from requests<=2.31.0,>=2.25.0->sonic-utilities==1.2) (2025.1.31)
Requirement already satisfied: bitarray==2.8.1 in /usr/local/lib/python3.11/dist-packages (from sonic-config-engine->sonic-utilities==1.2) (2.8.1)
Requirement already satisfied: lxml==4.9.1 in /usr/local/lib/python3.11/dist-packages (from sonic-config-engine->sonic-utilities==1.2) (4.9.1)
Requirement already satisfied: sonic-yang-models>=1.0 in /usr/local/lib/python3.11/dist-packages (from sonic-config-engine->sonic-utilities==1.2) (1.0)
Requirement already satisfied: ijson==3.2.3 in /usr/local/lib/python3.11/dist-packages (from sonic-yang-mgmt->sonic-utilities==1.2) (3.2.3)
Requirement already satisfied: redis in /usr/local/lib/python3.11/dist-packages (from sonic-platform-common->sonic-utilities==1.2) (3.5.3)
Requirement already satisfied: redis-dump-load in /usr/local/lib/python3.11/dist-packages (from sonic-py-common->sonic-utilities==1.2) (1.1)
Collecting wcwidth>=0.1.4
Downloading wcwidth-0.2.13-py2.py3-none-any.whl (34 kB)
Building wheels for collected packages: www-authenticate, netifaces
Building wheel for www-authenticate (setup.py): started
Building wheel for www-authenticate (setup.py): finished with status 'done'
Created wheel for www-authenticate: filename=www_authenticate-0.9.2-py3-none-any.whl size=2915 sha256=97e45ccffe6697dd3cc9e5027e86283e5f3f0406a35113b1134b65fbbbe90f3d
Stored in directory: /root/.cache/pip/wheels/06/49/2f/3fd5a4637570e85f30811a40ec3a87db5f58a490764dd5a728
Building wheel for netifaces (setup.py): started
Building wheel for netifaces (setup.py): finished with status 'done'
Created wheel for netifaces: filename=netifaces-0.11.0-cp311-cp311-linux_x86_64.whl size=34243 sha256=4bddad9ae1c7b53b693a70d90b22d861fd20e1f00799fba45cb9d007583ccd32
Stored in directory: /root/.cache/pip/wheels/40/85/29/648c19bbbb5f1d30e33bfb343fd7fb54296b402f7205d8e46f
Successfully built www-authenticate netifaces
Installing collected packages: www-authenticate, wcwidth, toposort, pyroute2, ptyprocess, prefixed, netifaces, colorful, semantic-version, Pygments, pexpect, lazy-object-proxy, jsonpatch, filelock, docker-image-py, click, blessed, bcrypt, prettyprinter, paramiko, enlighten, click-log, scp, sonic-utilities
Successfully installed Pygments-2.19.1 bcrypt-3.2.2 blessed-1.20.0 click-7.0 click-log-0.4.0 colorful-0.5.6 docker-image-py-0.1.13 enlighten-1.13.0 filelock-3.17.0 jsonpatch-1.33 lazy-object-proxy-1.10.0 netifaces-0.11.0 paramiko-2.11.0 pexpect-4.9.0 prefixed-0.9.0 prettyprinter-0.18.0 ptyprocess-0.7.0 pyroute2-0.7.12 scp-0.14.5 semantic-version-2.10.0 sonic-utilities-1.2 toposort-1.6 wcwidth-0.2.13 www-authenticate-0.9.2
WARNING: Running pip as the 'root' user can result in broken permissions and conflicting behaviour with the system package manager. It is recommended to use a virtual environment instead: https://pip.pypa.io/warnings/venv
+ cd ./fsroot-broadcom
+ sudo rm -f sonic_utilities-1.2-py3-none-any.whl
+ install_deb_package target/debs/bookworm/sonic-utilities-data_1.0-1_all.deb
+ deb_packages=target/debs/bookworm/sonic-utilities-data_1.0-1_all.deb
+ [[ -z target/debs/bookworm/sonic-utilities-data_1.0-1_all.deb ]]
+ sudo cp target/debs/bookworm/sonic-utilities-data_1.0-1_all.deb ./fsroot-broadcom/
++ basename -a target/debs/bookworm/sonic-utilities-data_1.0-1_all.deb
+ basename_deb_packages=sonic-utilities-data_1.0-1_all.deb
+ sudo LANG=C DEBIAN_FRONTEND=noninteractive chroot ./fsroot-broadcom dpkg -i sonic-utilities-data_1.0-1_all.deb
Selecting previously unselected package sonic-utilities-data.
(Reading database ... 29591 files and directories currently installed.)
Preparing to unpack sonic-utilities-data_1.0-1_all.deb ...
Unpacking sonic-utilities-data (1.0-1) ...
dpkg: dependency problems prevent configuration of sonic-utilities-data:
sonic-utilities-data depends on bash-completion; however:
Package bash-completion is not installed.
dpkg: error processing package sonic-utilities-data (--install):
dependency problems - leaving unconfigured
Errors were encountered while processing:
sonic-utilities-data
+ sudo LANG=C DEBIAN_FRONTEND=noninteractive chroot ./fsroot-broadcom apt-get -y install -f
Reading package lists...
Building dependency tree...
Reading state information...
Correcting dependencies... Done
The following additional packages will be installed:
bash-completion
The following NEW packages will be installed:
bash-completion
0 upgraded, 1 newly installed, 0 to remove and 6 not upgraded.
1 not fully installed or removed.
Need to get 234 kB of archives.
After this operation, 1498 kB of additional disk space will be used.
Ign:1 http://debian-archive.trafficmanager.net/debian bookworm/main amd64 bash-completion all 1:2.11-6
Ign:1 http://debian-archive.trafficmanager.net/debian bookworm/main amd64 bash-completion all 1:2.11-6
Ign:1 http://debian-archive.trafficmanager.net/debian bookworm/main amd64 bash-completion all 1:2.11-6
Ign:1 http://debian-archive.trafficmanager.net/debian bookworm/main amd64 bash-completion all 1:2.11-6
Ign:1 http://debian-archive.trafficmanager.net/debian bookworm/main amd64 bash-completion all 1:2.11-6
Ign:1 http://debian-archive.trafficmanager.net/debian bookworm/main amd64 bash-completion all 1:2.11-6
Ign:1 http://debian-archive.trafficmanager.net/debian bookworm/main amd64 bash-completion all 1:2.11-6
Ign:1 http://debian-archive.trafficmanager.net/debian bookworm/main amd64 bash-completion all 1:2.11-6
Ign:1 http://debian-archive.trafficmanager.net/debian bookworm/main amd64 bash-completion all 1:2.11-6
Ign:1 http://debian-archive.trafficmanager.net/debian bookworm/main amd64 bash-completion all 1:2.11-6
Ign:1 http://debian-archive.trafficmanager.net/debian bookworm/main amd64 bash-completion all 1:2.11-6
Ign:1 http://debian-archive.trafficmanager.net/debian bookworm/main amd64 bash-completion all 1:2.11-6
Ign:1 http://debian-archive.trafficmanager.net/debian bookworm/main amd64 bash-completion all 1:2.11-6
Ign:1 http://debian-archive.trafficmanager.net/debian bookworm/main amd64 bash-completion all 1:2.11-6
Ign:1 http://debian-archive.trafficmanager.net/debian bookworm/main amd64 bash-completion all 1:2.11-6
Ign:1 http://debian-archive.trafficmanager.net/debian bookworm/main amd64 bash-completion all 1:2.11-6
Ign:1 http://debian-archive.trafficmanager.net/debian bookworm/main amd64 bash-completion all 1:2.11-6
Ign:1 http://debian-archive.trafficmanager.net/debian bookworm/main amd64 bash-completion all 1:2.11-6
Ign:1 http://debian-archive.trafficmanager.net/debian bookworm/main amd64 bash-completion all 1:2.11-6
Ign:1 http://debian-archive.trafficmanager.net/debian bookworm/main amd64 bash-completion all 1:2.11-6
Err:1 http://debian-archive.trafficmanager.net/debian bookworm/main amd64 bash-completion all 1:2.11-6
Could not connect to debian-archive.trafficmanager.net:80 (2603:1040:2:5::105). - connect (101: Network is unreachable)
E: Failed to fetch http://debian-archive.trafficmanager.net/debian/pool/main/b/bash-completion/bash-completion_2.11-6_all.deb Could not connect to debian-archive.trafficmanager.net:80 (2603:1040:2:5::105). - connect (101: Network is unreachable)
E: Unable to fetch some archives, maybe run apt-get update or try with --fix-missing?
+ clean_sys
+ sudo chroot ./fsroot-broadcom umount /sys/fs/cgroup/cgroup.controllers /sys/fs/cgroup/cgroup.events /sys/fs/cgroup/cgroup.freeze /sys/fs/cgroup/cgroup.kill /sys/fs/cgroup/cgroup.max.depth /sys/fs/cgroup/cgroup.max.descendants /sys/fs/cgroup/cgroup.pressure /sys/fs/cgroup/cgroup.procs /sys/fs/cgroup/cgroup.stat /sys/fs/cgroup/cgroup.subtree_control /sys/fs/cgroup/cgroup.threads /sys/fs/cgroup/cgroup.type /sys/fs/cgroup/cpu.idle /sys/fs/cgroup/cpu.max /sys/fs/cgroup/cpu.max.burst /sys/fs/cgroup/cpu.pressure /sys/fs/cgroup/cpu.stat /sys/fs/cgroup/cpu.stat.local /sys/fs/cgroup/cpu.uclamp.max /sys/fs/cgroup/cpu.uclamp.min /sys/fs/cgroup/cpu.weight /sys/fs/cgroup/cpu.weight.nice /sys/fs/cgroup/cpuset.cpus /sys/fs/cgroup/cpuset.cpus.effective /sys/fs/cgroup/cpuset.cpus.exclusive /sys/fs/cgroup/cpuset.cpus.exclusive.effective /sys/fs/cgroup/cpuset.cpus.partition /sys/fs/cgroup/cpuset.mems /sys/fs/cgroup/cpuset.mems.effective /sys/fs/cgroup/docker /sys/fs/cgroup/hugetlb.1GB.current /sys/fs/cgroup/hugetlb.1GB.events /sys/fs/cgroup/hugetlb.1GB.events.local /sys/fs/cgroup/hugetlb.1GB.max /sys/fs/cgroup/hugetlb.1GB.numa_stat /sys/fs/cgroup/hugetlb.1GB.rsvd.current /sys/fs/cgroup/hugetlb.1GB.rsvd.max /sys/fs/cgroup/hugetlb.2MB.current /sys/fs/cgroup/hugetlb.2MB.events /sys/fs/cgroup/hugetlb.2MB.events.local /sys/fs/cgroup/hugetlb.2MB.max /sys/fs/cgroup/hugetlb.2MB.numa_stat /sys/fs/cgroup/hugetlb.2MB.rsvd.current /sys/fs/cgroup/hugetlb.2MB.rsvd.max /sys/fs/cgroup/io.max /sys/fs/cgroup/io.pressure /sys/fs/cgroup/io.prio.class /sys/fs/cgroup/io.stat /sys/fs/cgroup/io.weight /sys/fs/cgroup/memory.current /sys/fs/cgroup/memory.events /sys/fs/cgroup/memory.events.local /sys/fs/cgroup/memory.high /sys/fs/cgroup/memory.low /sys/fs/cgroup/memory.max /sys/fs/cgroup/memory.min /sys/fs/cgroup/memory.numa_stat /sys/fs/cgroup/memory.oom.group /sys/fs/cgroup/memory.peak /sys/fs/cgroup/memory.pressure /sys/fs/cgroup/memory.reclaim /sys/fs/cgroup/memory.stat /sys/fs/cgroup/memory.swap.current /sys/fs/cgroup/memory.swap.events /sys/fs/cgroup/memory.swap.high /sys/fs/cgroup/memory.swap.max /sys/fs/cgroup/memory.swap.peak /sys/fs/cgroup/memory.zswap.current /sys/fs/cgroup/memory.zswap.max /sys/fs/cgroup/memory.zswap.writeback /sys/fs/cgroup/misc.current /sys/fs/cgroup/misc.events /sys/fs/cgroup/misc.max /sys/fs/cgroup/pids.current /sys/fs/cgroup/pids.events /sys/fs/cgroup/pids.max /sys/fs/cgroup/pids.peak /sys/fs/cgroup/rdma.current /sys/fs/cgroup/rdma.max /sys/fs/cgroup /sys
umount: /sys/fs/cgroup/cgroup.controllers: not mounted.
umount: /sys/fs/cgroup/cgroup.events: not mounted.
umount: /sys/fs/cgroup/cgroup.freeze: not mounted.
umount: /sys/fs/cgroup/cgroup.kill: not mounted.
umount: /sys/fs/cgroup/cgroup.max.depth: not mounted.
umount: /sys/fs/cgroup/cgroup.max.descendants: not mounted.
umount: /sys/fs/cgroup/cgroup.pressure: not mounted.
umount: /sys/fs/cgroup/cgroup.procs: not mounted.
umount: /sys/fs/cgroup/cgroup.stat: not mounted.
umount: /sys/fs/cgroup/cgroup.subtree_control: not mounted.
umount: /sys/fs/cgroup/cgroup.threads: not mounted.
umount: /sys/fs/cgroup/cgroup.type: not mounted.
umount: /sys/fs/cgroup/cpu.idle: not mounted.
umount: /sys/fs/cgroup/cpu.max: not mounted.
umount: /sys/fs/cgroup/cpu.max.burst: not mounted.
umount: /sys/fs/cgroup/cpu.pressure: not mounted.
umount: /sys/fs/cgroup/cpu.stat: not mounted.
umount: /sys/fs/cgroup/cpu.stat.local: not mounted.
umount: /sys/fs/cgroup/cpu.uclamp.max: not mounted.
umount: /sys/fs/cgroup/cpu.uclamp.min: not mounted.
umount: /sys/fs/cgroup/cpu.weight: not mounted.
umount: /sys/fs/cgroup/cpu.weight.nice: not mounted.
umount: /sys/fs/cgroup/cpuset.cpus: not mounted.
umount: /sys/fs/cgroup/cpuset.cpus.effective: not mounted.
umount: /sys/fs/cgroup/cpuset.cpus.exclusive: not mounted.
umount: /sys/fs/cgroup/cpuset.cpus.exclusive.effective: not mounted.
umount: /sys/fs/cgroup/cpuset.cpus.partition: not mounted.
umount: /sys/fs/cgroup/cpuset.mems: not mounted.
umount: /sys/fs/cgroup/cpuset.mems.effective: not mounted.
umount: /sys/fs/cgroup/docker: not mounted.
umount: /sys/fs/cgroup/hugetlb.1GB.current: not mounted.
umount: /sys/fs/cgroup/hugetlb.1GB.events: not mounted.
umount: /sys/fs/cgroup/hugetlb.1GB.events.local: not mounted.
umount: /sys/fs/cgroup/hugetlb.1GB.max: not mounted.
umount: /sys/fs/cgroup/hugetlb.1GB.numa_stat: not mounted.
umount: /sys/fs/cgroup/hugetlb.1GB.rsvd.current: not mounted.
umount: /sys/fs/cgroup/hugetlb.1GB.rsvd.max: not mounted.
umount: /sys/fs/cgroup/hugetlb.2MB.current: not mounted.
umount: /sys/fs/cgroup/hugetlb.2MB.events: not mounted.
umount: /sys/fs/cgroup/hugetlb.2MB.events.local: not mounted.
umount: /sys/fs/cgroup/hugetlb.2MB.max: not mounted.
umount: /sys/fs/cgroup/hugetlb.2MB.numa_stat: not mounted.
umount: /sys/fs/cgroup/hugetlb.2MB.rsvd.current: not mounted.
umount: /sys/fs/cgroup/hugetlb.2MB.rsvd.max: not mounted.
umount: /sys/fs/cgroup/io.max: not mounted.
umount: /sys/fs/cgroup/io.pressure: not mounted.
umount: /sys/fs/cgroup/io.prio.class: not mounted.
umount: /sys/fs/cgroup/io.stat: not mounted.
umount: /sys/fs/cgroup/io.weight: not mounted.
umount: /sys/fs/cgroup/memory.current: not mounted.
umount: /sys/fs/cgroup/memory.events: not mounted.
umount: /sys/fs/cgroup/memory.events.local: not mounted.
umount: /sys/fs/cgroup/memory.high: not mounted.
umount: /sys/fs/cgroup/memory.low: not mounted.
umount: /sys/fs/cgroup/memory.max: not mounted.
umount: /sys/fs/cgroup/memory.min: not mounted.
umount: /sys/fs/cgroup/memory.numa_stat: not mounted.
umount: /sys/fs/cgroup/memory.oom.group: not mounted.
umount: /sys/fs/cgroup/memory.peak: not mounted.
umount: /sys/fs/cgroup/memory.pressure: not mounted.
umount: /sys/fs/cgroup/memory.reclaim: not mounted.
umount: /sys/fs/cgroup/memory.stat: not mounted.
umount: /sys/fs/cgroup/memory.swap.current: not mounted.
umount: /sys/fs/cgroup/memory.swap.events: not mounted.
umount: /sys/fs/cgroup/memory.swap.high: not mounted.
umount: /sys/fs/cgroup/memory.swap.max: not mounted.
umount: /sys/fs/cgroup/memory.swap.peak: not mounted.
umount: /sys/fs/cgroup/memory.zswap.current: not mounted.
umount: /sys/fs/cgroup/memory.zswap.max: not mounted.
umount: /sys/fs/cgroup/memory.zswap.writeback: not mounted.
umount: /sys/fs/cgroup/misc.current: not mounted.
umount: /sys/fs/cgroup/misc.events: not mounted.
umount: /sys/fs/cgroup/misc.max: not mounted.
umount: /sys/fs/cgroup/pids.current: not mounted.
umount: /sys/fs/cgroup/pids.events: not mounted.
umount: /sys/fs/cgroup/pids.max: not mounted.
umount: /sys/fs/cgroup/pids.peak: not mounted.
umount: /sys/fs/cgroup/rdma.current: not mounted.
umount: /sys/fs/cgroup/rdma.max: not mounted.
+ true
+ true
+ sudo LANG=C chroot ./fsroot-broadcom umount /proc
+ true
[ FAIL LOG END ] [ target/sonic-broadcom.bin ]
make: *** [slave.mk:1435: target/sonic-broadcom.bin] Error 1
make[1]: *** [Makefile.work:611: all] Error 2
make[1]: Leaving directory '/var/lib/jenkins/workspace/DevOps-test2/platform-broadcom'
make: *** [Makefile:53: all] Error 2
|