Content

상위 폴더로 이동
+++ --- Applying local submodule patches --- +++
  already applied: sonic-utilities
  already applied: sonic-swss
  already applied: sonic-swss-new
  already applied: sonic-sairedis-vslib
  already applied: sonic-sairedis-meta
  already applied: sonic-sairedis-SAI
  already applied: sonic-sairedis-SAI-apidef
  already applied: sonic-mgmt-framework
+++ --- Making all --- +++
./scripts/run_with_retry make BLDENV=bookworm -f Makefile.work all
make[1]: Entering directory '/var/lib/jenkins/workspace/DevOps-test3/platform-broadcom'
"SECURE_UPGRADE_PROD_SIGNING_TOOL": ""
~/workspace/DevOps-test3/platform-broadcom/src/sonic-build-hooks ~/workspace/DevOps-test3/platform-broadcom
make[2]: Entering directory '/var/lib/jenkins/workspace/DevOps-test3/platform-broadcom/src/sonic-build-hooks'
make[2]: *** [Makefile:35: buildinfo/sonic-build-hooks_1.0_all.deb] Error 4
make[2]: Leaving directory '/var/lib/jenkins/workspace/DevOps-test3/platform-broadcom/src/sonic-build-hooks'
make[1]: *** [Makefile.work:625: sonic-build-hooks] Error 2
make[1]: Leaving directory '/var/lib/jenkins/workspace/DevOps-test3/platform-broadcom'
make: *** [Makefile:53: all] Error 2