Content

상위 폴더로 이동
+++ --- Applying local submodule patches --- +++
/var/lib/jenkins/workspace/DevOps-test3/platform-vs/patches/sonic-utilities.patch:703: trailing whitespace.
import click
/var/lib/jenkins/workspace/DevOps-test3/platform-vs/patches/sonic-utilities.patch:704: trailing whitespace.
import utilities_common.cli as clicommon
/var/lib/jenkins/workspace/DevOps-test3/platform-vs/patches/sonic-utilities.patch:705: trailing whitespace.
import utilities_common.multi_asic as multi_asic_util
/var/lib/jenkins/workspace/DevOps-test3/platform-vs/patches/sonic-utilities.patch:706: trailing whitespace.
from sonic_py_common import multi_asic
/var/lib/jenkins/workspace/DevOps-test3/platform-vs/patches/sonic-utilities.patch:707: trailing whitespace.
from swsscommon.swsscommon import SonicV2Connector, ConfigDBConnector
warning: squelched 3487 whitespace errors
warning: 3492 lines add whitespace errors.
  applied:         sonic-utilities
/var/lib/jenkins/workspace/DevOps-test3/platform-vs/patches/sonic-swss.patch:88: trailing whitespace.
	
/var/lib/jenkins/workspace/DevOps-test3/platform-vs/patches/sonic-swss.patch:105: trailing whitespace.
        SWSS_LOG_NOTICE("Thi DEBUG [AclOrch]: Force supporting Enum value %d for dTel Action ID: 0x%x", 
/var/lib/jenkins/workspace/DevOps-test3/platform-vs/patches/sonic-swss.patch:112: trailing whitespace.
	
/var/lib/jenkins/workspace/DevOps-test3/platform-vs/patches/sonic-swss.patch:140: trailing whitespace.
	
/var/lib/jenkins/workspace/DevOps-test3/platform-vs/patches/sonic-swss.patch:284: trailing whitespace.
				
warning: squelched 2 whitespace errors
warning: 7 lines add whitespace errors.
  applied:         sonic-swss
/var/lib/jenkins/workspace/DevOps-test3/platform-vs/patches/sonic-swss-new.patch:7: trailing whitespace.
#include "ptporch.h"
/var/lib/jenkins/workspace/DevOps-test3/platform-vs/patches/sonic-swss-new.patch:8: trailing whitespace.
#include "saiptp.h" // Include header containing Vendor Extension IDs
/var/lib/jenkins/workspace/DevOps-test3/platform-vs/patches/sonic-swss-new.patch:9: trailing whitespace.
#include "logger.h"
/var/lib/jenkins/workspace/DevOps-test3/platform-vs/patches/sonic-swss-new.patch:10: trailing whitespace.
#include "sai_serialize.h"
/var/lib/jenkins/workspace/DevOps-test3/platform-vs/patches/sonic-swss-new.patch:11: trailing whitespace.
#include "tokenize.h"
warning: squelched 771 whitespace errors
warning: 776 lines add whitespace errors.
  applied:         sonic-swss-new
  applied:         sonic-sairedis-vslib
  applied:         sonic-sairedis-meta
  applied:         sonic-sairedis-SAI
  applied:         sonic-sairedis-SAI-apidef
  applied:         sonic-mgmt-framework
+++ --- Making all --- +++
./scripts/run_with_retry make BLDENV=bookworm -f Makefile.work all
make[1]: Entering directory '/var/lib/jenkins/workspace/DevOps-test3/platform-vs'
"SECURE_UPGRADE_PROD_SIGNING_TOOL": ""
~/workspace/DevOps-test3/platform-vs/src/sonic-build-hooks ~/workspace/DevOps-test3/platform-vs
make[2]: Entering directory '/var/lib/jenkins/workspace/DevOps-test3/platform-vs/src/sonic-build-hooks'
dpkg-deb: building package 'sonic-build-hooks' in 'buildinfo/sonic-build-hooks_1.0_all.deb'.
make[2]: Leaving directory '/var/lib/jenkins/workspace/DevOps-test3/platform-vs/src/sonic-build-hooks'
~/workspace/DevOps-test3/platform-vs
Checking sonic-slave-base image: sonic-slave-bookworm:2f250bfbb4a
Checking sonic-slave-user image: sonic-slave-bookworm-jenkins:d852e7d26e4
SONiC Build System

Build Configuration
"CONFIGURED_PLATFORM"             : "vs"
"CONFIGURED_ARCH"                 : "amd64"
"SONIC_CONFIG_PRINT_DEPENDENCIES" : ""
"SONIC_BUILD_JOBS"                : "4"
"SONIC_CONFIG_MAKE_JOBS"          : "112"
"USE_NATIVE_DOCKERD_FOR_BUILD"    : ""
"SONIC_USE_DOCKER_BUILDKIT"       : ""
"USERNAME"                        : "admin"
"PASSWORD"                        : "YourPaSsWoRd"
"CHANGE_DEFAULT_PASSWORD"         : "n"
"SECURE_UPGRADE_MODE"             : "no_sign"
"SECURE_UPGRADE_DEV_SIGNING_KEY"  : ""
"SECURE_UPGRADE_SIGNING_CERT"     : ""
"SECURE_UPGRADE_PROD_SIGNING_TOOL": ""
"SECURE_UPGRADE_PROD_TOOL_ARGS"   : ""
"ONIE_IMAGE_PART_SIZE"            : ""
"SHUTDOWN_BGP_ON_START"           : ""
"ENABLE_PFCWD_ON_START"           : ""
"SONIC_BUFFER_MODEL"              : ""
"INSTALL_DEBUG_TOOLS"             : ""
"ROUTING_STACK"                   : "frr"
"FRR_USER_UID"                    : "300"
"FRR_USER_GID"                    : "300"
"ENABLE_SYNCD_RPC"                : ""
"SAITHRIFT_V2"                    : ""
"ENABLE_ORGANIZATION_EXTENSIONS"  : "y"
"HTTP_PROXY"                      : ""
"HTTPS_PROXY"                     : ""
"NO_PROXY"                        : ""
"ENABLE_ZTP"                      : ""
"INCLUDE_PDE"                     : ""
"SONIC_DEBUGGING_ON"              : ""
"SONIC_PROFILING_ON"              : ""
"KERNEL_PROCURE_METHOD"           : "build"
"BUILD_TIMESTAMP"                 : "20260918.134825"
"BUILD_LOG_TIMESTAMP"             : "none"
"SONIC_IMAGE_VERSION"             : "etri-202505.2-8610ff460"
"BLDENV"                          : "bookworm"
"VS_PREPARE_MEM"                  : "yes"
"INCLUDE_MGMT_FRAMEWORK"          : "y"
"INCLUDE_ICCPD"                   : "n"
"INCLUDE_STP"                     : "y"
"INCLUDE_SYSTEM_TELEMETRY"        : "y"
"INCLUDE_SYSTEM_GNMI"             : "y"
"INCLUDE_SYSTEM_BMP"              : "y"
"INCLUDE_SYSTEM_EVENTD"           : "y"
"ENABLE_HOST_SERVICE_ON_START"    : "y"
"INCLUDE_RESTAPI"                 : "n"
"INCLUDE_SFLOW"                   : "y"
"INCLUDE_NAT"                     : "y"
"INCLUDE_DHCP_RELAY"              : "y"
"INCLUDE_DHCP_SERVER"             : "n"
"INCLUDE_P4RT"                    : "n"
"INCLUDE_VS_DASH_SAI"             : "y"
"INCLUDE_KUBERNETES"              : "n"
"INCLUDE_KUBERNETES_MASTER"       : "n"
"INCLUDE_MACSEC"                  : "y"
"INCLUDE_MUX"                     : "y"
"INCLUDE_TEAMD"                   : "y"
"INCLUDE_DASH_HA"                 : "y"
"INCLUDE_ROUTER_ADVERTISER"       : "y"
"INCLUDE_BOOTCHART                : "y"
"ENABLE_BOOTCHART                 : "n"
"INCLUDE_FIPS"                    : "y"
"ENABLE_TRANSLIB_WRITE"           : ""
"ENABLE_NATIVE_WRITE"             : "y"
"ENABLE_DIALOUT"                  : ""
"ENABLE_AUTO_TECH_SUPPORT"        : "y"
"PDDF_SUPPORT"                    : "y"
"MULTIARCH_QEMU_ENVIRON"          : "n"
"SONIC_VERSION_CONTROL_COMPONENTS": "py2,py3,web,git,docker"
"ENABLE_ASAN"                     : "n"
"DEFAULT_CONTAINER_REGISTRY"      : "publicmirror.azurecr.io/"
"BUILD_MULTIASIC_KVM"             : "n"
"CROSS_BUILD_ENVIRON"             : "n"
"LEGACY_SONIC_MGMT_DOCKER"        : "y"
"INCLUDE_EXTERNAL_PATCHES"        : "n"
"PTF_ENV_PY_VER"                  : "py3"
"ENABLE_MULTIDB"                  : ""

mv: cannot move '/etc/apt/sources.list.d/debian.sources' to '/etc/apt/sources.list.d/debian.sources.back': Permission denied
fatal: not a git repository (or any of the parent directories): .git
"SONIC_DPKG_CACHE_METHOD"         : "none"

[ building ] [ target/debs/bookworm/systemd-sonic-generator_1.0.0_amd64.deb ] 
[ building ] [ target/debs/bookworm/sonic-platform-vs_1.0_amd64.deb ] 
[ building ] [ target/debs/bookworm/initramfs-tools_0.142_all.deb ] 
[ building ] [ target/debs/bookworm/linux-headers-6.1.0-29-2-common_6.1.123-1_all.deb ] 
[ finished ] [ target/debs/bookworm/sonic-platform-vs_1.0_amd64.deb ] 
[ building ] [ target/debs/bookworm/sonic-device-data_1.0-1_all.deb ] 
[ finished ] [ target/debs/bookworm/initramfs-tools_0.142_all.deb ] 
[ building ] [ target/debs/bookworm/ifupdown2_3.0.0-1_all.deb ] 
[ finished ] [ target/debs/bookworm/systemd-sonic-generator_1.0.0_amd64.deb ] 
[ building ] [ target/debs/bookworm/kdump-tools_1.8.1_amd64.deb ] 
[ finished ] [ target/debs/bookworm/ifupdown2_3.0.0-1_all.deb ] 
[ building ] [ target/debs/bookworm/libpam-radius-auth_1.4.1-1_amd64.deb ] 
[ finished ] [ target/debs/bookworm/kdump-tools_1.8.1_amd64.deb ] 
[ building ] [ target/debs/bookworm/libnss-radius_1.0.1-1_amd64.deb ] 
[ finished ] [ target/debs/bookworm/libnss-radius_1.0.1-1_amd64.deb ] 
[ building ] [ target/debs/bookworm/libtac2_1.4.1-1_amd64.deb ] 
[ finished ] [ target/debs/bookworm/libtac2_1.4.1-1_amd64.deb ] 
[ building ] [ target/debs/bookworm/monit_5.20.0-6_amd64.deb ] 
[ finished ] [ target/debs/bookworm/libpam-radius-auth_1.4.1-1_amd64.deb ] 
[ building ] [ target/debs/bookworm/libnl-3-200_3.7.0-0.2+b1sonic1_amd64.deb ] 
[ finished ] [ target/debs/bookworm/monit_5.20.0-6_amd64.deb ] 
[ building ] [ target/debs/bookworm/libyang2t64_2.1.148-0.2_amd64.deb ] 
[ finished ] [ target/debs/bookworm/libyang2t64_2.1.148-0.2_amd64.deb ] 
[ building ] [ target/debs/bookworm/sonic-nettools_0.0.1-0_amd64.deb ] 
[ finished ] [ target/debs/bookworm/libnl-3-200_3.7.0-0.2+b1sonic1_amd64.deb ] 
[ building ] [ target/debs/bookworm/sonic-utilities-data_1.0-1_all.deb ] 
[ finished ] [ target/debs/bookworm/sonic-utilities-data_1.0-1_all.deb ] 
[ building ] [ target/debs/bookworm/sonic-host-services-data_1.0-1_all.deb ] 
[ finished ] [ target/debs/bookworm/sonic-host-services-data_1.0-1_all.deb ] 
[ building ] [ target/debs/bookworm/bash_5.1-2_amd64.deb ] 
[ finished ] [ target/debs/bookworm/sonic-nettools_0.0.1-0_amd64.deb ] 
[ FAIL LOG START ] [ target/debs/bookworm/sonic-nettools_0.0.1-0_amd64.deb ]
Build start time: Fri Sep 18 04:51:41 UTC 2026
[ REASON ] :      target/debs/bookworm/sonic-nettools_0.0.1-0_amd64.deb does not exist  
[ FLAGS  FILE    ] : [] 
[ FLAGS  DEPENDS ] : [] 
[ FLAGS  DIFF    ] : [] 
/sonic/src/sonic-nettools /sonic
dpkg-buildpackage: info: source package sonic-nettools
dpkg-buildpackage: info: source version 0.0.1-0
dpkg-buildpackage: info: source distribution UNRELEASED
dpkg-buildpackage: info: source changed by Wenda Chu 
 dpkg-source --before-build .
dpkg-buildpackage: info: host architecture amd64
 fakeroot debian/rules clean
make[1]: warning: jobserver unavailable: using -j1.  Add '+' to parent make rule.
make[1]: Entering directory '/sonic/src/sonic-nettools'
dh clean
   dh_auto_clean
	make -j112 clean
make[2]: Entering directory '/sonic/src/sonic-nettools'
rm -rf target
rm -rf bin
make[2]: Leaving directory '/sonic/src/sonic-nettools'
   dh_clean
make[1]: Leaving directory '/sonic/src/sonic-nettools'
 debian/rules build
make[1]: warning: jobserver unavailable: using -j1.  Add '+' to parent make rule.
make[1]: Entering directory '/sonic/src/sonic-nettools'
dh build
   dh_update_autotools_config
   dh_autoreconf
   dh_auto_configure
   dh_auto_build
	make -j112 "INSTALL=install --strip-program=true"
make[2]: Entering directory '/sonic/src/sonic-nettools'
mkdir -p bin
cargo test
warning: /sonic/src/sonic-nettools/wol/Cargo.toml: no edition set: defaulting to the 2015 edition while the latest is 2024
    Updating crates.io index
warning: spurious network error (3 tries remaining): [7] Could not connect to server (Failed to connect to index.crates.io port 443 after 3029 ms: Could not connect to server)
warning: spurious network error (2 tries remaining): [7] Could not connect to server (Failed to connect to index.crates.io port 443 after 1011 ms: Could not connect to server)
warning: spurious network error (1 tries remaining): [7] Could not connect to server (Failed to connect to index.crates.io port 443 after 1043 ms: Could not connect to server)
error: failed to get `clap` as a dependency of package `wol v0.0.1 (/sonic/src/sonic-nettools/wol)`

Caused by:
  download of config.json failed

Caused by:
  failed to download from `https://index.crates.io/config.json`

Caused by:
  [7] Could not connect to server (Failed to connect to index.crates.io port 443 after 1051 ms: Could not connect to server)
make[2]: *** [Makefile:5: /sonic-nettools_0.0.1-0_amd64.deb] Error 101
make[2]: Leaving directory '/sonic/src/sonic-nettools'
dh_auto_build: error: make -j112 "INSTALL=install --strip-program=true" returned exit code 2
make[1]: *** [debian/rules:3: build] Error 25
make[1]: Leaving directory '/sonic/src/sonic-nettools'
dpkg-buildpackage: error: debian/rules build subprocess returned exit status 2
[  FAIL LOG END  ] [ target/debs/bookworm/sonic-nettools_0.0.1-0_amd64.deb ]
make: *** [slave.mk:797: target/debs/bookworm/sonic-nettools_0.0.1-0_amd64.deb] Error 1
make: *** Waiting for unfinished jobs....
[ finished ] [ target/debs/bookworm/bash_5.1-2_amd64.deb ] 
[ finished ] [ target/debs/bookworm/sonic-device-data_1.0-1_all.deb ] 
[ finished ] [ target/debs/bookworm/linux-headers-6.1.0-29-2-common_6.1.123-1_all.deb ] 
make[1]: *** [Makefile.work:611: all] Error 2
make[1]: Leaving directory '/var/lib/jenkins/workspace/DevOps-test3/platform-vs'
make: *** [Makefile:53: all] Error 2