Content

상위 폴더로 이동
+++ --- Applying local submodule patches --- +++
  already applied: sonic-utilities
  already applied: sonic-swss
  already applied: sonic-swss-new
  already applied: sonic-sairedis-vslib
  already applied: sonic-sairedis-meta
  already applied: sonic-sairedis-SAI
  already applied: sonic-sairedis-SAI-apidef
  already applied: sonic-mgmt-framework
+++ --- Making all --- +++
./scripts/run_with_retry make BLDENV=bookworm -f Makefile.work all
make[1]: Entering directory '/var/lib/jenkins/workspace/DevOps-test3/platform-vs'
"SECURE_UPGRADE_PROD_SIGNING_TOOL": ""
~/workspace/DevOps-test3/platform-vs/src/sonic-build-hooks ~/workspace/DevOps-test3/platform-vs
make[2]: Entering directory '/var/lib/jenkins/workspace/DevOps-test3/platform-vs/src/sonic-build-hooks'
dpkg-deb: building package 'sonic-build-hooks' in 'buildinfo/sonic-build-hooks_1.0_all.deb'.
make[2]: Leaving directory '/var/lib/jenkins/workspace/DevOps-test3/platform-vs/src/sonic-build-hooks'
~/workspace/DevOps-test3/platform-vs
Checking sonic-slave-base image: sonic-slave-bookworm:2f250bfbb4a
Checking sonic-slave-user image: sonic-slave-bookworm-jenkins:d852e7d26e4
SONiC Build System

Build Configuration
"CONFIGURED_PLATFORM"             : "vs"
"CONFIGURED_ARCH"                 : "amd64"
"SONIC_CONFIG_PRINT_DEPENDENCIES" : ""
"SONIC_BUILD_JOBS"                : "4"
"SONIC_CONFIG_MAKE_JOBS"          : "112"
"USE_NATIVE_DOCKERD_FOR_BUILD"    : ""
"SONIC_USE_DOCKER_BUILDKIT"       : ""
"USERNAME"                        : "admin"
"PASSWORD"                        : "YourPaSsWoRd"
"CHANGE_DEFAULT_PASSWORD"         : "n"
"SECURE_UPGRADE_MODE"             : "no_sign"
"SECURE_UPGRADE_DEV_SIGNING_KEY"  : ""
"SECURE_UPGRADE_SIGNING_CERT"     : ""
"SECURE_UPGRADE_PROD_SIGNING_TOOL": ""
"SECURE_UPGRADE_PROD_TOOL_ARGS"   : ""
"ONIE_IMAGE_PART_SIZE"            : ""
"SHUTDOWN_BGP_ON_START"           : ""
"ENABLE_PFCWD_ON_START"           : ""
"SONIC_BUFFER_MODEL"              : ""
"INSTALL_DEBUG_TOOLS"             : ""
"ROUTING_STACK"                   : "frr"
"FRR_USER_UID"                    : "300"
"FRR_USER_GID"                    : "300"
"ENABLE_SYNCD_RPC"                : ""
"SAITHRIFT_V2"                    : ""
"ENABLE_ORGANIZATION_EXTENSIONS"  : "y"
"HTTP_PROXY"                      : ""
"HTTPS_PROXY"                     : ""
"NO_PROXY"                        : ""
"ENABLE_ZTP"                      : ""
"INCLUDE_PDE"                     : ""
"SONIC_DEBUGGING_ON"              : ""
"SONIC_PROFILING_ON"              : ""
"KERNEL_PROCURE_METHOD"           : "build"
"BUILD_TIMESTAMP"                 : "20260918.153340"
"BUILD_LOG_TIMESTAMP"             : "none"
"SONIC_IMAGE_VERSION"             : "etri-202505.2-8610ff460"
"BLDENV"                          : "bookworm"
"VS_PREPARE_MEM"                  : "yes"
"INCLUDE_MGMT_FRAMEWORK"          : "y"
"INCLUDE_ICCPD"                   : "n"
"INCLUDE_STP"                     : "y"
"INCLUDE_SYSTEM_TELEMETRY"        : "y"
"INCLUDE_SYSTEM_GNMI"             : "y"
"INCLUDE_SYSTEM_BMP"              : "y"
"INCLUDE_SYSTEM_EVENTD"           : "y"
"ENABLE_HOST_SERVICE_ON_START"    : "y"
"INCLUDE_RESTAPI"                 : "n"
"INCLUDE_SFLOW"                   : "y"
"INCLUDE_NAT"                     : "y"
"INCLUDE_DHCP_RELAY"              : "y"
"INCLUDE_DHCP_SERVER"             : "n"
"INCLUDE_P4RT"                    : "n"
"INCLUDE_VS_DASH_SAI"             : "y"
"INCLUDE_KUBERNETES"              : "n"
"INCLUDE_KUBERNETES_MASTER"       : "n"
"INCLUDE_MACSEC"                  : "y"
"INCLUDE_MUX"                     : "y"
"INCLUDE_TEAMD"                   : "y"
"INCLUDE_DASH_HA"                 : "y"
"INCLUDE_ROUTER_ADVERTISER"       : "y"
"INCLUDE_BOOTCHART                : "y"
"ENABLE_BOOTCHART                 : "n"
"INCLUDE_FIPS"                    : "y"
"ENABLE_TRANSLIB_WRITE"           : ""
"ENABLE_NATIVE_WRITE"             : "y"
"ENABLE_DIALOUT"                  : ""
"ENABLE_AUTO_TECH_SUPPORT"        : "y"
"PDDF_SUPPORT"                    : "y"
"MULTIARCH_QEMU_ENVIRON"          : "n"
"SONIC_VERSION_CONTROL_COMPONENTS": "py2,py3,web,git,docker"
"ENABLE_ASAN"                     : "n"
"DEFAULT_CONTAINER_REGISTRY"      : "publicmirror.azurecr.io/"
"BUILD_MULTIASIC_KVM"             : "n"
"CROSS_BUILD_ENVIRON"             : "n"
"LEGACY_SONIC_MGMT_DOCKER"        : "y"
"INCLUDE_EXTERNAL_PATCHES"        : "n"
"PTF_ENV_PY_VER"                  : "py3"
"ENABLE_MULTIDB"                  : ""

mv: cannot move '/etc/apt/sources.list.d/debian.sources' to '/etc/apt/sources.list.d/debian.sources.back': Permission denied
fatal: not a git repository (or any of the parent directories): .git
"SONIC_DPKG_CACHE_METHOD"         : "none"

[ building ] [ target/python-wheels/bookworm/redis_dump_load-1.1-py3-none-any.whl-install ] 
[ building ] [ target/debs/bookworm/libnl-3-200_3.7.0-0.2+b1sonic1_amd64.deb-install ] 
[ building ] [ target/debs/bookworm/libyang_1.0.73_amd64.deb-install ] 
[ building ] [ target/python-wheels/bookworm/sonic_yang_models-1.0-py3-none-any.whl-install ] 
[ finished ] [ target/debs/bookworm/libnl-3-200_3.7.0-0.2+b1sonic1_amd64.deb-install ] 
[ building ] [ target/debs/bookworm/libnl-3-dev_3.7.0-0.2+b1sonic1_amd64.deb-install ] 
[ finished ] [ target/debs/bookworm/libnl-3-dev_3.7.0-0.2+b1sonic1_amd64.deb-install ] 
[ building ] [ target/debs/bookworm/libnl-genl-3-200_3.7.0-0.2+b1sonic1_amd64.deb-install ] 
[ finished ] [ target/python-wheels/bookworm/redis_dump_load-1.1-py3-none-any.whl-install ] 
[ finished ] [ target/debs/bookworm/libnl-genl-3-200_3.7.0-0.2+b1sonic1_amd64.deb-install ] 
[ building ] [ target/debs/bookworm/libnl-route-3-200_3.7.0-0.2+b1sonic1_amd64.deb-install ] 
[ building ] [ target/python-wheels/bookworm/swsssdk-2.0.1-py3-none-any.whl-install ] 
[ finished ] [ target/debs/bookworm/libnl-route-3-200_3.7.0-0.2+b1sonic1_amd64.deb-install ] 
[ building ] [ target/debs/bookworm/libnl-genl-3-dev_3.7.0-0.2+b1sonic1_amd64.deb-install ] 
[ finished ] [ target/debs/bookworm/libnl-genl-3-dev_3.7.0-0.2+b1sonic1_amd64.deb-install ] 
[ building ] [ target/debs/bookworm/libnl-route-3-dev_3.7.0-0.2+b1sonic1_amd64.deb-install ] 
[ finished ] [ target/python-wheels/bookworm/sonic_yang_models-1.0-py3-none-any.whl-install ] 
[ building ] [ target/debs/bookworm/p4lang-pi_0.1.0-15_amd64.deb-install ] 
[ finished ] [ target/debs/bookworm/libnl-route-3-dev_3.7.0-0.2+b1sonic1_amd64.deb-install ] 
[ building ] [ target/debs/bookworm/libdashapi_1.0.0_amd64.deb-install ] 
[ finished ] [ target/debs/bookworm/libdashapi_1.0.0_amd64.deb-install ] 
[ building ] [ target/python-wheels/bookworm/sonic_yang_mgmt-1.0-py3-none-any.whl-install ] 
[ finished ] [ target/python-wheels/bookworm/swsssdk-2.0.1-py3-none-any.whl-install ] 
[ building ] [ target/debs/bookworm/libnl-nf-3-200_3.7.0-0.2+b1sonic1_amd64.deb-install ] 
[ finished ] [ target/debs/bookworm/libnl-nf-3-200_3.7.0-0.2+b1sonic1_amd64.deb-install ] 
[ building ] [ target/python-wheels/bookworm/sonic_py_common-1.0-py3-none-any.whl-install ] 
[ finished ] [ target/python-wheels/bookworm/sonic_yang_mgmt-1.0-py3-none-any.whl-install ] 
[ building ] [ target/debs/bookworm/libnl-nf-3-dev_3.7.0-0.2+b1sonic1_amd64.deb-install ] 
[ finished ] [ target/debs/bookworm/libnl-nf-3-dev_3.7.0-0.2+b1sonic1_amd64.deb-install ] 
[ building ] [ target/docker-base-bookworm.gz-load ] 
[ finished ] [ target/python-wheels/bookworm/sonic_py_common-1.0-py3-none-any.whl-install ] 
[ building ] [ target/debs/bookworm/libnl-cli-3-200_3.7.0-0.2+b1sonic1_amd64.deb-install ] 
[ finished ] [ target/debs/bookworm/libnl-cli-3-200_3.7.0-0.2+b1sonic1_amd64.deb-install ] 
[ building ] [ target/sonic-vs.bin__vs__rfs.squashfs ] 
[ finished ] [ target/docker-base-bookworm.gz-load ] 
[ building ] [ target/files/bookworm/sonic_version.yml ] 
[ finished ] [ target/debs/bookworm/libyang_1.0.73_amd64.deb-install ] 
[ building ] [ target/debs/bookworm/libnl-cli-3-dev_3.7.0-0.2+b1sonic1_amd64.deb-install ] 
[ finished ] [ target/debs/bookworm/libnl-cli-3-dev_3.7.0-0.2+b1sonic1_amd64.deb-install ] 
[ building ] [ target/debs/bookworm/libyang-dev_1.0.73_amd64.deb-install ] 
[ finished ] [ target/files/bookworm/sonic_version.yml ] 
[ building ] [ target/debs/bookworm/libyang-cpp_1.0.73_amd64.deb-install ] 
[ finished ] [ target/debs/bookworm/libyang-dev_1.0.73_amd64.deb-install ] 
[ building ] [ target/debs/bookworm/libteam5_1.31-1_amd64.deb-install ] 
[ finished ] [ target/debs/bookworm/libteam5_1.31-1_amd64.deb-install ] 
[ building ] [ target/debs/bookworm/sonic-mgmt-common_1.0.0_amd64.deb-install ] 
[ finished ] [ target/debs/bookworm/sonic-mgmt-common_1.0.0_amd64.deb-install ] 
[ building ] [ target/python-wheels/bookworm/sonic_pcied-1.0-py3-none-any.whl ] 
[ finished ] [ target/debs/bookworm/p4lang-pi_0.1.0-15_amd64.deb-install ] 
[ building ] [ target/python-wheels/bookworm/sonic_stormond-1.0-py3-none-any.whl ] 
[ finished ] [ target/debs/bookworm/libyang-cpp_1.0.73_amd64.deb-install ] 
[ building ] [ target/debs/bookworm/python3-yang_1.0.73_amd64.deb-install ] 
[ finished ] [ target/debs/bookworm/python3-yang_1.0.73_amd64.deb-install ] 
[ building ] [ target/debs/bookworm/p4lang-bmv2_1.15.0-7_amd64.deb-install ] 
[ finished ] [ target/debs/bookworm/p4lang-bmv2_1.15.0-7_amd64.deb-install ] 
[ building ] [ target/debs/bookworm/libswsscommon_1.0.0_amd64.deb-install ] 
[ finished ] [ target/debs/bookworm/libswsscommon_1.0.0_amd64.deb-install ] 
[ building ] [ target/debs/bookworm/p4lang-p4c_1.2.4.2-2_amd64.deb-install ] 
[ finished ] [ target/python-wheels/bookworm/sonic_pcied-1.0-py3-none-any.whl ] 
[ building ] [ target/debs/bookworm/libswsscommon-dev_1.0.0_amd64.deb-install ] 
[ finished ] [ target/debs/bookworm/p4lang-p4c_1.2.4.2-2_amd64.deb-install ] 
[ building ] [ target/debs/bookworm/libteamdctl0_1.31-1_amd64.deb-install ] 
[ finished ] [ target/debs/bookworm/libteamdctl0_1.31-1_amd64.deb-install ] 
[ building ] [ target/debs/bookworm/libsai_1.0.0_amd64.deb-install ] 
[ finished ] [ target/debs/bookworm/libsai_1.0.0_amd64.deb-install ] 
[ building ] [ target/debs/bookworm/python3-swsscommon_1.0.0_amd64.deb-install ] 
[ finished ] [ target/debs/bookworm/python3-swsscommon_1.0.0_amd64.deb-install ] 
[ building ] [ target/debs/bookworm/sonic-mgmt-common-codegen_1.0.0_amd64.deb-install ] 
[ finished ] [ target/debs/bookworm/sonic-mgmt-common-codegen_1.0.0_amd64.deb-install ] 
[ building ] [ target/python-wheels/bookworm/sonic_d-2.0.0-py3-none-any.whl ] 
[ finished ] [ target/debs/bookworm/libswsscommon-dev_1.0.0_amd64.deb-install ] 
[ building ] [ target/python-wheels/bookworm/sonic_ledd-1.1-py3-none-any.whl ] 
[ finished ] [ target/python-wheels/bookworm/sonic_stormond-1.0-py3-none-any.whl ] 
[ building ] [ target/debs/bookworm/sysmgr_1.0.0_amd64.deb ] 
[ finished ] [ target/python-wheels/bookworm/sonic_d-2.0.0-py3-none-any.whl ] 
[ building ] [ target/debs/bookworm/sonic-dhcpmon_1.0.0-0_amd64.deb ] 
[ finished ] [ target/python-wheels/bookworm/sonic_ledd-1.1-py3-none-any.whl ] 
[ building ] [ target/debs/bookworm/sonic-dhcp6relay_1.0.0-0_amd64.deb ] 
[ finished ] [ target/debs/bookworm/sonic-dhcpmon_1.0.0-0_amd64.deb ] 
[ building ] [ target/python-wheels/bookworm/sonic_dhcp_utilities-1.0-py3-none-any.whl ] 
[ finished ] [ target/python-wheels/bookworm/sonic_dhcp_utilities-1.0-py3-none-any.whl ] 
[ building ] [ target/debs/bookworm/wpasupplicant_2.9.0-14_amd64.deb ] 
[ finished ] [ target/debs/bookworm/sonic-dhcp6relay_1.0.0-0_amd64.deb ] 
[ building ] [ target/python-wheels/bookworm/sonic_ctrmgrd-1.0.0-py3-none-any.whl ] 
[ finished ] [ target/debs/bookworm/wpasupplicant_2.9.0-14_amd64.deb ] 
[ building ] [ target/python-wheels/bookworm/sonic_containercfgd-1.0-py3-none-any.whl ] 
[ finished ] [ target/python-wheels/bookworm/sonic_containercfgd-1.0-py3-none-any.whl ] 
[ building ] [ target/python-wheels/bookworm/sonic_config_engine-1.0-py3-none-any.whl ] 
[ finished ] [ target/python-wheels/bookworm/sonic_ctrmgrd-1.0.0-py3-none-any.whl ] 
[ building ] [ target/debs/bookworm/sonic-bmp_0.1_amd64.deb-install ] 
[ finished ] [ target/debs/bookworm/sonic-bmp_0.1_amd64.deb-install ] 
[ building ] [ target/debs/bookworm/dash-ha_1.0.0_amd64.deb ] 
[ finished ] [ target/debs/bookworm/sysmgr_1.0.0_amd64.deb ] 
[ building ] [ target/debs/bookworm/libsairedis_1.0.0_amd64.deb ] 
[ finished ] [ target/debs/bookworm/dash-ha_1.0.0_amd64.deb ] 
[ building ] [ target/debs/bookworm/libteam-dev_1.31-1_amd64.deb-install ] 
[ finished ] [ target/debs/bookworm/libteam-dev_1.31-1_amd64.deb-install ] 
[ building ] [ target/debs/bookworm/libteam-utils_1.31-1_amd64.deb-install ] 
[ finished ] [ target/debs/bookworm/libteam-utils_1.31-1_amd64.deb-install ] 
[ building ] [ target/debs/bookworm/stp_1.0.0_amd64.deb-install ] 
[ finished ] [ target/debs/bookworm/stp_1.0.0_amd64.deb-install ] 
[ building ] [ target/debs/bookworm/sonic-gnmi_0.1_amd64.deb ] 
[ finished ] [ target/debs/bookworm/sonic-gnmi_0.1_amd64.deb ] 
[ building ] [ target/debs/bookworm/sonic-linkmgrd_1.0.0-1_amd64.deb ] 
[ finished ] [ target/python-wheels/bookworm/sonic_config_engine-1.0-py3-none-any.whl ] 
[ building ] [ target/docker-config-engine-bookworm.gz ] 
[ finished ] [ target/debs/bookworm/libsairedis_1.0.0_amd64.deb ] 
[ building ] [ target/python-wheels/bookworm/sonic_config_engine-1.0-py3-none-any.whl-install ] 
[ finished ] [ target/python-wheels/bookworm/sonic_config_engine-1.0-py3-none-any.whl-install ] 
[ building ] [ target/debs/bookworm/libsairedis-dev_1.0.0_amd64.deb ] 
[ finished ] [ target/debs/bookworm/libsairedis-dev_1.0.0_amd64.deb ] 
[ building ] [ target/debs/bookworm/libsaimetadata_1.0.0_amd64.deb ] 
[ finished ] [ target/debs/bookworm/libsaimetadata_1.0.0_amd64.deb ] 
[ building ] [ target/debs/bookworm/libsaivs_1.0.0_amd64.deb ] 
[ finished ] [ target/debs/bookworm/libsaivs_1.0.0_amd64.deb ] 
[ building ] [ target/debs/bookworm/libsairedis_1.0.0_amd64.deb-install ] 
[ finished ] [ target/debs/bookworm/libsairedis_1.0.0_amd64.deb-install ] 
[ building ] [ target/python-wheels/bookworm/sonic_bgpcfgd-1.0-py3-none-any.whl ] 
[ finished ] [ target/python-wheels/bookworm/sonic_bgpcfgd-1.0-py3-none-any.whl ] 
[ building ] [ target/python-wheels/bookworm/sonic_frr_mgmt_framework-1.0-py3-none-any.whl ] 
[ finished ] [ target/docker-config-engine-bookworm.gz ] 
[ building ] [ target/debs/bookworm/syncd-vs_1.0.0_amd64.deb ] 
[ finished ] [ target/debs/bookworm/syncd-vs_1.0.0_amd64.deb ] 
[ building ] [ target/docker-config-engine-bookworm.gz-load ] 
[ finished ] [ target/python-wheels/bookworm/sonic_frr_mgmt_framework-1.0-py3-none-any.whl ] 
[ building ] [ target/python-wheels/bookworm/system_health-1.0-py3-none-any.whl ] 
[ finished ] [ target/docker-config-engine-bookworm.gz-load ] 
[ building ] [ target/docker-auditd-watchdog.gz ] 
[ finished ] [ target/python-wheels/bookworm/system_health-1.0-py3-none-any.whl ] 
[ building ] [ target/docker-auditd.gz ] 
[ finished ] [ target/docker-auditd.gz ] 
[ building ] [ target/docker-bmp-watchdog.gz ] 
[ finished ] [ target/docker-auditd-watchdog.gz ] 
[ building ] [ target/python-wheels/bookworm/sonic_platform_common-1.0-py3-none-any.whl ] 
[ finished ] [ target/docker-bmp-watchdog.gz ] 
[ FAIL LOG START ] [ target/docker-bmp-watchdog.gz ]
Build start time: Fri Sep 18 06:44:12 UTC 2026
[ REASON ] :      target/docker-bmp-watchdog.gz does not exist   NON-EXISTENT PREREQUISITES: docker-start target/docker-config-engine-bookworm.gz-load 
[ FLAGS  FILE    ] : [] 
[ FLAGS  DEPENDS ] : [] 
[ FLAGS  DIFF    ] : [] 
Client: Docker Engine - Community
 Version:    24.0.2
 Context:    default
 Debug Mode: false
 Plugins:
  buildx: Docker Buildx (Docker Inc.)
    Version:  v0.10.5
    Path:     /usr/libexec/docker/cli-plugins/docker-buildx
  compose: Docker Compose (Docker Inc.)
    Version:  v2.18.1
    Path:     /usr/libexec/docker/cli-plugins/docker-compose

Server:
 Containers: 1
  Running: 1
  Paused: 0
  Stopped: 0
 Images: 64
 Server Version: 24.0.2
 Storage Driver: overlay2
  Backing Filesystem: extfs
  Supports d_type: true
  Using metacopy: false
  Native Overlay Diff: true
  userxattr: false
 Logging Driver: json-file
 Cgroup Driver: cgroupfs
 Cgroup Version: 2
 Plugins:
  Volume: local
  Network: bridge host ipvlan macvlan null overlay
  Log: awslogs fluentd gcplogs gelf journald json-file local logentries splunk syslog
 Swarm: inactive
 Runtimes: io.containerd.runc.v2 runc
 Default Runtime: runc
 Init Binary: docker-init
 containerd version: 3dce8eb055cbb6872793272b4f20ed16117344f8
 runc version: v1.1.7-0-g860f061
 init version: de40ad0
 Security Options:
  seccomp
   Profile: builtin
  cgroupns
 Kernel Version: 6.8.0-107-generic
 Operating System: Debian GNU/Linux 12 (bookworm)
 OSType: linux
 Architecture: x86_64
 CPUs: 112
 Total Memory: 503.3GiB
 Name: 4aadf56f46e7
 ID: 57c8cf99-5005-4e47-9eec-7cd4f6b687d9
 Docker Root Dir: /var/lib/docker
 Debug Mode: false
 Experimental: true
 Insecure Registries:
  127.0.0.0/8
 Live Restore Enabled: false

DEPRECATED: The legacy builder is deprecated and will be removed in a future release.
            BuildKit is currently disabled; enable it by removing the DOCKER_BUILDKIT=0
            environment-variable.

Sending build context to Docker daemon  681.6MB

Step 1/32 : FROM docker-config-engine-bookworm-sonic:latest AS builder
 ---> 3a70f2e85171
Step 2/32 : ARG SONIC_VERSION_CACHE
 ---> Running in 1f05f0b6ab88
Removing intermediate container 1f05f0b6ab88
 ---> e97da04546ec
Step 3/32 : ARG SONIC_VERSION_CONTROL_COMPONENTS
 ---> Running in 48581a50547d
Removing intermediate container 48581a50547d
 ---> 02458ac544ec
Step 4/32 : COPY ["buildinfo", "/usr/local/share/buildinfo"]
 ---> 0a8f44017ed6
Step 5/32 : COPY vcache/ /sonic/target/vcache/docker-bmp-watchdog
 ---> 665cab39f8bf
Step 6/32 : RUN dpkg -i /usr/local/share/buildinfo/sonic-build-hooks_1.0_all.deb
 ---> Running in 0239549543d8
(Reading database ... 11235 files and directories currently installed.)
Preparing to unpack .../sonic-build-hooks_1.0_all.deb ...
Unpacking sonic-build-hooks (1.0) over (1.0) ...
Setting up sonic-build-hooks (1.0) ...
Removing intermediate container 0239549543d8
 ---> ce5d2380889e
Step 7/32 : ENV IMAGENAME=docker-bmp-watchdog
 ---> Running in 62a69bc8df6b
Removing intermediate container 62a69bc8df6b
 ---> 04fb1a024176
Step 8/32 : ENV DISTRO=bookworm
 ---> Running in 975a71c6cd35
Removing intermediate container 975a71c6cd35
 ---> c59b7fe9f922
Step 9/32 : RUN pre_run_buildinfo docker-bmp-watchdog
 ---> Running in 7fcbbb4ec6d2
Removing intermediate container 7fcbbb4ec6d2
 ---> e096c30ac045
Step 10/32 : RUN apt-get update && apt-get install -y     build-essential
 ---> Running in 774b5fcb41d2
Get:1 http://debian-archive.trafficmanager.net/debian bookworm InRelease [151 kB]
Get:2 http://debian-archive.trafficmanager.net/debian bookworm-updates InRelease [55.4 kB]
Get:3 http://debian-archive.trafficmanager.net/debian bookworm-backports InRelease [59.4 kB]
Get:4 http://debian-archive.trafficmanager.net/debian-security bookworm-security InRelease [34.8 kB]
Get:5 http://debian-archive.trafficmanager.net/debian bookworm/non-free-firmware Sources [7152 B]
Get:6 http://debian-archive.trafficmanager.net/debian bookworm/main Sources [9492 kB]
Get:7 http://debian-archive.trafficmanager.net/debian bookworm/contrib Sources [51.1 kB]
Get:8 http://debian-archive.trafficmanager.net/debian bookworm/non-free-firmware amd64 Packages [6368 B]
Get:9 http://debian-archive.trafficmanager.net/debian bookworm/main amd64 Packages [8790 kB]
Get:10 http://debian-archive.trafficmanager.net/debian bookworm/contrib amd64 Packages [53.5 kB]
Get:11 http://debian-archive.trafficmanager.net/debian bookworm-updates/main Sources [3288 B]
Get:12 http://debian-archive.trafficmanager.net/debian bookworm-updates/main amd64 Packages [6924 B]
Get:13 http://debian-archive.trafficmanager.net/debian bookworm-backports/non-free-firmware amd64 Packages [3828 B]
Get:14 http://debian-archive.trafficmanager.net/debian bookworm-backports/contrib amd64 Packages [5856 B]
Get:15 http://debian-archive.trafficmanager.net/debian bookworm-backports/main amd64 Packages [314 kB]
Get:16 http://debian-archive.trafficmanager.net/debian-security bookworm-security/contrib Sources [1224 B]
Get:17 http://debian-archive.trafficmanager.net/debian-security bookworm-security/non-free-firmware Sources [1988 B]
Get:18 http://debian-archive.trafficmanager.net/debian-security bookworm-security/main Sources [250 kB]
Get:19 http://debian-archive.trafficmanager.net/debian-security bookworm-security/contrib amd64 Packages [1456 B]
Get:20 http://debian-archive.trafficmanager.net/debian-security bookworm-security/non-free-firmware amd64 Packages [940 B]
Get:21 http://debian-archive.trafficmanager.net/debian-security bookworm-security/main amd64 Packages [339 kB]
Fetched 19.6 MB in 4s (5324 kB/s)
Reading package lists...
Reading package lists...
Building dependency tree...
Reading state information...
The following additional packages will be installed:
  binutils binutils-common binutils-x86-64-linux-gnu bzip2 cpp cpp-12 dpkg-dev
  g++ g++-12 gcc gcc-12 libasan8 libbinutils libc-dev-bin libc6-dev libcc1-0
  libcrypt-dev libctf-nobfd0 libctf0 libdpkg-perl libgcc-12-dev libgomp1
  libgprofng0 libisl23 libitm1 liblsan0 libmpc3 libmpfr6 libnsl-dev
  libquadmath0 libstdc++-12-dev libtirpc-dev libtsan2 libubsan1 linux-libc-dev
  make patch rpcsvc-proto xz-utils
Suggested packages:
  binutils-doc bzip2-doc cpp-doc gcc-12-locales cpp-12-doc debian-keyring
  g++-multilib g++-12-multilib gcc-12-doc gcc-multilib manpages-dev autoconf
  automake libtool flex bison gdb gcc-doc gcc-12-multilib glibc-doc gnupg | sq
  | sqop | pgpainless-cli sensible-utils git bzr libstdc++-12-doc make-doc ed
  diffutils-doc
Recommended packages:
  fakeroot gnupg | sq | sqop | pgpainless-cli libalgorithm-merge-perl manpages
  manpages-dev libc-devtools libfile-fcntllock-perl liblocale-gettext-perl
The following NEW packages will be installed:
  binutils binutils-common binutils-x86-64-linux-gnu build-essential bzip2 cpp
  cpp-12 dpkg-dev g++ g++-12 gcc gcc-12 libasan8 libbinutils libc-dev-bin
  libc6-dev libcc1-0 libcrypt-dev libctf-nobfd0 libctf0 libdpkg-perl
  libgcc-12-dev libgomp1 libgprofng0 libisl23 libitm1 liblsan0 libmpc3
  libmpfr6 libnsl-dev libquadmath0 libstdc++-12-dev libtirpc-dev libtsan2
  libubsan1 linux-libc-dev make patch rpcsvc-proto xz-utils
0 upgraded, 40 newly installed, 0 to remove and 26 not upgraded.
Need to get 66.4 MB of archives.
After this operation, 265 MB of additional disk space will be used.
Get:1 http://debian-archive.trafficmanager.net/debian bookworm/main amd64 bzip2 amd64 1.0.8-5+b1 [49.8 kB]
Get:2 http://debian-archive.trafficmanager.net/debian-security bookworm-security/main amd64 xz-utils amd64 5.4.1-1+deb12u2 [471 kB]
Get:3 http://debian-archive.trafficmanager.net/debian bookworm/main amd64 binutils-common amd64 2.40-2 [2487 kB]
Get:4 http://debian-archive.trafficmanager.net/debian bookworm/main amd64 libbinutils amd64 2.40-2 [572 kB]
Get:5 http://debian-archive.trafficmanager.net/debian bookworm/main amd64 libctf-nobfd0 amd64 2.40-2 [153 kB]
Get:6 http://debian-archive.trafficmanager.net/debian bookworm/main amd64 libctf0 amd64 2.40-2 [89.8 kB]
Get:7 http://debian-archive.trafficmanager.net/debian bookworm/main amd64 libgprofng0 amd64 2.40-2 [812 kB]
Get:8 http://debian-archive.trafficmanager.net/debian bookworm/main amd64 binutils-x86-64-linux-gnu amd64 2.40-2 [2246 kB]
Get:9 http://debian-archive.trafficmanager.net/debian bookworm/main amd64 binutils amd64 2.40-2 [65.0 kB]
Get:10 http://debian-archive.trafficmanager.net/debian bookworm/main amd64 libc-dev-bin amd64 2.36-9+deb12u14 [48.1 kB]
Get:11 http://debian-archive.trafficmanager.net/debian-security bookworm-security/main amd64 linux-libc-dev amd64 6.1.187-1 [2357 kB]
Get:12 http://debian-archive.trafficmanager.net/debian bookworm/main amd64 libcrypt-dev amd64 1:4.4.33-2 [118 kB]
Get:13 http://debian-archive.trafficmanager.net/debian bookworm/main amd64 libtirpc-dev amd64 1.3.3+ds-1 [191 kB]
Get:14 http://debian-archive.trafficmanager.net/debian bookworm/main amd64 libnsl-dev amd64 1.3.0-2 [66.4 kB]
Get:15 http://debian-archive.trafficmanager.net/debian bookworm/main amd64 rpcsvc-proto amd64 1.4.3-1 [63.3 kB]
Get:16 http://debian-archive.trafficmanager.net/debian bookworm/main amd64 libc6-dev amd64 2.36-9+deb12u14 [1904 kB]
Get:17 http://debian-archive.trafficmanager.net/debian bookworm/main amd64 libisl23 amd64 0.25-1.1 [683 kB]
Get:18 http://debian-archive.trafficmanager.net/debian bookworm/main amd64 libmpfr6 amd64 4.2.0-1 [701 kB]
Get:19 http://debian-archive.trafficmanager.net/debian bookworm/main amd64 libmpc3 amd64 1.3.1-1 [51.5 kB]
Get:20 http://debian-archive.trafficmanager.net/debian bookworm/main amd64 cpp-12 amd64 12.2.0-14+deb12u1 [9768 kB]
Get:21 http://debian-archive.trafficmanager.net/debian bookworm/main amd64 cpp amd64 4:12.2.0-3 [6836 B]
Get:22 http://debian-archive.trafficmanager.net/debian bookworm/main amd64 libcc1-0 amd64 12.2.0-14+deb12u1 [41.7 kB]
Get:23 http://debian-archive.trafficmanager.net/debian bookworm/main amd64 libgomp1 amd64 12.2.0-14+deb12u1 [116 kB]
Get:24 http://debian-archive.trafficmanager.net/debian bookworm/main amd64 libitm1 amd64 12.2.0-14+deb12u1 [26.1 kB]
Get:25 http://debian-archive.trafficmanager.net/debian bookworm/main amd64 libasan8 amd64 12.2.0-14+deb12u1 [2193 kB]
Get:26 http://debian-archive.trafficmanager.net/debian bookworm/main amd64 liblsan0 amd64 12.2.0-14+deb12u1 [969 kB]
Get:27 http://debian-archive.trafficmanager.net/debian bookworm/main amd64 libtsan2 amd64 12.2.0-14+deb12u1 [2197 kB]
Get:28 http://debian-archive.trafficmanager.net/debian bookworm/main amd64 libubsan1 amd64 12.2.0-14+deb12u1 [883 kB]
Get:29 http://debian-archive.trafficmanager.net/debian bookworm/main amd64 libquadmath0 amd64 12.2.0-14+deb12u1 [145 kB]
Get:30 http://debian-archive.trafficmanager.net/debian bookworm/main amd64 libgcc-12-dev amd64 12.2.0-14+deb12u1 [2437 kB]
Get:31 http://debian-archive.trafficmanager.net/debian bookworm/main amd64 gcc-12 amd64 12.2.0-14+deb12u1 [19.3 MB]
Get:32 http://debian-archive.trafficmanager.net/debian bookworm/main amd64 gcc amd64 4:12.2.0-3 [5216 B]
Get:33 http://debian-archive.trafficmanager.net/debian bookworm/main amd64 libstdc++-12-dev amd64 12.2.0-14+deb12u1 [2047 kB]
Get:34 http://debian-archive.trafficmanager.net/debian bookworm/main amd64 g++-12 amd64 12.2.0-14+deb12u1 [10.7 MB]
Get:35 http://debian-archive.trafficmanager.net/debian bookworm/main amd64 g++ amd64 4:12.2.0-3 [1356 B]
Get:36 http://debian-archive.trafficmanager.net/debian bookworm/main amd64 make amd64 4.3-4.1 [396 kB]
Get:37 http://debian-archive.trafficmanager.net/debian bookworm/main amd64 libdpkg-perl all 1.21.23 [604 kB]
Get:38 http://debian-archive.trafficmanager.net/debian bookworm/main amd64 patch amd64 2.7.6-7 [128 kB]
Get:39 http://debian-archive.trafficmanager.net/debian bookworm/main amd64 dpkg-dev all 1.21.23 [1354 kB]
Get:40 http://debian-archive.trafficmanager.net/debian bookworm/main amd64 build-essential amd64 12.9 [7704 B]
N: Ignoring file 'debian.sources.back' in directory '/etc/apt/sources.list.d/' as it has an invalid filename extension
N: Ignoring file 'debian.sources.back' in directory '/etc/apt/sources.list.d/' as it has an invalid filename extension
Fetched 66.4 MB in 2s (28.2 MB/s)
Selecting previously unselected package bzip2.
(Reading database ... 
(Reading database ... 5%
(Reading database ... 10%
(Reading database ... 15%
(Reading database ... 20%
(Reading database ... 25%
(Reading database ... 30%
(Reading database ... 35%
(Reading database ... 40%
(Reading database ... 45%
(Reading database ... 50%
(Reading database ... 55%
(Reading database ... 60%
(Reading database ... 65%
(Reading database ... 70%
(Reading database ... 75%
(Reading database ... 80%
(Reading database ... 85%
(Reading database ... 90%
(Reading database ... 95%
(Reading database ... 100%
(Reading database ... 11235 files and directories currently installed.)
Preparing to unpack .../00-bzip2_1.0.8-5+b1_amd64.deb ...
Unpacking bzip2 (1.0.8-5+b1) ...
Selecting previously unselected package xz-utils.
Preparing to unpack .../01-xz-utils_5.4.1-1+deb12u2_amd64.deb ...
Unpacking xz-utils (5.4.1-1+deb12u2) ...
Selecting previously unselected package binutils-common:amd64.
Preparing to unpack .../02-binutils-common_2.40-2_amd64.deb ...
Unpacking binutils-common:amd64 (2.40-2) ...
Selecting previously unselected package libbinutils:amd64.
Preparing to unpack .../03-libbinutils_2.40-2_amd64.deb ...
Unpacking libbinutils:amd64 (2.40-2) ...
Selecting previously unselected package libctf-nobfd0:amd64.
Preparing to unpack .../04-libctf-nobfd0_2.40-2_amd64.deb ...
Unpacking libctf-nobfd0:amd64 (2.40-2) ...
Selecting previously unselected package libctf0:amd64.
Preparing to unpack .../05-libctf0_2.40-2_amd64.deb ...
Unpacking libctf0:amd64 (2.40-2) ...
Selecting previously unselected package libgprofng0:amd64.
Preparing to unpack .../06-libgprofng0_2.40-2_amd64.deb ...
Unpacking libgprofng0:amd64 (2.40-2) ...
Selecting previously unselected package binutils-x86-64-linux-gnu.
Preparing to unpack .../07-binutils-x86-64-linux-gnu_2.40-2_amd64.deb ...
Unpacking binutils-x86-64-linux-gnu (2.40-2) ...
Selecting previously unselected package binutils.
Preparing to unpack .../08-binutils_2.40-2_amd64.deb ...
Unpacking binutils (2.40-2) ...
Selecting previously unselected package libc-dev-bin.
Preparing to unpack .../09-libc-dev-bin_2.36-9+deb12u14_amd64.deb ...
Unpacking libc-dev-bin (2.36-9+deb12u14) ...
Selecting previously unselected package linux-libc-dev:amd64.
Preparing to unpack .../10-linux-libc-dev_6.1.187-1_amd64.deb ...
Unpacking linux-libc-dev:amd64 (6.1.187-1) ...
Selecting previously unselected package libcrypt-dev:amd64.
Preparing to unpack .../11-libcrypt-dev_1%3a4.4.33-2_amd64.deb ...
Unpacking libcrypt-dev:amd64 (1:4.4.33-2) ...
Selecting previously unselected package libtirpc-dev:amd64.
Preparing to unpack .../12-libtirpc-dev_1.3.3+ds-1_amd64.deb ...
Unpacking libtirpc-dev:amd64 (1.3.3+ds-1) ...
Selecting previously unselected package libnsl-dev:amd64.
Preparing to unpack .../13-libnsl-dev_1.3.0-2_amd64.deb ...
Unpacking libnsl-dev:amd64 (1.3.0-2) ...
Selecting previously unselected package rpcsvc-proto.
Preparing to unpack .../14-rpcsvc-proto_1.4.3-1_amd64.deb ...
Unpacking rpcsvc-proto (1.4.3-1) ...
Selecting previously unselected package libc6-dev:amd64.
Preparing to unpack .../15-libc6-dev_2.36-9+deb12u14_amd64.deb ...
Unpacking libc6-dev:amd64 (2.36-9+deb12u14) ...
Selecting previously unselected package libisl23:amd64.
Preparing to unpack .../16-libisl23_0.25-1.1_amd64.deb ...
Unpacking libisl23:amd64 (0.25-1.1) ...
Selecting previously unselected package libmpfr6:amd64.
Preparing to unpack .../17-libmpfr6_4.2.0-1_amd64.deb ...
Unpacking libmpfr6:amd64 (4.2.0-1) ...
Selecting previously unselected package libmpc3:amd64.
Preparing to unpack .../18-libmpc3_1.3.1-1_amd64.deb ...
Unpacking libmpc3:amd64 (1.3.1-1) ...
Selecting previously unselected package cpp-12.
Preparing to unpack .../19-cpp-12_12.2.0-14+deb12u1_amd64.deb ...
Unpacking cpp-12 (12.2.0-14+deb12u1) ...
Selecting previously unselected package cpp.
Preparing to unpack .../20-cpp_4%3a12.2.0-3_amd64.deb ...
Unpacking cpp (4:12.2.0-3) ...
Selecting previously unselected package libcc1-0:amd64.
Preparing to unpack .../21-libcc1-0_12.2.0-14+deb12u1_amd64.deb ...
Unpacking libcc1-0:amd64 (12.2.0-14+deb12u1) ...
Selecting previously unselected package libgomp1:amd64.
Preparing to unpack .../22-libgomp1_12.2.0-14+deb12u1_amd64.deb ...
Unpacking libgomp1:amd64 (12.2.0-14+deb12u1) ...
Selecting previously unselected package libitm1:amd64.
Preparing to unpack .../23-libitm1_12.2.0-14+deb12u1_amd64.deb ...
Unpacking libitm1:amd64 (12.2.0-14+deb12u1) ...
Selecting previously unselected package libasan8:amd64.
Preparing to unpack .../24-libasan8_12.2.0-14+deb12u1_amd64.deb ...
Unpacking libasan8:amd64 (12.2.0-14+deb12u1) ...
Selecting previously unselected package liblsan0:amd64.
Preparing to unpack .../25-liblsan0_12.2.0-14+deb12u1_amd64.deb ...
Unpacking liblsan0:amd64 (12.2.0-14+deb12u1) ...
Selecting previously unselected package libtsan2:amd64.
Preparing to unpack .../26-libtsan2_12.2.0-14+deb12u1_amd64.deb ...
Unpacking libtsan2:amd64 (12.2.0-14+deb12u1) ...
Selecting previously unselected package libubsan1:amd64.
Preparing to unpack .../27-libubsan1_12.2.0-14+deb12u1_amd64.deb ...
Unpacking libubsan1:amd64 (12.2.0-14+deb12u1) ...
Selecting previously unselected package libquadmath0:amd64.
Preparing to unpack .../28-libquadmath0_12.2.0-14+deb12u1_amd64.deb ...
Unpacking libquadmath0:amd64 (12.2.0-14+deb12u1) ...
Selecting previously unselected package libgcc-12-dev:amd64.
Preparing to unpack .../29-libgcc-12-dev_12.2.0-14+deb12u1_amd64.deb ...
Unpacking libgcc-12-dev:amd64 (12.2.0-14+deb12u1) ...
Selecting previously unselected package gcc-12.
Preparing to unpack .../30-gcc-12_12.2.0-14+deb12u1_amd64.deb ...
Unpacking gcc-12 (12.2.0-14+deb12u1) ...
Selecting previously unselected package gcc.
Preparing to unpack .../31-gcc_4%3a12.2.0-3_amd64.deb ...
Unpacking gcc (4:12.2.0-3) ...
Selecting previously unselected package libstdc++-12-dev:amd64.
Preparing to unpack .../32-libstdc++-12-dev_12.2.0-14+deb12u1_amd64.deb ...
Unpacking libstdc++-12-dev:amd64 (12.2.0-14+deb12u1) ...
Selecting previously unselected package g++-12.
Preparing to unpack .../33-g++-12_12.2.0-14+deb12u1_amd64.deb ...
Unpacking g++-12 (12.2.0-14+deb12u1) ...
Selecting previously unselected package g++.
Preparing to unpack .../34-g++_4%3a12.2.0-3_amd64.deb ...
Unpacking g++ (4:12.2.0-3) ...
Selecting previously unselected package make.
Preparing to unpack .../35-make_4.3-4.1_amd64.deb ...
Unpacking make (4.3-4.1) ...
Selecting previously unselected package libdpkg-perl.
Preparing to unpack .../36-libdpkg-perl_1.21.23_all.deb ...
Unpacking libdpkg-perl (1.21.23) ...
Selecting previously unselected package patch.
Preparing to unpack .../37-patch_2.7.6-7_amd64.deb ...
Unpacking patch (2.7.6-7) ...
Selecting previously unselected package dpkg-dev.
Preparing to unpack .../38-dpkg-dev_1.21.23_all.deb ...
Unpacking dpkg-dev (1.21.23) ...
Selecting previously unselected package build-essential.
Preparing to unpack .../39-build-essential_12.9_amd64.deb ...
Unpacking build-essential (12.9) ...
Setting up binutils-common:amd64 (2.40-2) ...
Setting up linux-libc-dev:amd64 (6.1.187-1) ...
Setting up libctf-nobfd0:amd64 (2.40-2) ...
Setting up libgomp1:amd64 (12.2.0-14+deb12u1) ...
Setting up bzip2 (1.0.8-5+b1) ...
Setting up libtirpc-dev:amd64 (1.3.3+ds-1) ...
Setting up rpcsvc-proto (1.4.3-1) ...
Setting up make (4.3-4.1) ...
Setting up libmpfr6:amd64 (4.2.0-1) ...
Setting up xz-utils (5.4.1-1+deb12u2) ...
update-alternatives: using /usr/bin/xz to provide /usr/bin/lzma (lzma) in auto mode
update-alternatives: warning: skip creation of /usr/share/man/man1/lzma.1.gz because associated file /usr/share/man/man1/xz.1.gz (of link group lzma) doesn't exist
update-alternatives: warning: skip creation of /usr/share/man/man1/unlzma.1.gz because associated file /usr/share/man/man1/unxz.1.gz (of link group lzma) doesn't exist
update-alternatives: warning: skip creation of /usr/share/man/man1/lzcat.1.gz because associated file /usr/share/man/man1/xzcat.1.gz (of link group lzma) doesn't exist
update-alternatives: warning: skip creation of /usr/share/man/man1/lzmore.1.gz because associated file /usr/share/man/man1/xzmore.1.gz (of link group lzma) doesn't exist
update-alternatives: warning: skip creation of /usr/share/man/man1/lzless.1.gz because associated file /usr/share/man/man1/xzless.1.gz (of link group lzma) doesn't exist
update-alternatives: warning: skip creation of /usr/share/man/man1/lzdiff.1.gz because associated file /usr/share/man/man1/xzdiff.1.gz (of link group lzma) doesn't exist
update-alternatives: warning: skip creation of /usr/share/man/man1/lzcmp.1.gz because associated file /usr/share/man/man1/xzcmp.1.gz (of link group lzma) doesn't exist
update-alternatives: warning: skip creation of /usr/share/man/man1/lzgrep.1.gz because associated file /usr/share/man/man1/xzgrep.1.gz (of link group lzma) doesn't exist
update-alternatives: warning: skip creation of /usr/share/man/man1/lzegrep.1.gz because associated file /usr/share/man/man1/xzegrep.1.gz (of link group lzma) doesn't exist
update-alternatives: warning: skip creation of /usr/share/man/man1/lzfgrep.1.gz because associated file /usr/share/man/man1/xzfgrep.1.gz (of link group lzma) doesn't exist
Setting up libquadmath0:amd64 (12.2.0-14+deb12u1) ...
Setting up libmpc3:amd64 (1.3.1-1) ...
Setting up patch (2.7.6-7) ...
Setting up libdpkg-perl (1.21.23) ...
Setting up libubsan1:amd64 (12.2.0-14+deb12u1) ...
Setting up libnsl-dev:amd64 (1.3.0-2) ...
Setting up libcrypt-dev:amd64 (1:4.4.33-2) ...
Setting up libasan8:amd64 (12.2.0-14+deb12u1) ...
Setting up libtsan2:amd64 (12.2.0-14+deb12u1) ...
Setting up libbinutils:amd64 (2.40-2) ...
Setting up libisl23:amd64 (0.25-1.1) ...
Setting up libc-dev-bin (2.36-9+deb12u14) ...
Setting up libcc1-0:amd64 (12.2.0-14+deb12u1) ...
Setting up liblsan0:amd64 (12.2.0-14+deb12u1) ...
Setting up libitm1:amd64 (12.2.0-14+deb12u1) ...
Setting up libctf0:amd64 (2.40-2) ...
Setting up cpp-12 (12.2.0-14+deb12u1) ...
Setting up libgprofng0:amd64 (2.40-2) ...
Setting up libgcc-12-dev:amd64 (12.2.0-14+deb12u1) ...
Setting up cpp (4:12.2.0-3) ...
Setting up libc6-dev:amd64 (2.36-9+deb12u14) ...
Setting up binutils-x86-64-linux-gnu (2.40-2) ...
Setting up libstdc++-12-dev:amd64 (12.2.0-14+deb12u1) ...
Setting up binutils (2.40-2) ...
Setting up dpkg-dev (1.21.23) ...
Setting up gcc-12 (12.2.0-14+deb12u1) ...
Setting up g++-12 (12.2.0-14+deb12u1) ...
Setting up gcc (4:12.2.0-3) ...
Setting up g++ (4:12.2.0-3) ...
update-alternatives: using /usr/bin/g++ to provide /usr/bin/c++ (c++) in auto mode
Setting up build-essential (12.9) ...
Processing triggers for libc-bin (2.36-9+deb12u14) ...
Removing intermediate container 774b5fcb41d2
 ---> d23b470d627b
Step 11/32 : ARG RUST_ROOT=/usr/.cargo
 ---> Running in fe1b5c037afc
Removing intermediate container fe1b5c037afc
 ---> b8a676a83179
Step 12/32 : RUN RUSTUP_HOME=$RUST_ROOT CARGO_HOME=$RUST_ROOT bash -c     'curl --proto "=https" -sSf https://sh.rustup.rs | sh -s -- --default-toolchain 1.79.0 -y'
 ---> Running in 5a309816417a
info: downloading installer
info: profile set to 'default'
info: default host triple is x86_64-unknown-linux-gnu
info: syncing channel updates for '1.79.0-x86_64-unknown-linux-gnu'
info: latest update on 2024-06-13, rust version 1.79.0 (129f3b996 2024-06-10)
info: downloading component 'cargo'
info: downloading component 'clippy'
error: failed to download file error=Reqwest(reqwest::Error { kind: Request, url: "https://static.rust-lang.org/dist/2024-06-13/clippy-1.79.0-x86_64-unknown-linux-gnu.tar.xz", source: hyper_util::client::legacy::Error(Connect, ConnectError("tcp connect error", Os { code: 99, kind: AddrNotAvailable, message: "Cannot assign requested address" })) })
info: retrying download for 'https://static.rust-lang.org/dist/2024-06-13/clippy-1.79.0-x86_64-unknown-linux-gnu.tar.xz'
info: downloading component 'rust-docs'
info: downloading component 'rust-std'
info: downloading component 'rustc'
info: downloading component 'rustfmt'
info: installing component 'cargo'
info: installing component 'clippy'
info: installing component 'rust-docs'
info: installing component 'rust-std'
info: installing component 'rustc'
info: installing component 'rustfmt'

info: default toolchain set to '1.79.0-x86_64-unknown-linux-gnu'
  1.79.0-x86_64-unknown-linux-gnu installed - rustc 1.79.0 (129f3b996 2024-06-10)


Rust is installed now. Great!

To get started you may need to restart your current shell.
This would reload your PATH environment variable to include
Cargo's bin directory (/usr/.cargo/bin).

To configure your current shell, you need to source
the corresponding env file under /usr/.cargo.

This is usually done by running one of the following (note the leading DOT):
. "/usr/.cargo/env"            # For sh/bash/zsh/ash/dash/pdksh
source "/usr/.cargo/env.fish"  # For fish
source $"/usr/.cargo/env.nu"  # For nushell
Removing intermediate container 5a309816417a
 ---> b2f0728667ef
Step 13/32 : ENV RUSTUP_HOME=$RUST_ROOT
 ---> Running in ddabbb298a07
Removing intermediate container ddabbb298a07
 ---> 373a684c067c
Step 14/32 : ENV PATH $PATH:$RUST_ROOT/bin
 ---> Running in a047fa1117ce
Removing intermediate container a047fa1117ce
 ---> 97d6457ced15
Step 15/32 : WORKDIR /watchdog
 ---> Running in cbb401b69fed
Removing intermediate container cbb401b69fed
 ---> 6efbb3850113
Step 16/32 : COPY watchdog/ ./
 ---> 9ccc5f3a301d
Step 17/32 : RUN cargo build --release
 ---> Running in 8961defdf2d5
    Updating crates.io index
     Locking 46 packages to latest compatible versions
      Adding android_system_properties v0.1.6
      Adding autocfg v1.5.1
      Adding bmp_watchdog v0.1.0 (/watchdog)
      Adding bumpalo v3.20.3
      Adding cc v1.4.6
      Adding cfg-if v1.0.5
      Adding chrono v0.4.45
      Adding core-foundation-sys v0.8.7
      Adding daemonize v0.5.0
      Adding find-msvc-tools v0.1.12
      Adding futures-core v0.3.34
      Adding futures-task v0.3.34
      Adding futures-util v0.3.34
      Adding iana-time-zone v0.1.65
      Adding iana-time-zone-haiku v0.1.2
      Adding itoa v1.0.18
      Adding js-sys v0.3.105
      Adding libc v0.2.189
      Adding log v0.4.34
      Adding memchr v2.8.3
      Adding num-traits v0.2.19
      Adding once_cell v1.21.4
      Adding pin-project-lite v0.2.17
      Adding proc-macro2 v1.0.107
      Adding quote v1.0.47
      Adding rustversion v1.0.23
      Adding serde v1.0.229
      Adding serde_core v1.0.229
      Adding serde_derive v1.0.229
      Adding serde_json v1.0.151
      Adding shlex v2.0.1
      Adding slab v0.4.12
      Adding syn v2.0.119 (latest: v3.0.6)
      Adding syn v3.0.6
      Adding unicode-ident v1.0.26
      Adding wasm-bindgen v0.2.128
      Adding wasm-bindgen-macro v0.2.128
      Adding wasm-bindgen-macro-support v0.2.128
      Adding wasm-bindgen-shared v0.2.128
      Adding windows-core v0.62.2 (latest: v0.100.0)
      Adding windows-implement v0.60.2 (latest: v0.100.0)
      Adding windows-interface v0.59.3 (latest: v0.100.0)
      Adding windows-link v0.2.1 (latest: v0.100.0)
      Adding windows-result v0.4.1 (latest: v0.100.0)
      Adding windows-strings v0.5.1 (latest: v0.100.0)
      Adding zmij v1.0.23
 Downloading crates ...
warning: spurious network error (3 tries remaining): [7] Couldn't connect to server (Failed to connect to static.crates.io port 443 after 934 ms: Couldn't connect to server)
warning: spurious network error (3 tries remaining): [7] Couldn't connect to server (Failed to connect to static.crates.io port 443 after 0 ms: Couldn't connect to server)
warning: spurious network error (3 tries remaining): [7] Couldn't connect to server (Failed to connect to static.crates.io port 443 after 0 ms: Couldn't connect to server)
warning: spurious network error (3 tries remaining): [7] Couldn't connect to server (Failed to connect to static.crates.io port 443 after 0 ms: Couldn't connect to server)
warning: spurious network error (3 tries remaining): [7] Couldn't connect to server (Failed to connect to static.crates.io port 443 after 0 ms: Couldn't connect to server)
warning: spurious network error (3 tries remaining): [7] Couldn't connect to server (Failed to connect to static.crates.io port 443 after 0 ms: Couldn't connect to server)
warning: spurious network error (3 tries remaining): [7] Couldn't connect to server (Failed to connect to static.crates.io port 443 after 0 ms: Couldn't connect to server)
warning: spurious network error (3 tries remaining): [7] Couldn't connect to server (Failed to connect to static.crates.io port 443 after 0 ms: Couldn't connect to server)
warning: spurious network error (3 tries remaining): [7] Couldn't connect to server (Failed to connect to static.crates.io port 443 after 0 ms: Couldn't connect to server)
warning: spurious network error (3 tries remaining): [7] Couldn't connect to server (Failed to connect to static.crates.io port 443 after 0 ms: Couldn't connect to server)
warning: spurious network error (3 tries remaining): [7] Couldn't connect to server (Failed to connect to static.crates.io port 443 after 0 ms: Couldn't connect to server)
warning: spurious network error (3 tries remaining): [7] Couldn't connect to server (Failed to connect to static.crates.io port 443 after 0 ms: Couldn't connect to server)
warning: spurious network error (3 tries remaining): [7] Couldn't connect to server (Failed to connect to static.crates.io port 443 after 0 ms: Couldn't connect to server)
warning: spurious network error (3 tries remaining): [7] Couldn't connect to server (Failed to connect to static.crates.io port 443 after 0 ms: Couldn't connect to server)
warning: spurious network error (3 tries remaining): [7] Couldn't connect to server (Failed to connect to static.crates.io port 443 after 0 ms: Couldn't connect to server)
warning: spurious network error (3 tries remaining): [7] Couldn't connect to server (Failed to connect to static.crates.io port 443 after 0 ms: Couldn't connect to server)
warning: spurious network error (3 tries remaining): [7] Couldn't connect to server (Failed to connect to static.crates.io port 443 after 0 ms: Couldn't connect to server)
warning: spurious network error (2 tries remaining): [7] Couldn't connect to server (Failed to connect to static.crates.io port 443 after 0 ms: Couldn't connect to server)
warning: spurious network error (2 tries remaining): [7] Couldn't connect to server (Failed to connect to static.crates.io port 443 after 0 ms: Couldn't connect to server)
warning: spurious network error (2 tries remaining): [7] Couldn't connect to server (Failed to connect to static.crates.io port 443 after 0 ms: Couldn't connect to server)
warning: spurious network error (2 tries remaining): [7] Couldn't connect to server (Failed to connect to static.crates.io port 443 after 0 ms: Couldn't connect to server)
warning: spurious network error (2 tries remaining): [7] Couldn't connect to server (Failed to connect to static.crates.io port 443 after 0 ms: Couldn't connect to server)
warning: spurious network error (2 tries remaining): [7] Couldn't connect to server (Failed to connect to static.crates.io port 443 after 0 ms: Couldn't connect to server)
warning: spurious network error (2 tries remaining): [7] Couldn't connect to server (Failed to connect to static.crates.io port 443 after 0 ms: Couldn't connect to server)
warning: spurious network error (2 tries remaining): [7] Couldn't connect to server (Failed to connect to static.crates.io port 443 after 0 ms: Couldn't connect to server)
warning: spurious network error (2 tries remaining): [7] Couldn't connect to server (Failed to connect to static.crates.io port 443 after 0 ms: Couldn't connect to server)
warning: spurious network error (2 tries remaining): [7] Couldn't connect to server (Failed to connect to static.crates.io port 443 after 0 ms: Couldn't connect to server)
warning: spurious network error (2 tries remaining): [7] Couldn't connect to server (Failed to connect to static.crates.io port 443 after 0 ms: Couldn't connect to server)
warning: spurious network error (2 tries remaining): [7] Couldn't connect to server (Failed to connect to static.crates.io port 443 after 0 ms: Couldn't connect to server)
warning: spurious network error (2 tries remaining): [7] Couldn't connect to server (Failed to connect to static.crates.io port 443 after 0 ms: Couldn't connect to server)
warning: spurious network error (2 tries remaining): [7] Couldn't connect to server (Failed to connect to static.crates.io port 443 after 0 ms: Couldn't connect to server)
warning: spurious network error (2 tries remaining): [7] Couldn't connect to server (Failed to connect to static.crates.io port 443 after 0 ms: Couldn't connect to server)
warning: spurious network error (2 tries remaining): [7] Couldn't connect to server (Failed to connect to static.crates.io port 443 after 0 ms: Couldn't connect to server)
warning: spurious network error (2 tries remaining): [7] Couldn't connect to server (Failed to connect to static.crates.io port 443 after 0 ms: Couldn't connect to server)
warning: spurious network error (1 tries remaining): [7] Couldn't connect to server (Failed to connect to static.crates.io port 443 after 0 ms: Couldn't connect to server)
warning: spurious network error (1 tries remaining): [7] Couldn't connect to server (Failed to connect to static.crates.io port 443 after 0 ms: Couldn't connect to server)
warning: spurious network error (1 tries remaining): [7] Couldn't connect to server (Failed to connect to static.crates.io port 443 after 0 ms: Couldn't connect to server)
warning: spurious network error (1 tries remaining): [7] Couldn't connect to server (Failed to connect to static.crates.io port 443 after 0 ms: Couldn't connect to server)
warning: spurious network error (1 tries remaining): [7] Couldn't connect to server (Failed to connect to static.crates.io port 443 after 0 ms: Couldn't connect to server)
warning: spurious network error (1 tries remaining): [7] Couldn't connect to server (Failed to connect to static.crates.io port 443 after 0 ms: Couldn't connect to server)
warning: spurious network error (1 tries remaining): [7] Couldn't connect to server (Failed to connect to static.crates.io port 443 after 0 ms: Couldn't connect to server)
warning: spurious network error (1 tries remaining): [7] Couldn't connect to server (Failed to connect to static.crates.io port 443 after 0 ms: Couldn't connect to server)
warning: spurious network error (1 tries remaining): [7] Couldn't connect to server (Failed to connect to static.crates.io port 443 after 0 ms: Couldn't connect to server)
warning: spurious network error (1 tries remaining): [7] Couldn't connect to server (Failed to connect to static.crates.io port 443 after 0 ms: Couldn't connect to server)
warning: spurious network error (1 tries remaining): [7] Couldn't connect to server (Failed to connect to static.crates.io port 443 after 0 ms: Couldn't connect to server)
warning: spurious network error (1 tries remaining): [7] Couldn't connect to server (Failed to connect to static.crates.io port 443 after 0 ms: Couldn't connect to server)
warning: spurious network error (1 tries remaining): [7] Couldn't connect to server (Failed to connect to static.crates.io port 443 after 0 ms: Couldn't connect to server)
warning: spurious network error (1 tries remaining): [7] Couldn't connect to server (Failed to connect to static.crates.io port 443 after 0 ms: Couldn't connect to server)
warning: spurious network error (1 tries remaining): [7] Couldn't connect to server (Failed to connect to static.crates.io port 443 after 0 ms: Couldn't connect to server)
warning: spurious network error (1 tries remaining): [7] Couldn't connect to server (Failed to connect to static.crates.io port 443 after 0 ms: Couldn't connect to server)
warning: spurious network error (1 tries remaining): [7] Couldn't connect to server (Failed to connect to static.crates.io port 443 after 0 ms: Couldn't connect to server)
error: failed to download from `https://static.crates.io/crates/serde_core/1.0.229/download`

Caused by:
  [7] Couldn't connect to server (Failed to connect to static.crates.io port 443 after 0 ms: Couldn't connect to server)
The command '/bin/sh -c cargo build --release' returned a non-zero code: 101
[  FAIL LOG END  ] [ target/docker-bmp-watchdog.gz ]
make: *** [slave.mk:1153: target/docker-bmp-watchdog.gz] Error 1
make: *** Waiting for unfinished jobs....
[ finished ] [ target/debs/bookworm/sonic-linkmgrd_1.0.0-1_amd64.deb ] 
[ finished ] [ target/python-wheels/bookworm/sonic_platform_common-1.0-py3-none-any.whl ] 
[ finished ] [ target/sonic-vs.bin__vs__rfs.squashfs ] 
[ FAIL LOG START ] [ target/sonic-vs.bin__vs__rfs.squashfs ]
Build start time: Fri Sep 18 06:34:08 UTC 2026
++ '[' -f .arch ']'
++ cat .arch
+ CONFIGURED_ARCH=amd64
+ DOCKER_VERSION=5:24.0.2-1~debian.12~bookworm
+ CONTAINERD_IO_VERSION=1.6.21-1
+ LINUX_KERNEL_VERSION=6.1.0-29-2
+ FILESYSTEM_ROOT=./fsroot
+ PLATFORM_DIR=platform
+ HOSTNAME=sonic
+ DEFAULT_USERINFO='Default admin user,,,'
+ BUILD_TOOL_PATH=src/sonic-build-hooks/buildinfo
+ TRUSTED_GPG_DIR=src/sonic-build-hooks/buildinfo/trusted.gpg.d
+ . ./onie-image.conf
++ : 32768
++ : x86_64
++ : vs
++ ONIEIMAGE_VERSION=r0
++ FILESYSTEM_ROOT=./fsroot-vs
++ FILESYSTEM_SQUASHFS=fs.squashfs
++ INSTALLER_PAYLOAD=fs.zip
++ FILESYSTEM_DOCKERFS=dockerfs.tar.gz
++ DOCKERFS_DIR=docker
++ DOCKER_RAMFS_SIZE=3500M
++ OUTPUT_ONIE_IMAGE=target/sonic-vs.bin
++ OUTPUT_RAW_IMAGE=target/sonic-vs.raw
++ RAW_IMAGE_DISK_SIZE=1700
++ OUTPUT_KVM_IMAGE=target/sonic-vs.img
++ KVM_IMAGE_DISK_SIZE=16
++ OUTPUT_ABOOT_IMAGE=target/sonic-aboot-vs.swi
++ ABOOT_BOOT_IMAGE=.sonic-boot.swi
++ OUTPUT_KVM_4ASIC_IMAGE=target/sonic-4asic-vs.img
++ OUTPUT_KVM_6ASIC_IMAGE=target/sonic-6asic-vs.img
++ OUTPUT_DSC_IMAGE=target/sonic-vs.tar
+ '[' -n 32768 ']'
+ '[' -n fs.zip ']'
+ '[' -n fs.squashfs ']'
+ '[' onie = aboot ']'
+ [[ n != y ]]
+ [[ -d ./fsroot-vs ]]
+ sudo rm -rf ./fsroot-vs
+ mkdir -p ./fsroot-vs
+ mkdir -p ./fsroot-vs/platform
+ touch ./fsroot-vs/platform/firsttime
+ bootloader_packages=
+ '[' grub '!=' aboot ']'
+ mkdir -p ./fsroot-vs/platform/grub
+ bootloader_packages=grub2-common
+ sudo mount proc /proc -t proc
+ echo '[INFO] Build host debian base system...'
[INFO] Build host debian base system...
+ TARGET_PATH=target
+ scripts/build_debian_base_system.sh amd64 bookworm ./fsroot-vs
I: Target architecture can be executed
I: Retrieving InRelease 
I: Checking Release signature
I: Valid Release signature (key id 4D64FEC119C2029067D6E791F8D2585B8783D481)
I: Retrieving Packages 
I: Validating Packages 
I: Resolving dependencies of required packages...
I: Resolving dependencies of base packages...
I: Checking component main on http://deb.debian.org/debian...
I: Retrieving adduser 3.134
I: Validating adduser 3.134
I: Retrieving apt 2.6.1
I: Validating apt 2.6.1
I: Retrieving base-files 12.4+deb12u15
I: Validating base-files 12.4+deb12u15
I: Retrieving base-passwd 3.6.1
I: Validating base-passwd 3.6.1
I: Retrieving bash 5.2.15-2+b13
I: Validating bash 5.2.15-2+b13
I: Retrieving bsdutils 1:2.38.1-5+deb12u3
I: Validating bsdutils 1:2.38.1-5+deb12u3
I: Retrieving coreutils 9.1-1
I: Validating coreutils 9.1-1
I: Retrieving dash 0.5.12-2
I: Validating dash 0.5.12-2
I: Retrieving debconf 1.5.82
I: Validating debconf 1.5.82
I: Retrieving debian-archive-keyring 2023.3+deb12u2
I: Validating debian-archive-keyring 2023.3+deb12u2
I: Retrieving debianutils 5.7-0.5~deb12u1
I: Validating debianutils 5.7-0.5~deb12u1
I: Retrieving diffutils 1:3.8-4
W: Couldn't download package diffutils (ver 1:3.8-4 arch amd64) at http://deb.debian.org/debian/pool/main/d/diffutils/diffutils_3.8-4_amd64.deb
I: Retrieving dpkg 1.21.23
I: Validating dpkg 1.21.23
I: Retrieving e2fsprogs 1.47.0-2+b2
W: Couldn't download package e2fsprogs (ver 1.47.0-2+b2 arch amd64) at http://deb.debian.org/debian/pool/main/e/e2fsprogs/e2fsprogs_1.47.0-2+b2_amd64.deb
I: Retrieving findutils 4.9.0-4
I: Validating findutils 4.9.0-4
I: Retrieving gcc-12-base 12.2.0-14+deb12u1
I: Validating gcc-12-base 12.2.0-14+deb12u1
I: Retrieving gpgv 2.2.40-1.1+deb12u2
I: Validating gpgv 2.2.40-1.1+deb12u2
I: Retrieving grep 3.8-5
I: Validating grep 3.8-5
I: Retrieving gzip 1.12-1
I: Validating gzip 1.12-1
I: Retrieving hostname 3.23+nmu1
I: Validating hostname 3.23+nmu1
I: Retrieving init-system-helpers 1.65.2+deb12u1
I: Validating init-system-helpers 1.65.2+deb12u1
I: Retrieving libacl1 2.3.1-3
I: Validating libacl1 2.3.1-3
I: Retrieving libapt-pkg6.0 2.6.1
I: Validating libapt-pkg6.0 2.6.1
I: Retrieving libattr1 1:2.5.1-4
I: Validating libattr1 1:2.5.1-4
I: Retrieving libaudit-common 1:3.0.9-1
I: Validating libaudit-common 1:3.0.9-1
I: Retrieving libaudit1 1:3.0.9-1
I: Validating libaudit1 1:3.0.9-1
I: Retrieving libblkid1 2.38.1-5+deb12u3
I: Validating libblkid1 2.38.1-5+deb12u3
I: Retrieving libbz2-1.0 1.0.8-5+b1
I: Validating libbz2-1.0 1.0.8-5+b1
I: Retrieving libc-bin 2.36-9+deb12u14
I: Validating libc-bin 2.36-9+deb12u14
I: Retrieving libc6 2.36-9+deb12u14
I: Validating libc6 2.36-9+deb12u14
I: Retrieving libcap-ng0 0.8.3-1+b3
I: Validating libcap-ng0 0.8.3-1+b3
I: Retrieving libcap2 1:2.66-4+deb12u3+b1
I: Validating libcap2 1:2.66-4+deb12u3+b1
I: Retrieving libcom-err2 1.47.0-2+b2
I: Validating libcom-err2 1.47.0-2+b2
I: Retrieving libcrypt1 1:4.4.33-2
I: Validating libcrypt1 1:4.4.33-2
I: Retrieving libdb5.3 5.3.28+dfsg2-1
I: Validating libdb5.3 5.3.28+dfsg2-1
I: Retrieving libdebconfclient0 0.270
I: Validating libdebconfclient0 0.270
I: Retrieving libext2fs2 1.47.0-2+b2
I: Validating libext2fs2 1.47.0-2+b2
I: Retrieving libffi8 3.4.4-1
I: Validating libffi8 3.4.4-1
I: Retrieving libgcc-s1 12.2.0-14+deb12u1
I: Validating libgcc-s1 12.2.0-14+deb12u1
I: Retrieving libgcrypt20 1.10.1-3+deb12u1
I: Validating libgcrypt20 1.10.1-3+deb12u1
I: Retrieving libgmp10 2:6.2.1+dfsg1-1.1
I: Validating libgmp10 2:6.2.1+dfsg1-1.1
I: Retrieving libgnutls30 3.7.9-2+deb12u7
I: Validating libgnutls30 3.7.9-2+deb12u7
I: Retrieving libgpg-error0 1.46-1
I: Validating libgpg-error0 1.46-1
I: Retrieving libhogweed6 3.8.1-2
I: Validating libhogweed6 3.8.1-2
I: Retrieving libidn2-0 2.3.3-1+b1
I: Validating libidn2-0 2.3.3-1+b1
I: Retrieving liblz4-1 1.9.4-1
I: Validating liblz4-1 1.9.4-1
I: Retrieving liblzma5 5.4.1-1+deb12u1
I: Validating liblzma5 5.4.1-1+deb12u1
I: Retrieving libmd0 1.0.4-2
I: Validating libmd0 1.0.4-2
I: Retrieving libmount1 2.38.1-5+deb12u3
I: Validating libmount1 2.38.1-5+deb12u3
I: Retrieving libnettle8 3.8.1-2
I: Validating libnettle8 3.8.1-2
I: Retrieving libp11-kit0 0.24.1-2
I: Validating libp11-kit0 0.24.1-2
I: Retrieving libpam-modules 1.5.2-6+deb12u2
I: Validating libpam-modules 1.5.2-6+deb12u2
I: Retrieving libpam-modules-bin 1.5.2-6+deb12u2
I: Validating libpam-modules-bin 1.5.2-6+deb12u2
I: Retrieving libpam-runtime 1.5.2-6+deb12u2
I: Validating libpam-runtime 1.5.2-6+deb12u2
I: Retrieving libpam0g 1.5.2-6+deb12u2
I: Validating libpam0g 1.5.2-6+deb12u2
I: Retrieving libpcre2-8-0 10.42-1
I: Validating libpcre2-8-0 10.42-1
I: Retrieving libseccomp2 2.5.4-1+deb12u1
W: Couldn't download package libseccomp2 (ver 2.5.4-1+deb12u1 arch amd64) at http://deb.debian.org/debian/pool/main/libs/libseccomp/libseccomp2_2.5.4-1+deb12u1_amd64.deb
I: Retrieving libselinux1 3.4-1+b6
I: Validating libselinux1 3.4-1+b6
I: Retrieving libsemanage-common 3.4-1
I: Validating libsemanage-common 3.4-1
I: Retrieving libsemanage2 3.4-1+b5
I: Validating libsemanage2 3.4-1+b5
I: Retrieving libsepol2 3.4-2.1
I: Validating libsepol2 3.4-2.1
I: Retrieving libsmartcols1 2.38.1-5+deb12u3
I: Validating libsmartcols1 2.38.1-5+deb12u3
I: Retrieving libss2 1.47.0-2+b2
I: Validating libss2 1.47.0-2+b2
I: Retrieving libstdc++6 12.2.0-14+deb12u1
I: Validating libstdc++6 12.2.0-14+deb12u1
I: Retrieving libsystemd0 252.39-1~deb12u2
I: Validating libsystemd0 252.39-1~deb12u2
I: Retrieving libtasn1-6 4.19.0-2+deb12u1
I: Validating libtasn1-6 4.19.0-2+deb12u1
I: Retrieving libtinfo6 6.4-4
I: Validating libtinfo6 6.4-4
I: Retrieving libudev1 252.39-1~deb12u2
I: Validating libudev1 252.39-1~deb12u2
I: Retrieving libunistring2 1.0-2
W: Couldn't download package libunistring2 (ver 1.0-2 arch amd64) at http://deb.debian.org/debian/pool/main/libu/libunistring/libunistring2_1.0-2_amd64.deb
I: Retrieving libuuid1 2.38.1-5+deb12u3
I: Validating libuuid1 2.38.1-5+deb12u3
I: Retrieving libxxhash0 0.8.1-1
I: Validating libxxhash0 0.8.1-1
I: Retrieving libzstd1 1.5.4+dfsg2-5
I: Validating libzstd1 1.5.4+dfsg2-5
I: Retrieving login 1:4.13+dfsg1-1+deb12u2
I: Validating login 1:4.13+dfsg1-1+deb12u2
I: Retrieving logsave 1.47.0-2+b2
I: Validating logsave 1.47.0-2+b2
I: Retrieving mawk 1.3.4.20200120-3.1
I: Validating mawk 1.3.4.20200120-3.1
I: Retrieving mount 2.38.1-5+deb12u3
I: Validating mount 2.38.1-5+deb12u3
I: Retrieving ncurses-base 6.4-4
I: Validating ncurses-base 6.4-4
I: Retrieving ncurses-bin 6.4-4
I: Validating ncurses-bin 6.4-4
I: Retrieving passwd 1:4.13+dfsg1-1+deb12u2
I: Validating passwd 1:4.13+dfsg1-1+deb12u2
I: Retrieving perl-base 5.36.0-7+deb12u3
I: Validating perl-base 5.36.0-7+deb12u3
I: Retrieving sed 4.9-1+deb12u1
I: Validating sed 4.9-1+deb12u1
I: Retrieving sysvinit-utils 3.06-4
I: Validating sysvinit-utils 3.06-4
I: Retrieving tar 1.34+dfsg-1.2+deb12u1
W: Couldn't download package tar (ver 1.34+dfsg-1.2+deb12u1 arch amd64) at http://deb.debian.org/debian/pool/main/t/tar/tar_1.34+dfsg-1.2+deb12u1_amd64.deb
I: Retrieving tzdata 2026b-0+deb12u1
I: Validating tzdata 2026b-0+deb12u1
I: Retrieving usr-is-merged 37~deb12u1
I: Validating usr-is-merged 37~deb12u1
I: Retrieving util-linux 2.38.1-5+deb12u3
I: Validating util-linux 2.38.1-5+deb12u3
I: Retrieving util-linux-extra 2.38.1-5+deb12u3
I: Validating util-linux-extra 2.38.1-5+deb12u3
I: Retrieving zlib1g 1:1.2.13.dfsg-1
I: Validating zlib1g 1:1.2.13.dfsg-1
E: Couldn't download packages: diffutils e2fsprogs libseccomp2 libunistring2 tar
[  FAIL LOG END  ] [ target/sonic-vs.bin__vs__rfs.squashfs ]
make: *** [slave.mk:1332: target/sonic-vs.bin__vs__rfs.squashfs] Error 1
make[1]: *** [Makefile.work:611: all] Error 2
make[1]: Leaving directory '/var/lib/jenkins/workspace/DevOps-test3/platform-vs'
make: *** [Makefile:53: all] Error 2