Content

상위 폴더로 이동
+++ --- Making all --- +++
./scripts/run_with_retry make BLDENV=bookworm -f Makefile.work all
make[1]: Entering directory '/var/lib/jenkins/workspace/ETRI-202505/platform-broadcom'
"SECURE_UPGRADE_PROD_SIGNING_TOOL": ""
~/workspace/ETRI-202505/platform-broadcom/src/sonic-build-hooks ~/workspace/ETRI-202505/platform-broadcom
make[2]: Entering directory '/var/lib/jenkins/workspace/ETRI-202505/platform-broadcom/src/sonic-build-hooks'
dpkg-deb: building package 'sonic-build-hooks' in 'buildinfo/sonic-build-hooks_1.0_all.deb'.
make[2]: Leaving directory '/var/lib/jenkins/workspace/ETRI-202505/platform-broadcom/src/sonic-build-hooks'
~/workspace/ETRI-202505/platform-broadcom
Checking sonic-slave-base image: sonic-slave-bookworm:2f250bfbb4a
Checking sonic-slave-user image: sonic-slave-bookworm-jenkins:7d0c25fdbd0
SONiC Build System

Build Configuration
"CONFIGURED_PLATFORM"             : "broadcom"
"CONFIGURED_ARCH"                 : "amd64"
"SONIC_CONFIG_PRINT_DEPENDENCIES" : ""
"SONIC_BUILD_JOBS"                : "4"
"SONIC_CONFIG_MAKE_JOBS"          : "112"
"USE_NATIVE_DOCKERD_FOR_BUILD"    : ""
"SONIC_USE_DOCKER_BUILDKIT"       : ""
"USERNAME"                        : "admin"
"PASSWORD"                        : "YourPaSsWoRd"
"CHANGE_DEFAULT_PASSWORD"         : "n"
"SECURE_UPGRADE_MODE"             : "no_sign"
"SECURE_UPGRADE_DEV_SIGNING_KEY"  : ""
"SECURE_UPGRADE_SIGNING_CERT"     : ""
"SECURE_UPGRADE_PROD_SIGNING_TOOL": ""
"SECURE_UPGRADE_PROD_TOOL_ARGS"   : ""
"ONIE_IMAGE_PART_SIZE"            : ""
"SHUTDOWN_BGP_ON_START"           : ""
"ENABLE_PFCWD_ON_START"           : ""
"SONIC_BUFFER_MODEL"              : ""
"INSTALL_DEBUG_TOOLS"             : ""
"ROUTING_STACK"                   : "frr"
"FRR_USER_UID"                    : "300"
"FRR_USER_GID"                    : "300"
"ENABLE_SYNCD_RPC"                : ""
"SAITHRIFT_V2"                    : ""
"ENABLE_ORGANIZATION_EXTENSIONS"  : "y"
"HTTP_PROXY"                      : ""
"HTTPS_PROXY"                     : ""
"NO_PROXY"                        : ""
"ENABLE_ZTP"                      : ""
"INCLUDE_PDE"                     : ""
"SONIC_DEBUGGING_ON"              : ""
"SONIC_PROFILING_ON"              : ""
"KERNEL_PROCURE_METHOD"           : "build"
"BUILD_TIMESTAMP"                 : "20260805.184946"
"BUILD_LOG_TIMESTAMP"             : "none"
"SONIC_IMAGE_VERSION"             : "etri-202505.24-bf29a9955"
"BLDENV"                          : "bookworm"
"VS_PREPARE_MEM"                  : "yes"
"INCLUDE_MGMT_FRAMEWORK"          : "y"
"INCLUDE_ICCPD"                   : "n"
"INCLUDE_STP"                     : "y"
"INCLUDE_SYSTEM_TELEMETRY"        : "n"
"INCLUDE_SYSTEM_GNMI"             : "y"
"INCLUDE_SYSTEM_BMP"              : "y"
"INCLUDE_SYSTEM_EVENTD"           : "y"
"ENABLE_HOST_SERVICE_ON_START"    : "y"
"INCLUDE_RESTAPI"                 : "n"
"INCLUDE_SFLOW"                   : "y"
"INCLUDE_NAT"                     : "y"
"INCLUDE_DHCP_RELAY"              : "y"
"INCLUDE_DHCP_SERVER"             : "n"
"INCLUDE_P4RT"                    : "n"
"INCLUDE_VS_DASH_SAI"             : "y"
"INCLUDE_KUBERNETES"              : "n"
"INCLUDE_KUBERNETES_MASTER"       : "n"
"INCLUDE_MACSEC"                  : "y"
"INCLUDE_MUX"                     : "y"
"INCLUDE_TEAMD"                   : "y"
"INCLUDE_DASH_HA"                 : "y"
"INCLUDE_ROUTER_ADVERTISER"       : "y"
"INCLUDE_BOOTCHART                : "y"
"ENABLE_BOOTCHART                 : "n"
"INCLUDE_FIPS"                    : "y"
"ENABLE_TRANSLIB_WRITE"           : ""
"ENABLE_NATIVE_WRITE"             : "y"
"ENABLE_DIALOUT"                  : ""
"ENABLE_AUTO_TECH_SUPPORT"        : "y"
"PDDF_SUPPORT"                    : "y"
"MULTIARCH_QEMU_ENVIRON"          : "n"
"SONIC_VERSION_CONTROL_COMPONENTS": "py2,py3,web,git,docker"
"ENABLE_ASAN"                     : "n"
"DEFAULT_CONTAINER_REGISTRY"      : "publicmirror.azurecr.io/"
"CROSS_BUILD_ENVIRON"             : "n"
"LEGACY_SONIC_MGMT_DOCKER"        : "y"
"INCLUDE_EXTERNAL_PATCHES"        : "n"
"PTF_ENV_PY_VER"                  : "py3"
"ENABLE_MULTIDB"                  : ""

mv: cannot move '/etc/apt/sources.list.d/debian.sources' to '/etc/apt/sources.list.d/debian.sources.back': Permission denied
fatal: not a git repository (or any of the parent directories): .git
"SONIC_DPKG_CACHE_METHOD"         : "none"

[ building ] [ target/debs/bookworm/linux-headers-6.1.0-29-2-common_6.1.123-1_all.deb-install ] 
[ building ] [ target/debs/bookworm/libtac-dev_1.4.1-1_amd64.deb ] 
[ building ] [ target/debs/bookworm/libtac2_1.4.1-1_amd64.deb-install ] 
[ finished ] [ target/debs/bookworm/libtac-dev_1.4.1-1_amd64.deb ] 
[ building ] [ target/debs/bookworm/libyang2-dev_2.1.148-0.2_amd64.deb ] 
[ finished ] [ target/debs/bookworm/libyang2-dev_2.1.148-0.2_amd64.deb ] 
[ building ] [ target/debs/bookworm/libyang2t64_2.1.148-0.2_amd64.deb-install ] 
[ finished ] [ target/debs/bookworm/linux-headers-6.1.0-29-2-common_6.1.123-1_all.deb-install ] 
[ building ] [ target/debs/bookworm/libnl-genl-3-200_3.7.0-0.2+b1sonic1_amd64.deb ] 
[ finished ] [ target/debs/bookworm/libnl-genl-3-200_3.7.0-0.2+b1sonic1_amd64.deb ] 
[ building ] [ target/debs/bookworm/libnl-nf-3-200_3.7.0-0.2+b1sonic1_amd64.deb ] 
[ finished ] [ target/debs/bookworm/libnl-nf-3-200_3.7.0-0.2+b1sonic1_amd64.deb ] 
[ building ] [ target/python-wheels/bookworm/redis_dump_load-1.1-py3-none-any.whl-install ] 
[ finished ] [ target/python-wheels/bookworm/redis_dump_load-1.1-py3-none-any.whl-install ] 
[ building ] [ target/debs/bookworm/libdashapi_1.0.0_amd64.deb-install ] 
[ finished ] [ target/debs/bookworm/libdashapi_1.0.0_amd64.deb-install ] 
[ building ] [ target/debs/bookworm/libip4tc2_1.8.9-2_amd64.deb ] 
[ finished ] [ target/debs/bookworm/libip4tc2_1.8.9-2_amd64.deb ] 
[ building ] [ target/debs/bookworm/libip6tc2_1.8.9-2_amd64.deb ] 
[ finished ] [ target/debs/bookworm/libip6tc2_1.8.9-2_amd64.deb ] 
[ building ] [ target/debs/bookworm/libiptc0_1.8.9-2_amd64.deb ] 
[ finished ] [ target/debs/bookworm/libiptc0_1.8.9-2_amd64.deb ] 
[ building ] [ target/debs/bookworm/libxtables12_1.8.9-2_amd64.deb ] 
[ finished ] [ target/debs/bookworm/libxtables12_1.8.9-2_amd64.deb ] 
[ building ] [ target/debs/bookworm/libsensors5_3.6.0-7.1_amd64.deb ] 
[ finished ] [ target/debs/bookworm/libsensors5_3.6.0-7.1_amd64.deb ] 
[ building ] [ target/debs/bookworm/fancontrol_3.6.0-7.1_all.deb ] 
[ finished ] [ target/debs/bookworm/fancontrol_3.6.0-7.1_all.deb ] 
[ building ] [ target/debs/bookworm/sensord_3.6.0-7.1_amd64.deb ] 
[ finished ] [ target/debs/bookworm/sensord_3.6.0-7.1_amd64.deb ] 
[ building ] [ target/debs/bookworm/linuxptp_4.2-sonic-0_amd64.deb ] 
[ building ] [ target/debs/bookworm/libnl-3-200_3.7.0-0.2+b1sonic1_amd64.deb-install ] 
[ finished ] [ target/debs/bookworm/libnl-3-200_3.7.0-0.2+b1sonic1_amd64.deb-install ] 
[ building ] [ target/debs/bookworm/libsaibcm_13.2.1.7_amd64.deb-install ] 
[ finished ] [ target/debs/bookworm/libsaibcm_13.2.1.7_amd64.deb-install ] 
[ building ] [ target/debs/bookworm/libsaibcm_dnx_13.2.1.1_amd64.deb ] 
[ finished ] [ target/debs/bookworm/libyang2t64_2.1.148-0.2_amd64.deb-install ] 
[ building ] [ target/debs/bookworm/libsaicredo_0.9.9_amd64.deb ] 
[ finished ] [ target/debs/bookworm/libsaibcm_dnx_13.2.1.1_amd64.deb ] 
[ building ] [ target/debs/bookworm/libsaicredo-owl_0.9.9_amd64.deb ] 
[ finished ] [ target/debs/bookworm/libtac2_1.4.1-1_amd64.deb-install ] 
[ building ] [ target/debs/bookworm/libsaicredo-blackhawk_0.9.9_amd64.deb ] 
[ finished ] [ target/debs/bookworm/libsaicredo_0.9.9_amd64.deb ] 
[ building ] [ target/debs/bookworm/libsaibroncos_3.12_amd64.deb ] 
[ finished ] [ target/debs/bookworm/libsaicredo-owl_0.9.9_amd64.deb ] 
[ building ] [ target/files/bookworm/dsserve ] 
[ finished ] [ target/debs/bookworm/libsaicredo-blackhawk_0.9.9_amd64.deb ] 
[ building ] [ target/debs/bookworm/isc-dhcp-relay_4.4.3-P1-2_amd64.deb ] 
[ finished ] [ target/debs/bookworm/libsaibroncos_3.12_amd64.deb ] 
[ building ] [ target/debs/bookworm/libnl-3-dev_3.7.0-0.2+b1sonic1_amd64.deb-install ] 
[ finished ] [ target/debs/bookworm/libnl-3-dev_3.7.0-0.2+b1sonic1_amd64.deb-install ] 
[ building ] [ target/debs/bookworm/libnl-genl-3-200_3.7.0-0.2+b1sonic1_amd64.deb-install ] 
[ finished ] [ target/debs/bookworm/libnl-genl-3-200_3.7.0-0.2+b1sonic1_amd64.deb-install ] 
[ building ] [ target/debs/bookworm/libnl-route-3-200_3.7.0-0.2+b1sonic1_amd64.deb-install ] 
[ finished ] [ target/debs/bookworm/libnl-route-3-200_3.7.0-0.2+b1sonic1_amd64.deb-install ] 
[ building ] [ target/debs/bookworm/rasdaemon_0.6.8-1_amd64.deb ] 
[ finished ] [ target/debs/bookworm/isc-dhcp-relay_4.4.3-P1-2_amd64.deb ] 
[ FAIL LOG START ] [ target/debs/bookworm/isc-dhcp-relay_4.4.3-P1-2_amd64.deb ]
Build start time: Wed Aug 5 09:50:38 UTC 2026
[ REASON ] :      target/debs/bookworm/isc-dhcp-relay_4.4.3-P1-2_amd64.deb does not exist  
[ FLAGS  FILE    ] : [] 
[ FLAGS  DEPENDS ] : [] 
[ FLAGS  DIFF    ] : [] 
make[1]: warning: -j112 forced in submake: resetting jobserver mode.
make[1]: Entering directory '/sonic/src/isc-dhcp'
# Remove any stale files
rm -rf ./isc-dhcp-4.4.3-P1
# Get isc-dhcp release, debian files
dget -u http://deb.debian.org/debian/pool/main/i/isc-dhcp/isc-dhcp_4.4.3-P1-2.dsc
pushd ./isc-dhcp-4.4.3-P1
# Create a git repository here for stg to apply patches
git init
git add -f *
git commit -qm "initial commit"
# Apply patches
stg init
stg import -s ../patch/series
# Build source and Debian packages
dpkg-buildpackage -rfakeroot -b -us -uc -j112 --admindir /sonic/dpkg/tmp.rvMSVoUsde
popd
# Move the newly-built .deb packages to the destination directory
mv isc-dhcp-relay-dbgsym_4.4.3-P1-2_amd64.deb isc-dhcp-relay_4.4.3-P1-2_amd64.deb /sonic/target/debs/bookworm/
dget: retrieving http://deb.debian.org/debian/pool/main/i/isc-dhcp/isc-dhcp_4.4.3-P1-2.dsc
get_url_version http://deb.debian.org/debian/pool/main/i/isc-dhcp/isc-dhcp_4.4.3-P1-2.dsc failed
dget: curl isc-dhcp_4.4.3-P1-2.dsc http://deb.debian.org/debian/pool/main/i/isc-dhcp/isc-dhcp_4.4.3-P1-2.dsc failed
make[1]: *** [Makefile:9: /sonic/target/debs/bookworm/isc-dhcp-relay_4.4.3-P1-2_amd64.deb] Error 1
make[1]: Leaving directory '/sonic/src/isc-dhcp'
[  FAIL LOG END  ] [ target/debs/bookworm/isc-dhcp-relay_4.4.3-P1-2_amd64.deb ]
make: *** [slave.mk:757: target/debs/bookworm/isc-dhcp-relay_4.4.3-P1-2_amd64.deb] Error 1
make: *** Waiting for unfinished jobs....
[ finished ] [ target/files/bookworm/dsserve ] 
[ finished ] [ target/debs/bookworm/linuxptp_4.2-sonic-0_amd64.deb ] 
[ finished ] [ target/debs/bookworm/rasdaemon_0.6.8-1_amd64.deb ] 
make[1]: *** [Makefile.work:611: all] Error 2
make[1]: Leaving directory '/var/lib/jenkins/workspace/ETRI-202505/platform-broadcom'
make: *** [Makefile:57: all] Error 2