Content

상위 폴더로 이동
+++ --- Making all --- +++
./scripts/run_with_retry make BLDENV=bookworm -f Makefile.work all
make[1]: Entering directory '/var/lib/jenkins/workspace/ETRI-202505/platform-broadcom'
"SECURE_UPGRADE_PROD_SIGNING_TOOL": ""
~/workspace/ETRI-202505/platform-broadcom/src/sonic-build-hooks ~/workspace/ETRI-202505/platform-broadcom
make[2]: Entering directory '/var/lib/jenkins/workspace/ETRI-202505/platform-broadcom/src/sonic-build-hooks'
dpkg-deb: building package 'sonic-build-hooks' in 'buildinfo/sonic-build-hooks_1.0_all.deb'.
make[2]: Leaving directory '/var/lib/jenkins/workspace/ETRI-202505/platform-broadcom/src/sonic-build-hooks'
~/workspace/ETRI-202505/platform-broadcom
Checking sonic-slave-base image: sonic-slave-bookworm:2f250bfbb4a
Checking sonic-slave-user image: sonic-slave-bookworm-jenkins:7d0c25fdbd0
SONiC Build System

Build Configuration
"CONFIGURED_PLATFORM"             : "broadcom"
"CONFIGURED_ARCH"                 : "amd64"
"SONIC_CONFIG_PRINT_DEPENDENCIES" : ""
"SONIC_BUILD_JOBS"                : "4"
"SONIC_CONFIG_MAKE_JOBS"          : "112"
"USE_NATIVE_DOCKERD_FOR_BUILD"    : ""
"SONIC_USE_DOCKER_BUILDKIT"       : ""
"USERNAME"                        : "admin"
"PASSWORD"                        : "YourPaSsWoRd"
"CHANGE_DEFAULT_PASSWORD"         : "n"
"SECURE_UPGRADE_MODE"             : "no_sign"
"SECURE_UPGRADE_DEV_SIGNING_KEY"  : ""
"SECURE_UPGRADE_SIGNING_CERT"     : ""
"SECURE_UPGRADE_PROD_SIGNING_TOOL": ""
"SECURE_UPGRADE_PROD_TOOL_ARGS"   : ""
"ONIE_IMAGE_PART_SIZE"            : ""
"SHUTDOWN_BGP_ON_START"           : ""
"ENABLE_PFCWD_ON_START"           : ""
"SONIC_BUFFER_MODEL"              : ""
"INSTALL_DEBUG_TOOLS"             : ""
"ROUTING_STACK"                   : "frr"
"FRR_USER_UID"                    : "300"
"FRR_USER_GID"                    : "300"
"ENABLE_SYNCD_RPC"                : ""
"SAITHRIFT_V2"                    : ""
"ENABLE_ORGANIZATION_EXTENSIONS"  : "y"
"HTTP_PROXY"                      : ""
"HTTPS_PROXY"                     : ""
"NO_PROXY"                        : ""
"ENABLE_ZTP"                      : ""
"INCLUDE_PDE"                     : ""
"SONIC_DEBUGGING_ON"              : ""
"SONIC_PROFILING_ON"              : ""
"KERNEL_PROCURE_METHOD"           : "build"
"BUILD_TIMESTAMP"                 : "20260805.193220"
"BUILD_LOG_TIMESTAMP"             : "none"
"SONIC_IMAGE_VERSION"             : "etri-202505.24-bf29a9955"
"BLDENV"                          : "bookworm"
"VS_PREPARE_MEM"                  : "yes"
"INCLUDE_MGMT_FRAMEWORK"          : "y"
"INCLUDE_ICCPD"                   : "n"
"INCLUDE_STP"                     : "y"
"INCLUDE_SYSTEM_TELEMETRY"        : "n"
"INCLUDE_SYSTEM_GNMI"             : "y"
"INCLUDE_SYSTEM_BMP"              : "y"
"INCLUDE_SYSTEM_EVENTD"           : "y"
"ENABLE_HOST_SERVICE_ON_START"    : "y"
"INCLUDE_RESTAPI"                 : "n"
"INCLUDE_SFLOW"                   : "y"
"INCLUDE_NAT"                     : "y"
"INCLUDE_DHCP_RELAY"              : "y"
"INCLUDE_DHCP_SERVER"             : "n"
"INCLUDE_P4RT"                    : "n"
"INCLUDE_VS_DASH_SAI"             : "y"
"INCLUDE_KUBERNETES"              : "n"
"INCLUDE_KUBERNETES_MASTER"       : "n"
"INCLUDE_MACSEC"                  : "y"
"INCLUDE_MUX"                     : "y"
"INCLUDE_TEAMD"                   : "y"
"INCLUDE_DASH_HA"                 : "y"
"INCLUDE_ROUTER_ADVERTISER"       : "y"
"INCLUDE_BOOTCHART                : "y"
"ENABLE_BOOTCHART                 : "n"
"INCLUDE_FIPS"                    : "y"
"ENABLE_TRANSLIB_WRITE"           : ""
"ENABLE_NATIVE_WRITE"             : "y"
"ENABLE_DIALOUT"                  : ""
"ENABLE_AUTO_TECH_SUPPORT"        : "y"
"PDDF_SUPPORT"                    : "y"
"MULTIARCH_QEMU_ENVIRON"          : "n"
"SONIC_VERSION_CONTROL_COMPONENTS": "py2,py3,web,git,docker"
"ENABLE_ASAN"                     : "n"
"DEFAULT_CONTAINER_REGISTRY"      : "publicmirror.azurecr.io/"
"CROSS_BUILD_ENVIRON"             : "n"
"LEGACY_SONIC_MGMT_DOCKER"        : "y"
"INCLUDE_EXTERNAL_PATCHES"        : "n"
"PTF_ENV_PY_VER"                  : "py3"
"ENABLE_MULTIDB"                  : ""

mv: cannot move '/etc/apt/sources.list.d/debian.sources' to '/etc/apt/sources.list.d/debian.sources.back': Permission denied
fatal: not a git repository (or any of the parent directories): .git
"SONIC_DPKG_CACHE_METHOD"         : "none"

[ building ] [ target/debs/bookworm/sonic-rsyslog-plugin_1.0.0-0_amd64.deb ] 
[ building ] [ target/python-wheels/bookworm/redis_dump_load-1.1-py3-none-any.whl-install ] 
[ finished ] [ target/debs/bookworm/sonic-rsyslog-plugin_1.0.0-0_amd64.deb ] 
[ building ] [ target/debs/bookworm/libnl-3-200_3.7.0-0.2+b1sonic1_amd64.deb-install ] 
[ building ] [ target/debs/bookworm/libyang_1.0.73_amd64.deb-install ] 
[ building ] [ target/python-wheels/bookworm/sonic_yang_models-1.0-py3-none-any.whl-install ] 
[ finished ] [ target/debs/bookworm/libnl-3-200_3.7.0-0.2+b1sonic1_amd64.deb-install ] 
[ building ] [ target/debs/bookworm/libnl-3-dev_3.7.0-0.2+b1sonic1_amd64.deb-install ] 
[ finished ] [ target/debs/bookworm/libnl-3-dev_3.7.0-0.2+b1sonic1_amd64.deb-install ] 
[ building ] [ target/debs/bookworm/libnl-genl-3-200_3.7.0-0.2+b1sonic1_amd64.deb-install ] 
[ finished ] [ target/python-wheels/bookworm/redis_dump_load-1.1-py3-none-any.whl-install ] 
[ building ] [ target/debs/bookworm/libnl-route-3-200_3.7.0-0.2+b1sonic1_amd64.deb-install ] 
[ finished ] [ target/debs/bookworm/libnl-genl-3-200_3.7.0-0.2+b1sonic1_amd64.deb-install ] 
[ building ] [ target/python-wheels/bookworm/swsssdk-2.0.1-py3-none-any.whl-install ] 
[ finished ] [ target/python-wheels/bookworm/sonic_yang_models-1.0-py3-none-any.whl-install ] 
[ building ] [ target/debs/bookworm/libnl-genl-3-dev_3.7.0-0.2+b1sonic1_amd64.deb-install ] 
[ finished ] [ target/debs/bookworm/libnl-genl-3-dev_3.7.0-0.2+b1sonic1_amd64.deb-install ] 
[ building ] [ target/python-wheels/bookworm/sonic_yang_mgmt-1.0-py3-none-any.whl-install ] 
[ finished ] [ target/python-wheels/bookworm/swsssdk-2.0.1-py3-none-any.whl-install ] 
[ building ] [ target/debs/bookworm/libdashapi_1.0.0_amd64.deb-install ] 
[ finished ] [ target/debs/bookworm/libdashapi_1.0.0_amd64.deb-install ] 
[ building ] [ target/python-wheels/bookworm/sonic_py_common-1.0-py3-none-any.whl-install ] 
[ finished ] [ target/debs/bookworm/libyang_1.0.73_amd64.deb-install ] 
[ building ] [ target/docker-base-bookworm.gz-load ] 
[ finished ] [ target/python-wheels/bookworm/sonic_yang_mgmt-1.0-py3-none-any.whl-install ] 
[ building ] [ target/debs/bookworm/libyang-dev_1.0.73_amd64.deb-install ] 
[ finished ] [ target/debs/bookworm/libnl-route-3-200_3.7.0-0.2+b1sonic1_amd64.deb-install ] 
[ building ] [ target/debs/bookworm/libyang-cpp_1.0.73_amd64.deb-install ] 
[ finished ] [ target/debs/bookworm/libyang-cpp_1.0.73_amd64.deb-install ] 
[ building ] [ target/debs/bookworm/libnl-route-3-dev_3.7.0-0.2+b1sonic1_amd64.deb-install ] 
[ finished ] [ target/python-wheels/bookworm/sonic_py_common-1.0-py3-none-any.whl-install ] 
[ building ] [ target/debs/bookworm/python3-yang_1.0.73_amd64.deb-install ] 
[ finished ] [ target/debs/bookworm/libnl-route-3-dev_3.7.0-0.2+b1sonic1_amd64.deb-install ] 
[ building ] [ target/debs/bookworm/libsaibcm_13.2.1.7_amd64.deb-install ] 
[ finished ] [ target/debs/bookworm/libsaibcm_13.2.1.7_amd64.deb-install ] 
[ building ] [ target/debs/bookworm/libnl-nf-3-200_3.7.0-0.2+b1sonic1_amd64.deb-install ] 
[ finished ] [ target/debs/bookworm/libnl-nf-3-200_3.7.0-0.2+b1sonic1_amd64.deb-install ] 
[ building ] [ target/debs/bookworm/libnl-nf-3-dev_3.7.0-0.2+b1sonic1_amd64.deb-install ] 
[ finished ] [ target/debs/bookworm/libnl-nf-3-dev_3.7.0-0.2+b1sonic1_amd64.deb-install ] 
[ building ] [ target/python-wheels/bookworm/sonic_pcied-1.0-py3-none-any.whl ] 
[ finished ] [ target/docker-base-bookworm.gz-load ] 
[ building ] [ target/debs/bookworm/libnl-cli-3-200_3.7.0-0.2+b1sonic1_amd64.deb-install ] 
[ finished ] [ target/debs/bookworm/libnl-cli-3-200_3.7.0-0.2+b1sonic1_amd64.deb-install ] 
[ building ] [ target/python-wheels/bookworm/sonic_stormond-1.0-py3-none-any.whl ] 
[ finished ] [ target/debs/bookworm/libyang-dev_1.0.73_amd64.deb-install ] 
[ building ] [ target/debs/bookworm/libnl-cli-3-dev_3.7.0-0.2+b1sonic1_amd64.deb-install ] 
[ finished ] [ target/debs/bookworm/libnl-cli-3-dev_3.7.0-0.2+b1sonic1_amd64.deb-install ] 
[ building ] [ target/debs/bookworm/libsaibcm-dev_13.2.1.7_amd64.deb-install ] 
dpkg-query: package 'libsaivs-dev' is not installed and no information is available
Use dpkg --info (= dpkg-deb --info) to examine archive files.
[ finished ] [ target/debs/bookworm/libsaibcm-dev_13.2.1.7_amd64.deb-install ] 
[ building ] [ target/debs/bookworm/libteam5_1.31-1_amd64.deb-install ] 
[ finished ] [ target/debs/bookworm/python3-yang_1.0.73_amd64.deb-install ] 
[ building ] [ target/debs/bookworm/sonic-mgmt-common_1.0.0_amd64.deb-install ] 
[ finished ] [ target/debs/bookworm/sonic-mgmt-common_1.0.0_amd64.deb-install ] 
[ building ] [ target/debs/bookworm/libswsscommon_1.0.0_amd64.deb-install ] 
[ finished ] [ target/debs/bookworm/libswsscommon_1.0.0_amd64.deb-install ] 
[ building ] [ target/debs/bookworm/python3-swsscommon_1.0.0_amd64.deb-install ] 
[ finished ] [ target/debs/bookworm/python3-swsscommon_1.0.0_amd64.deb-install ] 
[ building ] [ target/debs/bookworm/libswsscommon-dev_1.0.0_amd64.deb-install ] 
[ finished ] [ target/debs/bookworm/libswsscommon-dev_1.0.0_amd64.deb-install ] 
[ building ] [ target/debs/bookworm/sonic-mgmt-common-codegen_1.0.0_amd64.deb-install ] 
[ finished ] [ target/debs/bookworm/sonic-mgmt-common-codegen_1.0.0_amd64.deb-install ] 
[ building ] [ target/python-wheels/bookworm/sonic_d-2.0.0-py3-none-any.whl ] 
[ finished ] [ target/python-wheels/bookworm/sonic_pcied-1.0-py3-none-any.whl ] 
[ building ] [ target/debs/bookworm/sonic-linkmgrd_1.0.0-1_amd64.deb ] 
[ finished ] [ target/debs/bookworm/libteam5_1.31-1_amd64.deb-install ] 
[ building ] [ target/python-wheels/bookworm/sonic_ledd-1.1-py3-none-any.whl ] 
[ finished ] [ target/python-wheels/bookworm/sonic_stormond-1.0-py3-none-any.whl ] 
[ building ] [ target/debs/bookworm/sysmgr_1.0.0_amd64.deb ] 
[ finished ] [ target/python-wheels/bookworm/sonic_d-2.0.0-py3-none-any.whl ] 
[ building ] [ target/debs/bookworm/sonic-dhcpmon_1.0.0-0_amd64.deb ] 
[ finished ] [ target/python-wheels/bookworm/sonic_ledd-1.1-py3-none-any.whl ] 
[ building ] [ target/debs/bookworm/sonic-dhcp6relay_1.0.0-0_amd64.deb ] 
[ finished ] [ target/debs/bookworm/sonic-dhcpmon_1.0.0-0_amd64.deb ] 
[ building ] [ target/python-wheels/bookworm/sonic_dhcp_utilities-1.0-py3-none-any.whl ] 
[ finished ] [ target/python-wheels/bookworm/sonic_dhcp_utilities-1.0-py3-none-any.whl ] 
[ building ] [ target/debs/bookworm/wpasupplicant_2.9.0-14_amd64.deb ] 
[ finished ] [ target/debs/bookworm/sonic-dhcp6relay_1.0.0-0_amd64.deb ] 
[ building ] [ target/python-wheels/bookworm/sonic_ctrmgrd-1.0.0-py3-none-any.whl ] 
[ finished ] [ target/debs/bookworm/wpasupplicant_2.9.0-14_amd64.deb ] 
[ building ] [ target/python-wheels/bookworm/sonic_containercfgd-1.0-py3-none-any.whl ] 
[ finished ] [ target/python-wheels/bookworm/sonic_containercfgd-1.0-py3-none-any.whl ] 
[ building ] [ target/python-wheels/bookworm/sonic_config_engine-1.0-py3-none-any.whl ] 
[ finished ] [ target/python-wheels/bookworm/sonic_ctrmgrd-1.0.0-py3-none-any.whl ] 
[ building ] [ target/debs/bookworm/sonic-bmp_0.1_amd64.deb-install ] 
[ finished ] [ target/debs/bookworm/sonic-bmp_0.1_amd64.deb-install ] 
[ building ] [ target/debs/bookworm/dash-ha_1.0.0_amd64.deb ] 
[ finished ] [ target/debs/bookworm/sysmgr_1.0.0_amd64.deb ] 
[ building ] [ target/debs/bookworm/libsairedis_1.0.0_amd64.deb ] 
[ finished ] [ target/debs/bookworm/dash-ha_1.0.0_amd64.deb ] 
[ building ] [ target/debs/bookworm/stp_1.0.0_amd64.deb ] 
[ finished ] [ target/debs/bookworm/stp_1.0.0_amd64.deb ] 
[ building ] [ target/debs/bookworm/libteamdctl0_1.31-1_amd64.deb-install ] 
[ finished ] [ target/debs/bookworm/libteamdctl0_1.31-1_amd64.deb-install ] 
[ building ] [ target/debs/bookworm/stp_1.0.0_amd64.deb-install ] 
[ finished ] [ target/debs/bookworm/stp_1.0.0_amd64.deb-install ] 
[ building ] [ target/debs/bookworm/sonic-gnmi_0.1_amd64.deb ] 
[ finished ] [ target/debs/bookworm/sonic-gnmi_0.1_amd64.deb ] 
[ building ] [ target/debs/bookworm/libteam-dev_1.31-1_amd64.deb-install ] 
[ finished ] [ target/debs/bookworm/libteam-dev_1.31-1_amd64.deb-install ] 
[ building ] [ target/debs/bookworm/libteam-utils_1.31-1_amd64.deb-install ] 
[ finished ] [ target/debs/bookworm/libteam-utils_1.31-1_amd64.deb-install ] 
[ finished ] [ target/debs/bookworm/libsairedis_1.0.0_amd64.deb ] 
[ building ] [ target/debs/bookworm/libsairedis-dev_1.0.0_amd64.deb ] 
[ building ] [ target/debs/bookworm/libsaimetadata_1.0.0_amd64.deb ] 
[ finished ] [ target/debs/bookworm/libsairedis-dev_1.0.0_amd64.deb ] 
[ finished ] [ target/debs/bookworm/libsaimetadata_1.0.0_amd64.deb ] 
[ building ] [ target/debs/bookworm/libsaivs_1.0.0_amd64.deb ] 
[ building ] [ target/debs/bookworm/libsairedis_1.0.0_amd64.deb-install ] 
[ finished ] [ target/debs/bookworm/libsaivs_1.0.0_amd64.deb ] 
[ building ] [ target/debs/bookworm/libsaimetadata-dev_1.0.0_amd64.deb ] 
[ finished ] [ target/debs/bookworm/libsaimetadata-dev_1.0.0_amd64.deb ] 
[ building ] [ target/debs/bookworm/libsaivs-dev_1.0.0_amd64.deb ] 
[ finished ] [ target/debs/bookworm/libsaivs-dev_1.0.0_amd64.deb ] 
[ finished ] [ target/debs/bookworm/libsairedis_1.0.0_amd64.deb-install ] 
[ building ] [ target/debs/bookworm/libsairedis-dev_1.0.0_amd64.deb-install ] 
[ building ] [ target/debs/bookworm/libsaimetadata_1.0.0_amd64.deb-install ] 
[ finished ] [ target/debs/bookworm/libsairedis-dev_1.0.0_amd64.deb-install ] 
[ building ] [ target/debs/bookworm/libsaivs_1.0.0_amd64.deb-install ] 
[ finished ] [ target/debs/bookworm/libsaivs_1.0.0_amd64.deb-install ] 
[ building ] [ target/debs/bookworm/syncd_1.0.0_amd64.deb ] 
[ finished ] [ target/debs/bookworm/libsaimetadata_1.0.0_amd64.deb-install ] 
[ building ] [ target/debs/bookworm/libsaimetadata-dev_1.0.0_amd64.deb-install ] 
[ finished ] [ target/debs/bookworm/libsaimetadata-dev_1.0.0_amd64.deb-install ] 
[ building ] [ target/debs/bookworm/libsaivs-dev_1.0.0_amd64.deb-install ] 
[ finished ] [ target/python-wheels/bookworm/sonic_config_engine-1.0-py3-none-any.whl ] 
[ building ] [ target/docker-config-engine-bookworm.gz ] 
[ finished ] [ target/debs/bookworm/sonic-linkmgrd_1.0.0-1_amd64.deb ] 
[ building ] [ target/python-wheels/bookworm/sonic_config_engine-1.0-py3-none-any.whl-install ] 
[ finished ] [ target/python-wheels/bookworm/sonic_config_engine-1.0-py3-none-any.whl-install ] 
[ building ] [ target/python-wheels/bookworm/sonic_platform_common-1.0-py3-none-any.whl ] 
[ finished ] [ target/docker-config-engine-bookworm.gz ] 
[ building ] [ target/python-wheels/bookworm/sonic_bgpcfgd-1.0-py3-none-any.whl ] 
[ finished ] [ target/python-wheels/bookworm/sonic_platform_common-1.0-py3-none-any.whl ] 
[ building ] [ target/python-wheels/bookworm/sonic_frr_mgmt_framework-1.0-py3-none-any.whl ] 
[ finished ] [ target/python-wheels/bookworm/sonic_bgpcfgd-1.0-py3-none-any.whl ] 
[ building ] [ target/docker-config-engine-bookworm.gz-load ] 
[ finished ] [ target/python-wheels/bookworm/sonic_frr_mgmt_framework-1.0-py3-none-any.whl ] 
[ building ] [ target/python-wheels/bookworm/sonic_platform_common-1.0-py3-none-any.whl-install ] 
[ finished ] [ target/python-wheels/bookworm/sonic_platform_common-1.0-py3-none-any.whl-install ] 
[ building ] [ target/python-wheels/bookworm/system_health-1.0-py3-none-any.whl ] 
[ finished ] [ target/docker-config-engine-bookworm.gz-load ] 
[ building ] [ target/docker-auditd-watchdog.gz ] 
[ finished ] [ target/python-wheels/bookworm/system_health-1.0-py3-none-any.whl ] 
[ building ] [ target/docker-auditd.gz ] 
[ finished ] [ target/docker-auditd.gz ] 
[ building ] [ target/docker-bmp-watchdog.gz ] 
[ finished ] [ target/debs/bookworm/syncd_1.0.0_amd64.deb ] 
[ building ] [ target/python-wheels/bookworm/sonic_utilities-1.2-py3-none-any.whl ] 
dpkg-query: package 'libsaibcm-dev' is not installed and no information is available
Use dpkg --info (= dpkg-deb --info) to examine archive files.
[ finished ] [ target/debs/bookworm/libsaivs-dev_1.0.0_amd64.deb-install ] 
[ building ] [ target/docker-database.gz ] 
[ finished ] [ target/docker-auditd-watchdog.gz ] 
[ building ] [ target/docker-gnmi-watchdog.gz ] 
[ finished ] [ target/python-wheels/bookworm/sonic_utilities-1.2-py3-none-any.whl ] 
[ building ] [ target/docker-sonic-gnmi.gz ] 
[ finished ] [ target/docker-sonic-gnmi.gz ] 
[ building ] [ target/docker-lldp.gz ] 
[ finished ] [ target/docker-database.gz ] 
[ building ] [ target/docker-mux.gz ] 
[ finished ] [ target/docker-bmp-watchdog.gz ] 
[ building ] [ target/python-wheels/bookworm/sonic_psud-1.0-py3-none-any.whl ] 
[ finished ] [ target/python-wheels/bookworm/sonic_psud-1.0-py3-none-any.whl ] 
[ building ] [ target/python-wheels/bookworm/sonic_syseepromd-1.0-py3-none-any.whl ] 
[ finished ] [ target/python-wheels/bookworm/sonic_syseepromd-1.0-py3-none-any.whl ] 
[ building ] [ target/python-wheels/bookworm/sonic_thermalctld-1.0-py3-none-any.whl ] 
[ finished ] [ target/python-wheels/bookworm/sonic_thermalctld-1.0-py3-none-any.whl ] 
[ building ] [ target/python-wheels/bookworm/sonic_sensormond-1.0-py3-none-any.whl ] 
[ finished ] [ target/python-wheels/bookworm/sonic_sensormond-1.0-py3-none-any.whl ] 
[ building ] [ target/python-wheels/bookworm/sonic_xcvrd-1.0-py3-none-any.whl ] 
[ finished ] [ target/docker-mux.gz ] 
[ building ] [ target/python-wheels/bookworm/sonic_ycabled-1.0-py3-none-any.whl ] 
[ finished ] [ target/docker-lldp.gz ] 
[ building ] [ target/python-wheels/bookworm/sonic_chassisd-1.0-py3-none-any.whl ] 
[ finished ] [ target/python-wheels/bookworm/sonic_xcvrd-1.0-py3-none-any.whl ] 
[ building ] [ target/docker-ptp.gz ] 
[ finished ] [ target/python-wheels/bookworm/sonic_ycabled-1.0-py3-none-any.whl ] 
[ building ] [ target/docker-router-advertiser.gz ] 
[ finished ] [ target/python-wheels/bookworm/sonic_chassisd-1.0-py3-none-any.whl ] 
[ building ] [ target/python-wheels/bookworm/asyncsnmp-2.1.0-py3-none-any.whl ] 
[ finished ] [ target/docker-gnmi-watchdog.gz ] 
[ building ] [ target/docker-sonic-mgmt-framework.gz ] 
[ finished ] [ target/python-wheels/bookworm/asyncsnmp-2.1.0-py3-none-any.whl ] 
[ building ] [ target/docker-sysmgr.gz ] 
[ finished ] [ target/docker-ptp.gz ] 
[ building ] [ target/docker-syncd-brcm.gz ] 
[ finished ] [ target/docker-router-advertiser.gz ] 
[ building ] [ target/docker-gbsyncd-credo.gz ] 
[ finished ] [ target/docker-sysmgr.gz ] 
[ building ] [ target/docker-gbsyncd-broncos.gz ] 
[ finished ] [ target/docker-sonic-mgmt-framework.gz ] 
[ building ] [ target/python-wheels/bookworm/sonic_utilities-1.2-py3-none-any.whl-install ] 
[ finished ] [ target/python-wheels/bookworm/sonic_utilities-1.2-py3-none-any.whl-install ] 
[ building ] [ target/python-wheels/bookworm/sonic_bmpcfgd_services-1.0-py3-none-any.whl ] 
[ finished ] [ target/docker-gbsyncd-credo.gz ] 
[ building ] [ target/debs/bookworm/swss_1.0.0_amd64.deb ] 
[ finished ] [ target/python-wheels/bookworm/sonic_bmpcfgd_services-1.0-py3-none-any.whl ] 
[ building ] [ target/docker-eventd.gz ] 
[ finished ] [ target/docker-syncd-brcm.gz ] 
[ building ] [ target/docker-platform-monitor.gz ] 
[ finished ] [ target/docker-gbsyncd-broncos.gz ] 
[ building ] [ target/docker-snmp.gz ] 
[ finished ] [ target/docker-eventd.gz ] 
[ building ] [ target/docker-syncd-brcm-dnx.gz ] 
[ finished ] [ target/docker-platform-monitor.gz ] 
[ building ] [ target/docker-dhcp-relay.gz ] 
/sonic/dockers/docker-dhcp-relay/cli-plugin-tests /sonic
[ finished ] [ target/docker-syncd-brcm-dnx.gz ] 
[ building ] [ target/python-wheels/bookworm/sonic_host_services-1.0-py3-none-any.whl ] 
[ finished ] [ target/docker-snmp.gz ] 
[ building ] [ target/docker-sonic-bmp.gz ] 
/sonic
[ finished ] [ target/docker-sonic-bmp.gz ] 
[ finished ] [ target/docker-dhcp-relay.gz ] 
[ finished ] [ target/python-wheels/bookworm/sonic_host_services-1.0-py3-none-any.whl ] 
[ finished ] [ target/debs/bookworm/swss_1.0.0_amd64.deb ] 
[ building ] [ target/docker-swss-layer-bookworm.gz ] 
[ building ] [ target/docker-stp.gz ] 
[ finished ] [ target/docker-swss-layer-bookworm.gz ] 
[ building ] [ target/docker-swss-layer-bookworm.gz-load ] 
[ finished ] [ target/docker-swss-layer-bookworm.gz-load ] 
[ building ] [ target/docker-dash-ha.gz ] 
[ building ] [ target/docker-fpm-frr.gz ] 
[ building ] [ target/docker-nat.gz ] 
[ finished ] [ target/docker-stp.gz ] 
[ building ] [ target/docker-orchagent.gz ] 
[ finished ] [ target/docker-dash-ha.gz ] 
[ building ] [ target/docker-sflow.gz ] 
[ finished ] [ target/docker-nat.gz ] 
[ building ] [ target/docker-teamd.gz ] 
[ finished ] [ target/docker-fpm-frr.gz ] 
[ building ] [ target/docker-macsec.gz ] 
/sonic/dockers/docker-macsec/cli-plugin-tests /sonic
/sonic
[ finished ] [ target/docker-sflow.gz ] 
[ finished ] [ target/docker-teamd.gz ] 
[ finished ] [ target/docker-orchagent.gz ] 
[ finished ] [ target/docker-macsec.gz ] 
basename: missing operand
Try 'basename --help' for more information.
basename: missing operand
Try 'basename --help' for more information.
[ building ] [ target/sonic-broadcom.bin ] 
[ building ] [ target/sonic-aboot-broadcom.swi ] 
[ finished ] [ target/sonic-aboot-broadcom.swi ] 
[ FAIL LOG START ] [ target/sonic-aboot-broadcom.swi ]
Build start time: Wed Aug 5 11:01:07 UTC 2026
++ '[' -f .arch ']'
++ cat .arch
+ CONFIGURED_ARCH=amd64
+ DOCKER_VERSION=5:24.0.2-1~debian.12~bookworm
+ CONTAINERD_IO_VERSION=1.6.21-1
+ LINUX_KERNEL_VERSION=6.1.0-29-2
+ FILESYSTEM_ROOT=./fsroot
+ PLATFORM_DIR=platform
+ HOSTNAME=sonic
+ DEFAULT_USERINFO='Default admin user,,,'
+ BUILD_TOOL_PATH=src/sonic-build-hooks/buildinfo
+ TRUSTED_GPG_DIR=src/sonic-build-hooks/buildinfo/trusted.gpg.d
+ . ./onie-image.conf
++ : 32768
++ : x86_64
++ : broadcom
++ ONIEIMAGE_VERSION=r0
++ FILESYSTEM_ROOT=./fsroot-broadcom
++ FILESYSTEM_SQUASHFS=fs.squashfs
++ INSTALLER_PAYLOAD=fs.zip
++ FILESYSTEM_DOCKERFS=dockerfs.tar.gz
++ DOCKERFS_DIR=docker
++ DOCKER_RAMFS_SIZE=3500M
++ OUTPUT_ONIE_IMAGE=target/sonic-broadcom.bin
++ OUTPUT_RAW_IMAGE=target/sonic-broadcom.raw
++ RAW_IMAGE_DISK_SIZE=1700
++ OUTPUT_KVM_IMAGE=target/sonic-broadcom.img
++ KVM_IMAGE_DISK_SIZE=16
++ OUTPUT_ABOOT_IMAGE=target/sonic-aboot-broadcom.swi
++ ABOOT_BOOT_IMAGE=.sonic-boot.swi
++ OUTPUT_KVM_4ASIC_IMAGE=target/sonic-4asic-broadcom.img
++ OUTPUT_KVM_6ASIC_IMAGE=target/sonic-6asic-broadcom.img
++ OUTPUT_DSC_IMAGE=target/sonic-broadcom.tar
+ '[' -n 32768 ']'
+ '[' -n fs.zip ']'
+ '[' -n fs.squashfs ']'
+ '[' aboot = aboot ']'
+ TARGET_BOOTLOADER=aboot
+ [[ y != y ]]
+ [[ n == y ]]
+ [[ y == y ]]
+ echo '[INFO] RFS build: second stage'
[INFO] RFS build: second stage
+ sudo mount proc /proc -t proc
+ sudo fuser -vm ./fsroot-broadcom
                     USER        PID ACCESS COMMAND
/sonic/fsroot-broadcom:
                     root     kernel mount /usr/sbin/docker-init
                     jenkins       1 ..ce. docker-init
                     jenkins       7 ..c.. bash
                     jenkins       8 ..c.. make
                     root       7180 ....m dockerd
                     root       7296 ....m containerd
                     jenkins   338697 ..c.. bash
                     jenkins   338980 ..c.. bash
                     jenkins   339173 ..c.. build_debian.sh
                     jenkins   339174 ..c.. process_log.sh
                     root      339191 ..c.. sudo
                     root      339192 ..c.. unsquashfs
                     jenkins   339311 ..c.. build_debian.sh
                     jenkins   339312 ..c.. process_log.sh
                     root      339320 ..c.. sudo
+ sudo rm -rf ./fsroot-broadcom
rm: cannot remove './fsroot-broadcom/dev/ida': Directory not empty
[  FAIL LOG END  ] [ target/sonic-aboot-broadcom.swi ]
make: *** [slave.mk:1435: target/sonic-aboot-broadcom.swi] Error 1
make: *** Waiting for unfinished jobs....
[ finished ] [ target/sonic-broadcom.bin ] 
[ FAIL LOG START ] [ target/sonic-broadcom.bin ]
Build start time: Wed Aug 5 11:01:06 UTC 2026
++ '[' -f .arch ']'
++ cat .arch
+ CONFIGURED_ARCH=amd64
+ DOCKER_VERSION=5:24.0.2-1~debian.12~bookworm
+ CONTAINERD_IO_VERSION=1.6.21-1
+ LINUX_KERNEL_VERSION=6.1.0-29-2
+ FILESYSTEM_ROOT=./fsroot
+ PLATFORM_DIR=platform
+ HOSTNAME=sonic
+ DEFAULT_USERINFO='Default admin user,,,'
+ BUILD_TOOL_PATH=src/sonic-build-hooks/buildinfo
+ TRUSTED_GPG_DIR=src/sonic-build-hooks/buildinfo/trusted.gpg.d
+ . ./onie-image.conf
++ : 32768
++ : x86_64
++ : broadcom
++ ONIEIMAGE_VERSION=r0
++ FILESYSTEM_ROOT=./fsroot-broadcom
++ FILESYSTEM_SQUASHFS=fs.squashfs
++ INSTALLER_PAYLOAD=fs.zip
++ FILESYSTEM_DOCKERFS=dockerfs.tar.gz
++ DOCKERFS_DIR=docker
++ DOCKER_RAMFS_SIZE=3500M
++ OUTPUT_ONIE_IMAGE=target/sonic-broadcom.bin
++ OUTPUT_RAW_IMAGE=target/sonic-broadcom.raw
++ RAW_IMAGE_DISK_SIZE=1700
++ OUTPUT_KVM_IMAGE=target/sonic-broadcom.img
++ KVM_IMAGE_DISK_SIZE=16
++ OUTPUT_ABOOT_IMAGE=target/sonic-aboot-broadcom.swi
++ ABOOT_BOOT_IMAGE=.sonic-boot.swi
++ OUTPUT_KVM_4ASIC_IMAGE=target/sonic-4asic-broadcom.img
++ OUTPUT_KVM_6ASIC_IMAGE=target/sonic-6asic-broadcom.img
++ OUTPUT_DSC_IMAGE=target/sonic-broadcom.tar
+ '[' -n 32768 ']'
+ '[' -n fs.zip ']'
+ '[' -n fs.squashfs ']'
+ '[' onie = aboot ']'
+ [[ y != y ]]
+ [[ n == y ]]
+ [[ y == y ]]
+ echo '[INFO] RFS build: second stage'
[INFO] RFS build: second stage
+ sudo mount proc /proc -t proc
+ sudo fuser -vm ./fsroot-broadcom
                     USER        PID ACCESS COMMAND
/sonic/fsroot-broadcom:
                     root     kernel mount /usr/sbin/docker-init
                     jenkins       1 ..ce. docker-init
                     jenkins       7 ..c.. bash
                     jenkins       8 ..c.. make
                     root       7180 ....m dockerd
                     root       7296 ....m containerd
                     jenkins   338697 ..c.. bash
                     jenkins   338980 ..c.. bash
                     jenkins   339173 ..c.. build_debian.sh
                     jenkins   339174 ..c.. process_log.sh
                     root      339182 ..c.. sudo
+ sudo rm -rf ./fsroot-broadcom
+ sudo unsquashfs -d ./fsroot-broadcom target/sonic-broadcom.bin__broadcom__rfs.squashfs
Parallel unsquashfs: Using 112 processors
33628 inodes (34114 blocks) to write


[===/                                                        ]  3954/67742   5%
[====/                                                       ]  4595/67742   6%
[====-                                                       ]  5687/67742   8%
[========|                                                   ] 10105/67742  14%
[==========|                                                 ] 12361/67742  18%
[===============/                                            ] 18136/67742  26%
[=================\                                          ] 19690/67742  29%
[====================|                                       ] 23660/67742  34%
[======================/                                     ] 25381/67742  37%
[=========================-                                  ] 29759/67742  43%
[===================================-                        ] 41132/67742  60%
[====================================|                       ] 42236/67742  62%
[=========================================================|  ] 65804/67742  97%
[===========================================================/] 67742/67742 100%

created 25915 files
created 3484 directories
created 2357 symlinks
created 5351 devices
created 0 fifos
created 0 sockets
created 5 hardlinks
+ pushd ./fsroot-broadcom
/sonic/fsroot-broadcom /sonic
+ sudo mount --bind . .
+ popd
/sonic
+ trap_push 'sudo LANG=C chroot $FILESYSTEM_ROOT umount /proc || true'
+ local oldcmd=true
+ local 'newcmd=sudo LANG=C chroot $FILESYSTEM_ROOT umount /proc || true; true'
+ trap -- 'sudo LANG=C chroot $FILESYSTEM_ROOT umount /proc || true; true' EXIT INT TERM HUP
+ _trap_push 'sudo LANG=C chroot $FILESYSTEM_ROOT umount /proc || true; true'
+ local 'next=sudo LANG=C chroot $FILESYSTEM_ROOT umount /proc || true; true'
++ echo 'sudo LANG=C chroot $FILESYSTEM_ROOT umount /proc || true; true'
++ sed -e 's/'\''/'\''\\'\'''\''/g'
+ eval 'trap_push() {
        local oldcmd='\''sudo LANG=C chroot $FILESYSTEM_ROOT umount /proc || true; true'\''
        local newcmd="$1; $oldcmd"
        trap -- "$newcmd" EXIT INT TERM HUP
        _trap_push "$newcmd"
    }'
+ sudo LANG=C chroot ./fsroot-broadcom mount proc /proc -t proc
+ export build_version=etri-202505.24-bf29a9955
+ build_version=etri-202505.24-bf29a9955
++ cat ./fsroot-broadcom/etc/debian_version
+ export debian_version=12.15
+ debian_version=12.15
+ export kernel_version=6.1.0-29-2-amd64
+ kernel_version=6.1.0-29-2-amd64
+ export asic_type=broadcom
+ asic_type=broadcom
+ export asic_subtype=broadcom
+ asic_subtype=broadcom
++ git rev-parse --short HEAD
+ export commit_id=bf29a9955
+ commit_id=bf29a9955
++ git rev-parse --abbrev-ref HEAD
+ export branch=etri-202505
+ branch=etri-202505
++ '[' -f ./fsroot-broadcom/etc/sonic/sonic_release ']'
++ cat ./fsroot-broadcom/etc/sonic/sonic_release
+ export release=202505
+ release=202505
++ date -u
+ export 'build_date=Wed Aug  5 11:01:40 UTC 2026'
+ build_date='Wed Aug  5 11:01:40 UTC 2026'
+ export build_number=24
+ build_number=24
+ export built_by=jenkins@w2sh
+ built_by=jenkins@w2sh
+ export sonic_os_version=12
+ sonic_os_version=12
+ j2 files/build_templates/sonic_version.yml.j2
+ sudo tee ./fsroot-broadcom/etc/sonic/sonic_version.yml
---
build_version: 'etri-202505.24-bf29a9955'
debian_version: '12.15'
kernel_version: '6.1.0-29-2-amd64'
asic_type: broadcom
asic_subtype: 'broadcom'
commit_id: 'bf29a9955'
branch: 'etri-202505'
release: '202505'
build_date: Wed Aug  5 11:01:40 UTC 2026
build_number: 24
built_by: jenkins@w2sh
libswsscommon: 1.0.0
sonic_utilities: 1.2
sonic_os_version: 12
secure_boot_image: 'no'
+ '[' -f sonic_debian_extension.sh ']'
+ ./sonic_debian_extension.sh ./fsroot-broadcom platform bookworm
++ '[' -f .arch ']'
++ cat .arch
+ CONFIGURED_ARCH=amd64
++ '[' -f .platform ']'
++ cat .platform
+ CONFIGURED_PLATFORM=broadcom
+ . functions.sh
++ _trap_push true
++ local next=true
+++ echo true
+++ sed -e 's/'\''/'\''\\'\'''\''/g'
++ eval 'trap_push() {
        local oldcmd='\''true'\''
        local newcmd="$1; $oldcmd"
        trap -- "$newcmd" EXIT INT TERM HUP
        _trap_push "$newcmd"
    }'
+ BUILD_SCRIPTS_DIR=files/build_scripts
+ BUILD_TEMPLATES=files/build_templates
+ IMAGE_CONFIGS=files/image_config
+ SCRIPTS_DIR=files/scripts
+ DOCKER_SCRIPTS_DIR=files/docker
+ DOCKER_CTL_DIR=/usr/lib/docker/
+ DOCKER_CTL_SCRIPT=/usr/lib/docker//docker.sh
+ FILESYSTEM_ROOT_USR=./fsroot-broadcom/usr
+ FILESYSTEM_ROOT_USR_LIB=./fsroot-broadcom/usr/lib/
+ FILESYSTEM_ROOT_USR_LIB_SYSTEMD_SYSTEM=./fsroot-broadcom/usr/lib//systemd/system
+ FILESYSTEM_ROOT_USR_LIB_SYSTEMD_NETWORK=./fsroot-broadcom/usr/lib//systemd/network
+ FILESYSTEM_ROOT_USR_SHARE=./fsroot-broadcom/usr/share
+ FILESYSTEM_ROOT_USR_SHARE_SONIC=./fsroot-broadcom/usr/share/sonic
+ FILESYSTEM_ROOT_USR_SHARE_SONIC_SCRIPTS=./fsroot-broadcom/usr/share/sonic/scripts
+ FILESYSTEM_ROOT_USR_SHARE_SONIC_TEMPLATES=./fsroot-broadcom/usr/share/sonic/templates
+ FILESYSTEM_ROOT_USR_SHARE_SONIC_FIRMWARE=./fsroot-broadcom/usr/share/sonic/firmware
+ FILESYSTEM_ROOT_ETC=./fsroot-broadcom/etc
+ FILESYSTEM_ROOT_ETC_SONIC=./fsroot-broadcom/etc/sonic
+ GENERATED_SERVICE_FILE=./fsroot-broadcom/etc/sonic/generated_services.conf
+ trap_push clean_sys
+ local oldcmd=true
+ local 'newcmd=clean_sys; true'
+ trap -- 'clean_sys; true' EXIT INT TERM HUP
+ _trap_push 'clean_sys; true'
+ local 'next=clean_sys; true'
++ echo 'clean_sys; true'
++ sed -e 's/'\''/'\''\\'\'''\''/g'
+ eval 'trap_push() {
        local oldcmd='\''clean_sys; true'\''
        local newcmd="$1; $oldcmd"
        trap -- "$newcmd" EXIT INT TERM HUP
        _trap_push "$newcmd"
    }'
+ sudo LANG=C chroot ./fsroot-broadcom mount sysfs /sys -t sysfs
+ sudo bash -c 'echo "DOCKER_OPTS="--storage-driver=overlay2"" >> ./fsroot-broadcom/etc/default/docker'
+ sudo mkdir -p ./fsroot-broadcom//usr/lib/docker/
+ sudo cp files/docker/docker ./fsroot-broadcom//usr/lib/docker//docker.sh
+ [[ n == y ]]
+ [[ n == y ]]
+ sudo chroot ./fsroot-broadcom /usr/lib/docker//docker.sh start
chroot: failed to run command '/usr/lib/docker//docker.sh': No such file or directory
+ clean_sys
+ sudo chroot ./fsroot-broadcom umount /sys/fs/cgroup/cgroup.controllers /sys/fs/cgroup/cgroup.events /sys/fs/cgroup/cgroup.freeze /sys/fs/cgroup/cgroup.kill /sys/fs/cgroup/cgroup.max.depth /sys/fs/cgroup/cgroup.max.descendants /sys/fs/cgroup/cgroup.pressure /sys/fs/cgroup/cgroup.procs /sys/fs/cgroup/cgroup.stat /sys/fs/cgroup/cgroup.subtree_control /sys/fs/cgroup/cgroup.threads /sys/fs/cgroup/cgroup.type /sys/fs/cgroup/cpu.idle /sys/fs/cgroup/cpu.max /sys/fs/cgroup/cpu.max.burst /sys/fs/cgroup/cpu.pressure /sys/fs/cgroup/cpu.stat /sys/fs/cgroup/cpu.stat.local /sys/fs/cgroup/cpu.uclamp.max /sys/fs/cgroup/cpu.uclamp.min /sys/fs/cgroup/cpu.weight /sys/fs/cgroup/cpu.weight.nice /sys/fs/cgroup/cpuset.cpus /sys/fs/cgroup/cpuset.cpus.effective /sys/fs/cgroup/cpuset.cpus.exclusive /sys/fs/cgroup/cpuset.cpus.exclusive.effective /sys/fs/cgroup/cpuset.cpus.partition /sys/fs/cgroup/cpuset.mems /sys/fs/cgroup/cpuset.mems.effective /sys/fs/cgroup/docker /sys/fs/cgroup/hugetlb.1GB.current /sys/fs/cgroup/hugetlb.1GB.events /sys/fs/cgroup/hugetlb.1GB.events.local /sys/fs/cgroup/hugetlb.1GB.max /sys/fs/cgroup/hugetlb.1GB.numa_stat /sys/fs/cgroup/hugetlb.1GB.rsvd.current /sys/fs/cgroup/hugetlb.1GB.rsvd.max /sys/fs/cgroup/hugetlb.2MB.current /sys/fs/cgroup/hugetlb.2MB.events /sys/fs/cgroup/hugetlb.2MB.events.local /sys/fs/cgroup/hugetlb.2MB.max /sys/fs/cgroup/hugetlb.2MB.numa_stat /sys/fs/cgroup/hugetlb.2MB.rsvd.current /sys/fs/cgroup/hugetlb.2MB.rsvd.max /sys/fs/cgroup/io.max /sys/fs/cgroup/io.pressure /sys/fs/cgroup/io.prio.class /sys/fs/cgroup/io.stat /sys/fs/cgroup/io.weight /sys/fs/cgroup/memory.current /sys/fs/cgroup/memory.events /sys/fs/cgroup/memory.events.local /sys/fs/cgroup/memory.high /sys/fs/cgroup/memory.low /sys/fs/cgroup/memory.max /sys/fs/cgroup/memory.min /sys/fs/cgroup/memory.numa_stat /sys/fs/cgroup/memory.oom.group /sys/fs/cgroup/memory.peak /sys/fs/cgroup/memory.pressure /sys/fs/cgroup/memory.reclaim /sys/fs/cgroup/memory.stat /sys/fs/cgroup/memory.swap.current /sys/fs/cgroup/memory.swap.events /sys/fs/cgroup/memory.swap.high /sys/fs/cgroup/memory.swap.max /sys/fs/cgroup/memory.swap.peak /sys/fs/cgroup/memory.zswap.current /sys/fs/cgroup/memory.zswap.max /sys/fs/cgroup/memory.zswap.writeback /sys/fs/cgroup/misc.current /sys/fs/cgroup/misc.events /sys/fs/cgroup/misc.max /sys/fs/cgroup/pids.current /sys/fs/cgroup/pids.events /sys/fs/cgroup/pids.max /sys/fs/cgroup/pids.peak /sys/fs/cgroup/rdma.current /sys/fs/cgroup/rdma.max /sys/fs/cgroup /sys
umount: /sys/fs/cgroup/cgroup.controllers: no mount point specified.
umount: /sys/fs/cgroup/cgroup.events: no mount point specified.
umount: /sys/fs/cgroup/cgroup.freeze: no mount point specified.
umount: /sys/fs/cgroup/cgroup.kill: no mount point specified.
umount: /sys/fs/cgroup/cgroup.max.depth: no mount point specified.
umount: /sys/fs/cgroup/cgroup.max.descendants: no mount point specified.
umount: /sys/fs/cgroup/cgroup.pressure: no mount point specified.
umount: /sys/fs/cgroup/cgroup.procs: no mount point specified.
umount: /sys/fs/cgroup/cgroup.stat: no mount point specified.
umount: /sys/fs/cgroup/cgroup.subtree_control: no mount point specified.
umount: /sys/fs/cgroup/cgroup.threads: no mount point specified.
umount: /sys/fs/cgroup/cgroup.type: no mount point specified.
umount: /sys/fs/cgroup/cpu.idle: no mount point specified.
umount: /sys/fs/cgroup/cpu.max: no mount point specified.
umount: /sys/fs/cgroup/cpu.max.burst: no mount point specified.
umount: /sys/fs/cgroup/cpu.pressure: no mount point specified.
umount: /sys/fs/cgroup/cpu.stat: no mount point specified.
umount: /sys/fs/cgroup/cpu.stat.local: no mount point specified.
umount: /sys/fs/cgroup/cpu.uclamp.max: no mount point specified.
umount: /sys/fs/cgroup/cpu.uclamp.min: no mount point specified.
umount: /sys/fs/cgroup/cpu.weight: no mount point specified.
umount: /sys/fs/cgroup/cpu.weight.nice: no mount point specified.
umount: /sys/fs/cgroup/cpuset.cpus: no mount point specified.
umount: /sys/fs/cgroup/cpuset.cpus.effective: no mount point specified.
umount: /sys/fs/cgroup/cpuset.cpus.exclusive: no mount point specified.
umount: /sys/fs/cgroup/cpuset.cpus.exclusive.effective: no mount point specified.
umount: /sys/fs/cgroup/cpuset.cpus.partition: no mount point specified.
umount: /sys/fs/cgroup/cpuset.mems: no mount point specified.
umount: /sys/fs/cgroup/cpuset.mems.effective: no mount point specified.
umount: /sys/fs/cgroup/docker: no mount point specified.
umount: /sys/fs/cgroup/hugetlb.1GB.current: no mount point specified.
umount: /sys/fs/cgroup/hugetlb.1GB.events: no mount point specified.
umount: /sys/fs/cgroup/hugetlb.1GB.events.local: no mount point specified.
umount: /sys/fs/cgroup/hugetlb.1GB.max: no mount point specified.
umount: /sys/fs/cgroup/hugetlb.1GB.numa_stat: no mount point specified.
umount: /sys/fs/cgroup/hugetlb.1GB.rsvd.current: no mount point specified.
umount: /sys/fs/cgroup/hugetlb.1GB.rsvd.max: no mount point specified.
umount: /sys/fs/cgroup/hugetlb.2MB.current: no mount point specified.
umount: /sys/fs/cgroup/hugetlb.2MB.events: no mount point specified.
umount: /sys/fs/cgroup/hugetlb.2MB.events.local: no mount point specified.
umount: /sys/fs/cgroup/hugetlb.2MB.max: no mount point specified.
umount: /sys/fs/cgroup/hugetlb.2MB.numa_stat: no mount point specified.
umount: /sys/fs/cgroup/hugetlb.2MB.rsvd.current: no mount point specified.
umount: /sys/fs/cgroup/hugetlb.2MB.rsvd.max: no mount point specified.
umount: /sys/fs/cgroup/io.max: no mount point specified.
umount: /sys/fs/cgroup/io.pressure: no mount point specified.
umount: /sys/fs/cgroup/io.prio.class: no mount point specified.
umount: /sys/fs/cgroup/io.stat: no mount point specified.
umount: /sys/fs/cgroup/io.weight: no mount point specified.
umount: /sys/fs/cgroup/memory.current: no mount point specified.
umount: /sys/fs/cgroup/memory.events: no mount point specified.
umount: /sys/fs/cgroup/memory.events.local: no mount point specified.
umount: /sys/fs/cgroup/memory.high: no mount point specified.
umount: /sys/fs/cgroup/memory.low: no mount point specified.
umount: /sys/fs/cgroup/memory.max: no mount point specified.
umount: /sys/fs/cgroup/memory.min: no mount point specified.
umount: /sys/fs/cgroup/memory.numa_stat: no mount point specified.
umount: /sys/fs/cgroup/memory.oom.group: no mount point specified.
umount: /sys/fs/cgroup/memory.peak: no mount point specified.
umount: /sys/fs/cgroup/memory.pressure: no mount point specified.
umount: /sys/fs/cgroup/memory.reclaim: no mount point specified.
umount: /sys/fs/cgroup/memory.stat: no mount point specified.
umount: /sys/fs/cgroup/memory.swap.current: no mount point specified.
umount: /sys/fs/cgroup/memory.swap.events: no mount point specified.
umount: /sys/fs/cgroup/memory.swap.high: no mount point specified.
umount: /sys/fs/cgroup/memory.swap.max: no mount point specified.
umount: /sys/fs/cgroup/memory.swap.peak: no mount point specified.
umount: /sys/fs/cgroup/memory.zswap.current: no mount point specified.
umount: /sys/fs/cgroup/memory.zswap.max: no mount point specified.
umount: /sys/fs/cgroup/memory.zswap.writeback: no mount point specified.
umount: /sys/fs/cgroup/misc.current: no mount point specified.
umount: /sys/fs/cgroup/misc.events: no mount point specified.
umount: /sys/fs/cgroup/misc.max: no mount point specified.
umount: /sys/fs/cgroup/pids.current: no mount point specified.
umount: /sys/fs/cgroup/pids.events: no mount point specified.
umount: /sys/fs/cgroup/pids.max: no mount point specified.
umount: /sys/fs/cgroup/pids.peak: no mount point specified.
umount: /sys/fs/cgroup/rdma.current: no mount point specified.
umount: /sys/fs/cgroup/rdma.max: no mount point specified.
umount: /sys/fs/cgroup: not mounted.
+ true
+ true
+ sudo LANG=C chroot ./fsroot-broadcom umount /proc
+ true
[  FAIL LOG END  ] [ target/sonic-broadcom.bin ]
make: *** [slave.mk:1435: target/sonic-broadcom.bin] Error 1
make[1]: *** [Makefile.work:611: all] Error 2
make[1]: Leaving directory '/var/lib/jenkins/workspace/ETRI-202505/platform-broadcom'
make: *** [Makefile:57: all] Error 2