Content

상위 폴더로 이동
+++ --- Making all --- +++
./scripts/run_with_retry make BLDENV=bookworm -f Makefile.work all
make[1]: Entering directory '/var/lib/jenkins/workspace/ETRI-202505/platform-vs'
"SECURE_UPGRADE_PROD_SIGNING_TOOL": ""
~/workspace/ETRI-202505/platform-vs/src/sonic-build-hooks ~/workspace/ETRI-202505/platform-vs
make[2]: Entering directory '/var/lib/jenkins/workspace/ETRI-202505/platform-vs/src/sonic-build-hooks'
dpkg-deb: building package 'sonic-build-hooks' in 'buildinfo/sonic-build-hooks_1.0_all.deb'.
make[2]: Leaving directory '/var/lib/jenkins/workspace/ETRI-202505/platform-vs/src/sonic-build-hooks'
~/workspace/ETRI-202505/platform-vs
Checking sonic-slave-base image: sonic-slave-bookworm:2f250bfbb4a
Checking sonic-slave-user image: sonic-slave-bookworm-jenkins:571e10d221b
SONiC Build System

Build Configuration
"CONFIGURED_PLATFORM"             : "vs"
"CONFIGURED_ARCH"                 : "amd64"
"SONIC_CONFIG_PRINT_DEPENDENCIES" : ""
"SONIC_BUILD_JOBS"                : "4"
"SONIC_CONFIG_MAKE_JOBS"          : "112"
"USE_NATIVE_DOCKERD_FOR_BUILD"    : ""
"SONIC_USE_DOCKER_BUILDKIT"       : ""
"USERNAME"                        : "admin"
"PASSWORD"                        : "YourPaSsWoRd"
"CHANGE_DEFAULT_PASSWORD"         : "n"
"SECURE_UPGRADE_MODE"             : "no_sign"
"SECURE_UPGRADE_DEV_SIGNING_KEY"  : ""
"SECURE_UPGRADE_SIGNING_CERT"     : ""
"SECURE_UPGRADE_PROD_SIGNING_TOOL": ""
"SECURE_UPGRADE_PROD_TOOL_ARGS"   : ""
"ONIE_IMAGE_PART_SIZE"            : ""
"SHUTDOWN_BGP_ON_START"           : ""
"ENABLE_PFCWD_ON_START"           : ""
"SONIC_BUFFER_MODEL"              : ""
"INSTALL_DEBUG_TOOLS"             : ""
"ROUTING_STACK"                   : "frr"
"FRR_USER_UID"                    : "300"
"FRR_USER_GID"                    : "300"
"ENABLE_SYNCD_RPC"                : ""
"SAITHRIFT_V2"                    : ""
"ENABLE_ORGANIZATION_EXTENSIONS"  : "y"
"HTTP_PROXY"                      : ""
"HTTPS_PROXY"                     : ""
"NO_PROXY"                        : ""
"ENABLE_ZTP"                      : ""
"INCLUDE_PDE"                     : ""
"SONIC_DEBUGGING_ON"              : ""
"SONIC_PROFILING_ON"              : ""
"KERNEL_PROCURE_METHOD"           : "build"
"BUILD_TIMESTAMP"                 : "20260805.184946"
"BUILD_LOG_TIMESTAMP"             : "none"
"SONIC_IMAGE_VERSION"             : "etri-202505.24-bf29a9955"
"BLDENV"                          : "bookworm"
"VS_PREPARE_MEM"                  : "yes"
"INCLUDE_MGMT_FRAMEWORK"          : "y"
"INCLUDE_ICCPD"                   : "n"
"INCLUDE_STP"                     : "y"
"INCLUDE_SYSTEM_TELEMETRY"        : "n"
"INCLUDE_SYSTEM_GNMI"             : "y"
"INCLUDE_SYSTEM_BMP"              : "y"
"INCLUDE_SYSTEM_EVENTD"           : "y"
"ENABLE_HOST_SERVICE_ON_START"    : "y"
"INCLUDE_RESTAPI"                 : "n"
"INCLUDE_SFLOW"                   : "y"
"INCLUDE_NAT"                     : "y"
"INCLUDE_DHCP_RELAY"              : "y"
"INCLUDE_DHCP_SERVER"             : "n"
"INCLUDE_P4RT"                    : "n"
"INCLUDE_VS_DASH_SAI"             : "y"
"INCLUDE_KUBERNETES"              : "n"
"INCLUDE_KUBERNETES_MASTER"       : "n"
"INCLUDE_MACSEC"                  : "y"
"INCLUDE_MUX"                     : "y"
"INCLUDE_TEAMD"                   : "y"
"INCLUDE_DASH_HA"                 : "y"
"INCLUDE_ROUTER_ADVERTISER"       : "y"
"INCLUDE_BOOTCHART                : "y"
"ENABLE_BOOTCHART                 : "n"
"INCLUDE_FIPS"                    : "y"
"ENABLE_TRANSLIB_WRITE"           : ""
"ENABLE_NATIVE_WRITE"             : "y"
"ENABLE_DIALOUT"                  : ""
"ENABLE_AUTO_TECH_SUPPORT"        : "y"
"PDDF_SUPPORT"                    : "y"
"MULTIARCH_QEMU_ENVIRON"          : "n"
"SONIC_VERSION_CONTROL_COMPONENTS": "py2,py3,web,git,docker"
"ENABLE_ASAN"                     : "n"
"DEFAULT_CONTAINER_REGISTRY"      : "publicmirror.azurecr.io/"
"BUILD_MULTIASIC_KVM"             : "n"
"CROSS_BUILD_ENVIRON"             : "n"
"LEGACY_SONIC_MGMT_DOCKER"        : "y"
"INCLUDE_EXTERNAL_PATCHES"        : "n"
"PTF_ENV_PY_VER"                  : "py3"
"ENABLE_MULTIDB"                  : ""

mv: cannot move '/etc/apt/sources.list.d/debian.sources' to '/etc/apt/sources.list.d/debian.sources.back': Permission denied
fatal: not a git repository (or any of the parent directories): .git
"SONIC_DPKG_CACHE_METHOD"         : "none"

[ building ] [ target/debs/bookworm/libpam-tacplus_1.4.1-1_amd64.deb ] 
[ building ] [ target/debs/bookworm/libtac-dev_1.4.1-1_amd64.deb ] 
[ finished ] [ target/debs/bookworm/libpam-tacplus_1.4.1-1_amd64.deb ] 
[ building ] [ target/debs/bookworm/libtac2_1.4.1-1_amd64.deb-install ] 
[ building ] [ target/debs/bookworm/libnl-3-200_3.7.0-0.2+b1sonic1_amd64.deb-install ] 
[ building ] [ target/debs/bookworm/libyang2-dev_2.1.148-0.2_amd64.deb ] 
[ finished ] [ target/debs/bookworm/libyang2-dev_2.1.148-0.2_amd64.deb ] 
[ building ] [ target/debs/bookworm/libyang2t64_2.1.148-0.2_amd64.deb-install ] 
[ finished ] [ target/debs/bookworm/libtac2_1.4.1-1_amd64.deb-install ] 
[ building ] [ target/debs/bookworm/libnl-genl-3-200_3.7.0-0.2+b1sonic1_amd64.deb ] 
[ finished ] [ target/debs/bookworm/libnl-genl-3-200_3.7.0-0.2+b1sonic1_amd64.deb ] 
[ building ] [ target/debs/bookworm/libnl-nf-3-200_3.7.0-0.2+b1sonic1_amd64.deb ] 
[ finished ] [ target/debs/bookworm/libnl-nf-3-200_3.7.0-0.2+b1sonic1_amd64.deb ] 
[ building ] [ target/python-wheels/bookworm/redis_dump_load-1.1-py3-none-any.whl-install ] 
[ finished ] [ target/python-wheels/bookworm/redis_dump_load-1.1-py3-none-any.whl-install ] 
[ building ] [ target/debs/bookworm/p4lang-pi_0.1.0-15_amd64.deb-install ] 
[ finished ] [ target/debs/bookworm/p4lang-pi_0.1.0-15_amd64.deb-install ] 
[ building ] [ target/debs/bookworm/libdashapi_1.0.0_amd64.deb-install ] 
[ finished ] [ target/debs/bookworm/libdashapi_1.0.0_amd64.deb-install ] 
[ building ] [ target/debs/bookworm/libip4tc2_1.8.9-2_amd64.deb ] 
[ finished ] [ target/debs/bookworm/libip4tc2_1.8.9-2_amd64.deb ] 
[ building ] [ target/debs/bookworm/libip6tc2_1.8.9-2_amd64.deb ] 
[ finished ] [ target/debs/bookworm/libip6tc2_1.8.9-2_amd64.deb ] 
[ building ] [ target/debs/bookworm/libiptc0_1.8.9-2_amd64.deb ] 
[ finished ] [ target/debs/bookworm/libiptc0_1.8.9-2_amd64.deb ] 
[ building ] [ target/debs/bookworm/libxtables12_1.8.9-2_amd64.deb ] 
[ finished ] [ target/debs/bookworm/libxtables12_1.8.9-2_amd64.deb ] 
[ building ] [ target/debs/bookworm/libsensors5_3.6.0-7.1_amd64.deb ] 
[ finished ] [ target/debs/bookworm/libsensors5_3.6.0-7.1_amd64.deb ] 
[ building ] [ target/debs/bookworm/fancontrol_3.6.0-7.1_all.deb ] 
[ finished ] [ target/debs/bookworm/fancontrol_3.6.0-7.1_all.deb ] 
[ building ] [ target/debs/bookworm/sensord_3.6.0-7.1_amd64.deb ] 
[ finished ] [ target/debs/bookworm/sensord_3.6.0-7.1_amd64.deb ] 
[ building ] [ target/debs/bookworm/linuxptp_4.2-sonic-0_amd64.deb ] 
[ finished ] [ target/debs/bookworm/libtac-dev_1.4.1-1_amd64.deb ] 
[ building ] [ target/debs/bookworm/hsflowd_2.0.51-26_amd64.deb ] 
[ finished ] [ target/debs/bookworm/libnl-3-200_3.7.0-0.2+b1sonic1_amd64.deb-install ] 
[ building ] [ target/debs/bookworm/sflowtool_5.04_amd64.deb ] 
[ finished ] [ target/debs/bookworm/libyang2t64_2.1.148-0.2_amd64.deb-install ] 
[ building ] [ target/debs/bookworm/psample_1.1-1_amd64.deb ] 
[ finished ] [ target/debs/bookworm/linuxptp_4.2-sonic-0_amd64.deb ] 
[ building ] [ target/debs/bookworm/libnl-3-dev_3.7.0-0.2+b1sonic1_amd64.deb-install ] 
[ finished ] [ target/debs/bookworm/libnl-3-dev_3.7.0-0.2+b1sonic1_amd64.deb-install ] 
[ building ] [ target/debs/bookworm/libnl-genl-3-200_3.7.0-0.2+b1sonic1_amd64.deb-install ] 
[ finished ] [ target/debs/bookworm/libnl-genl-3-200_3.7.0-0.2+b1sonic1_amd64.deb-install ] 
[ building ] [ target/debs/bookworm/libnl-route-3-200_3.7.0-0.2+b1sonic1_amd64.deb-install ] 
[ finished ] [ target/debs/bookworm/sflowtool_5.04_amd64.deb ] 
[ building ] [ target/debs/bookworm/isc-dhcp-relay_4.4.3-P1-2_amd64.deb ] 
[ finished ] [ target/debs/bookworm/libnl-route-3-200_3.7.0-0.2+b1sonic1_amd64.deb-install ] 
[ building ] [ target/debs/bookworm/rasdaemon_0.6.8-1_amd64.deb ] 
[ finished ] [ target/debs/bookworm/psample_1.1-1_amd64.deb ] 
[ building ] [ target/debs/bookworm/libnl-route-3-dev_3.7.0-0.2+b1sonic1_amd64.deb-install ] 
[ finished ] [ target/debs/bookworm/libnl-route-3-dev_3.7.0-0.2+b1sonic1_amd64.deb-install ] 
[ building ] [ target/files/bookworm/remote_ctr.config.json ] 
[ finished ] [ target/files/bookworm/remote_ctr.config.json ] 
[ building ] [ target/files/bookworm/ctrmgrd.service ] 
[ finished ] [ target/files/bookworm/ctrmgrd.service ] 
[ building ] [ target/debs/bookworm/libnl-nf-3-200_3.7.0-0.2+b1sonic1_amd64.deb-install ] 
[ finished ] [ target/debs/bookworm/libnl-nf-3-200_3.7.0-0.2+b1sonic1_amd64.deb-install ] 
[ building ] [ target/sonic-vs.bin__vs__rfs.squashfs ] 
[ finished ] [ target/debs/bookworm/hsflowd_2.0.51-26_amd64.deb ] 
[ building ] [ target/files/bookworm/onie-recovery-x86_64-kvm_x86_64-r0.iso ] 
[ finished ] [ target/files/bookworm/onie-recovery-x86_64-kvm_x86_64-r0.iso ] 
[ building ] [ target/files/bookworm/onie-recovery-x86_64-kvm_x86_64_4_asic-r0.iso ] 
[ finished ] [ target/debs/bookworm/rasdaemon_0.6.8-1_amd64.deb ] 
[ building ] [ target/files/bookworm/onie-recovery-x86_64-kvm_x86_64_6_asic-r0.iso ] 
[ finished ] [ target/files/bookworm/onie-recovery-x86_64-kvm_x86_64_4_asic-r0.iso ] 
[ building ] [ target/sonic-vs.img.gz__vs__rfs.squashfs ] 
[ finished ] [ target/files/bookworm/onie-recovery-x86_64-kvm_x86_64_6_asic-r0.iso ] 
[ building ] [ target/files/bookworm/configdb-load.sh ] 
[ finished ] [ target/files/bookworm/configdb-load.sh ] 
[ building ] [ target/files/bookworm/buffers_config.j2 ] 
[ finished ] [ target/files/bookworm/buffers_config.j2 ] 
[ building ] [ target/files/bookworm/qos_config.j2 ] 
[ finished ] [ target/files/bookworm/qos_config.j2 ] 
[ building ] [ target/files/bookworm/sonic_version.yml ] 
[ finished ] [ target/files/bookworm/sonic_version.yml ] 
[ building ] [ target/files/bookworm/copp_cfg.j2 ] 
[ finished ] [ target/files/bookworm/copp_cfg.j2 ] 
[ building ] [ target/debs/bookworm/libtac-dev_1.4.1-1_amd64.deb-install ] 
[ finished ] [ target/debs/bookworm/libtac-dev_1.4.1-1_amd64.deb-install ] 
[ building ] [ target/debs/bookworm/openssh-server_9.2p1-2+deb12u5_amd64.deb ] 
[ finished ] [ target/debs/bookworm/isc-dhcp-relay_4.4.3-P1-2_amd64.deb ] 
[ building ] [ target/debs/bookworm/libsnmp-base_5.9.3+dfsg-2+deb12u1_all.deb ] 
[ finished ] [ target/debs/bookworm/openssh-server_9.2p1-2+deb12u5_amd64.deb ] 
[ building ] [ target/debs/bookworm/libyang2-dev_2.1.148-0.2_amd64.deb-install ] 
[ finished ] [ target/debs/bookworm/libyang2-dev_2.1.148-0.2_amd64.deb-install ] 
[ building ] [ target/debs/bookworm/libnl-genl-3-dev_3.7.0-0.2+b1sonic1_amd64.deb ] 
[ finished ] [ target/debs/bookworm/libnl-genl-3-dev_3.7.0-0.2+b1sonic1_amd64.deb ] 
[ building ] [ target/debs/bookworm/libnl-nf-3-dev_3.7.0-0.2+b1sonic1_amd64.deb ] 
[ finished ] [ target/debs/bookworm/libnl-nf-3-dev_3.7.0-0.2+b1sonic1_amd64.deb ] 
[ building ] [ target/debs/bookworm/libnl-genl-3-dev_3.7.0-0.2+b1sonic1_amd64.deb-install ] 
[ finished ] [ target/debs/bookworm/libnl-genl-3-dev_3.7.0-0.2+b1sonic1_amd64.deb-install ] 
[ building ] [ target/debs/bookworm/libnl-nf-3-dev_3.7.0-0.2+b1sonic1_amd64.deb-install ] 
[ finished ] [ target/debs/bookworm/libnl-nf-3-dev_3.7.0-0.2+b1sonic1_amd64.deb-install ] 
[ building ] [ target/debs/bookworm/bash-tacplus_1.0.0_amd64.deb ] 
[ finished ] [ target/debs/bookworm/bash-tacplus_1.0.0_amd64.deb ] 
[ building ] [ target/debs/bookworm/audisp-tacplus_1.0.2_amd64.deb ] 
[ finished ] [ target/debs/bookworm/audisp-tacplus_1.0.2_amd64.deb ] 
[ building ] [ target/python-wheels/bookworm/swsssdk-2.0.1-py3-none-any.whl ] 
[ finished ] [ target/python-wheels/bookworm/swsssdk-2.0.1-py3-none-any.whl ] 
[ building ] [ target/docker-base-bookworm.gz ] 
[ finished ] [ target/debs/bookworm/libsnmp-base_5.9.3+dfsg-2+deb12u1_all.deb ] 
[ building ] [ target/python-wheels/bookworm/swsssdk-2.0.1-py3-none-any.whl-install ] 
[ finished ] [ target/python-wheels/bookworm/swsssdk-2.0.1-py3-none-any.whl-install ] 
[ building ] [ target/debs/bookworm/p4lang-bmv2_1.15.0-7_amd64.deb ] 
[ finished ] [ target/docker-base-bookworm.gz ] 
[ FAIL LOG START ] [ target/docker-base-bookworm.gz ]
Build start time: Wed Aug 5 09:58:40 UTC 2026
[ REASON ] :      target/docker-base-bookworm.gz does not exist   NON-EXISTENT PREREQUISITES: docker-start 
[ FLAGS  FILE    ] : [] 
[ FLAGS  DEPENDS ] : [] 
[ FLAGS  DIFF    ] : [] 
Unable to find image 'publicmirror.azurecr.io/amd64/debian:bookworm' locally
docker: Error response from daemon: Get "https://publicmirror.azurecr.io/v2/amd64/debian/manifests/sha256:e2909891cce4f897689db914b6c5e287e5778f18254ddf7e2bf1e4974577d35d": dial tcp: lookup publicmirror.azurecr.io on 168.126.63.1:53: server misbehaving.
See 'docker run --help'.
Unable to find image 'publicmirror.azurecr.io/amd64/debian:bookworm' locally
docker: Error response from daemon: Head "https://publicmirror.azurecr.io/v2/amd64/debian/manifests/bookworm": Get "https://publicmirror.azurecr.io/oauth2/token?scope=repository%3Aamd64%2Fdebian%3Apull&service=publicmirror.azurecr.io": dial tcp: lookup publicmirror.azurecr.io on 168.126.63.1:53: server misbehaving.
See 'docker run --help'.
Client: Docker Engine - Community
 Version:    24.0.2
 Context:    default
 Debug Mode: false
 Plugins:
  buildx: Docker Buildx (Docker Inc.)
    Version:  v0.10.5
    Path:     /usr/libexec/docker/cli-plugins/docker-buildx
  compose: Docker Compose (Docker Inc.)
    Version:  v2.18.1
    Path:     /usr/libexec/docker/cli-plugins/docker-compose

Server:
 Containers: 0
  Running: 0
  Paused: 0
  Stopped: 0
 Images: 0
 Server Version: 24.0.2
 Storage Driver: overlay2
  Backing Filesystem: extfs
  Supports d_type: true
  Using metacopy: false
  Native Overlay Diff: true
  userxattr: false
 Logging Driver: json-file
 Cgroup Driver: cgroupfs
 Cgroup Version: 2
 Plugins:
  Volume: local
  Network: bridge host ipvlan macvlan null overlay
  Log: awslogs fluentd gcplogs gelf journald json-file local logentries splunk syslog
 Swarm: inactive
 Runtimes: io.containerd.runc.v2 runc
 Default Runtime: runc
 Init Binary: docker-init
 containerd version: 3dce8eb055cbb6872793272b4f20ed16117344f8
 runc version: v1.1.7-0-g860f061
 init version: de40ad0
 Security Options:
  seccomp
   Profile: builtin
  cgroupns
 Kernel Version: 6.8.0-107-generic
 Operating System: Debian GNU/Linux 12 (bookworm)
 OSType: linux
 Architecture: x86_64
 CPUs: 112
 Total Memory: 503.3GiB
 Name: f02c10a99214
 ID: 2cf3d4bc-1c47-4479-b1cf-6f4e997d0782
 Docker Root Dir: /var/lib/docker
 Debug Mode: false
 Experimental: true
 Insecure Registries:
  127.0.0.0/8
 Live Restore Enabled: false

WARNING: bridge-nf-call-iptables is disabled
WARNING: bridge-nf-call-ip6tables is disabled
DEPRECATED: The legacy builder is deprecated and will be removed in a future release.
            BuildKit is currently disabled; enable it by removing the DOCKER_BUILDKIT=0
            environment-variable.

Sending build context to Docker daemon  409.8MB

Step 1/38 : FROM publicmirror.azurecr.io/amd64/debian:bookworm@sha256:f8358091727a86df2275a4dc8b91e69a71225ae563837c32357b584c7b3607fc
publicmirror.azurecr.io/amd64/debian:bookworm@sha256:f8358091727a86df2275a4dc8b91e69a71225ae563837c32357b584c7b3607fc: Pulling from amd64/debian
c19952135643: Pulling fs layer
c19952135643: Verifying Checksum
c19952135643: Download complete
c19952135643: Pull complete
Digest: sha256:f8358091727a86df2275a4dc8b91e69a71225ae563837c32357b584c7b3607fc
Status: Downloaded newer image for publicmirror.azurecr.io/amd64/debian:bookworm@sha256:f8358091727a86df2275a4dc8b91e69a71225ae563837c32357b584c7b3607fc
 ---> b3a422523a11
Step 2/38 : ARG SONIC_VERSION_CACHE
 ---> Running in 52e6059a1c27
Removing intermediate container 52e6059a1c27
 ---> b3049be7b650
Step 3/38 : ARG SONIC_VERSION_CONTROL_COMPONENTS
 ---> Running in ccbe7fefc9f1
Removing intermediate container ccbe7fefc9f1
 ---> 7eb64b2fab7c
Step 4/38 : COPY ["buildinfo", "/usr/local/share/buildinfo"]
 ---> 37bd0dbe6adf
Step 5/38 : COPY vcache/ /sonic/target/vcache/docker-base-bookworm
 ---> 458f1dc21e2c
Step 6/38 : RUN dpkg -i /usr/local/share/buildinfo/sonic-build-hooks_1.0_all.deb
 ---> Running in 68db486fbebd
Selecting previously unselected package sonic-build-hooks.
(Reading database ... 6089 files and directories currently installed.)
Preparing to unpack .../sonic-build-hooks_1.0_all.deb ...
Unpacking sonic-build-hooks (1.0) ...
Setting up sonic-build-hooks (1.0) ...
Removing intermediate container 68db486fbebd
 ---> 190b0668daaa
Step 7/38 : ENV IMAGENAME=docker-base-bookworm
 ---> Running in 9133281de9f8
Removing intermediate container 9133281de9f8
 ---> 77d7aedcd406
Step 8/38 : ENV DISTRO=jessie
 ---> Running in 3b32ae32152d
Removing intermediate container 3b32ae32152d
 ---> 98e41a979733
Step 9/38 : RUN pre_run_buildinfo docker-base-bookworm
 ---> Running in ebc1d1570091
grep: /etc/apt/sources.list: No such file or directory
Removing intermediate container ebc1d1570091
 ---> 9169bf8e9746
Step 10/38 : RUN find /usr/share/doc -depth \( -type f -o -type l \) ! -name copyright | xargs rm || true
 ---> Running in d1686edce2e7
Removing intermediate container d1686edce2e7
 ---> 53e7f4f35fb3
Step 11/38 : RUN while [ -n "$(find /usr/share/doc -depth -type d -empty -print -exec rmdir {} +)" ]; do :; done &&     rm -rf                   /usr/share/man/*         /usr/share/groff/*       /usr/share/info/*        /usr/share/lintian/*     /usr/share/linda/*       /var/cache/man/*         /usr/share/locale/*
 ---> Running in 1fc2420eeea2
Removing intermediate container 1fc2420eeea2
 ---> 6afd46b6b214
Step 12/38 : ENV DEBIAN_FRONTEND=noninteractive
 ---> Running in 27baa5020327
Removing intermediate container 27baa5020327
 ---> 6aa39c2aed9e
Step 13/38 : COPY ["dpkg_01_drop", "/etc/dpkg/dpkg.cfg.d/01_drop"]
 ---> ab516d7466b3
Step 14/38 : COPY ["sources.list.amd64", "/etc/apt/sources.list"]
 ---> 10bbbfc6bfba
Step 15/38 : COPY ["no_install_recommend_suggest", "/etc/apt/apt.conf.d"]
 ---> 4a69d538b8ca
Step 16/38 : COPY ["no-check-valid-until", "/etc/apt/apt.conf.d"]
 ---> 2d4094a4c7c0
Step 17/38 : RUN apt update &&                apt -y install                   curl                         less                         perl                         procps                       python3                      python3-distutils            python3-pip                  python3-setuptools           python3-wheel                python-is-python3            vim-tiny                     rsyslog                      redis-tools                  libdaemon0                   libdbus-1-3                  libjansson4                  iproute2                     net-tools                    jq                           libzmq5                      libwrap0                    libatomic1
 ---> Running in 7482efcb0a78

WARNING: apt does not have a stable CLI interface. Use with caution in scripts.

Ign:1 http://debian-archive.trafficmanager.net/debian jessie InRelease
Ign:2 http://debian-archive.trafficmanager.net/debian jessie-updates InRelease
Ign:3 http://debian-archive.trafficmanager.net/debian jessie-backports InRelease
Ign:4 http://debian-archive.trafficmanager.net/debian-security jessie-security InRelease
Err:5 http://debian-archive.trafficmanager.net/debian jessie Release
  404  Not Found [IP: 57.155.122.117 80]
Err:6 http://debian-archive.trafficmanager.net/debian jessie-updates Release
  404  Not Found [IP: 57.155.122.117 80]
Err:7 http://debian-archive.trafficmanager.net/debian jessie-backports Release
  404  Not Found [IP: 57.155.122.117 80]
Err:8 http://debian-archive.trafficmanager.net/debian-security jessie-security Release
  404  Not Found [IP: 57.155.122.117 80]
Reading package lists...
E: The repository 'http://debian-archive.trafficmanager.net/debian jessie Release' does not have a Release file.
E: The repository 'http://debian-archive.trafficmanager.net/debian jessie-updates Release' does not have a Release file.
E: The repository 'http://debian-archive.trafficmanager.net/debian jessie-backports Release' does not have a Release file.
E: The repository 'http://debian-archive.trafficmanager.net/debian-security jessie-security Release' does not have a Release file.
The command '/bin/sh -c apt update &&                apt -y install                   curl                         less                         perl                         procps                       python3                      python3-distutils            python3-pip                  python3-setuptools           python3-wheel                python-is-python3            vim-tiny                     rsyslog                      redis-tools                  libdaemon0                   libdbus-1-3                  libjansson4                  iproute2                     net-tools                    jq                           libzmq5                      libwrap0                    libatomic1' returned a non-zero code: 100
[  FAIL LOG END  ] [ target/docker-base-bookworm.gz ]
make: *** [slave.mk:1153: target/docker-base-bookworm.gz] Error 1
make: *** Waiting for unfinished jobs....
[ finished ] [ target/sonic-vs.img.gz__vs__rfs.squashfs ] 
[ FAIL LOG START ] [ target/sonic-vs.img.gz__vs__rfs.squashfs ]
Build start time: Wed Aug 5 09:51:03 UTC 2026
++ '[' -f .arch ']'
++ cat .arch
+ CONFIGURED_ARCH=amd64
+ DOCKER_VERSION=5:24.0.2-1~debian.12~bookworm
+ CONTAINERD_IO_VERSION=1.6.21-1
+ LINUX_KERNEL_VERSION=6.1.0-29-2
+ FILESYSTEM_ROOT=./fsroot
+ PLATFORM_DIR=platform
+ HOSTNAME=sonic
+ DEFAULT_USERINFO='Default admin user,,,'
+ BUILD_TOOL_PATH=src/sonic-build-hooks/buildinfo
+ TRUSTED_GPG_DIR=src/sonic-build-hooks/buildinfo/trusted.gpg.d
+ . ./onie-image.conf
++ : 32768
++ : x86_64
++ : vs
++ ONIEIMAGE_VERSION=r0
++ FILESYSTEM_ROOT=./fsroot-vs
++ FILESYSTEM_SQUASHFS=fs.squashfs
++ INSTALLER_PAYLOAD=fs.zip
++ FILESYSTEM_DOCKERFS=dockerfs.tar.gz
++ DOCKERFS_DIR=docker
++ DOCKER_RAMFS_SIZE=3500M
++ OUTPUT_ONIE_IMAGE=target/sonic-vs.bin
++ OUTPUT_RAW_IMAGE=target/sonic-vs.raw
++ RAW_IMAGE_DISK_SIZE=1700
++ OUTPUT_KVM_IMAGE=target/sonic-vs.img
++ KVM_IMAGE_DISK_SIZE=16
++ OUTPUT_ABOOT_IMAGE=target/sonic-aboot-vs.swi
++ ABOOT_BOOT_IMAGE=.sonic-boot.swi
++ OUTPUT_KVM_4ASIC_IMAGE=target/sonic-4asic-vs.img
++ OUTPUT_KVM_6ASIC_IMAGE=target/sonic-6asic-vs.img
++ OUTPUT_DSC_IMAGE=target/sonic-vs.tar
+ '[' -n 32768 ']'
+ '[' -n fs.zip ']'
+ '[' -n fs.squashfs ']'
+ '[' kvm = aboot ']'
+ [[ n != y ]]
+ [[ -d ./fsroot-vs ]]
+ sudo rm -rf ./fsroot-vs
+ mkdir -p ./fsroot-vs
+ mkdir -p ./fsroot-vs/platform
+ touch ./fsroot-vs/platform/firsttime
+ bootloader_packages=
+ '[' grub '!=' aboot ']'
+ mkdir -p ./fsroot-vs/platform/grub
+ bootloader_packages=grub2-common
+ sudo mount proc /proc -t proc
+ echo '[INFO] Build host debian base system...'
[INFO] Build host debian base system...
+ TARGET_PATH=target
+ scripts/build_debian_base_system.sh amd64 bookworm ./fsroot-vs
I: Target architecture can be executed
I: Retrieving InRelease 
I: Checking Release signature
I: Valid Release signature (key id 4D64FEC119C2029067D6E791F8D2585B8783D481)
I: Retrieving Packages 
I: Validating Packages 
I: Resolving dependencies of required packages...
I: Resolving dependencies of base packages...
I: Checking component main on http://deb.debian.org/debian...
I: Retrieving adduser 3.134
I: Validating adduser 3.134
I: Retrieving apt 2.6.1
I: Validating apt 2.6.1
I: Retrieving base-files 12.4+deb12u15
I: Validating base-files 12.4+deb12u15
I: Retrieving base-passwd 3.6.1
W: Couldn't download package base-passwd (ver 3.6.1 arch amd64) at http://deb.debian.org/debian/pool/main/b/base-passwd/base-passwd_3.6.1_amd64.deb
I: Retrieving bash 5.2.15-2+b13
I: Validating bash 5.2.15-2+b13
I: Validating bsdutils 1:2.38.1-5+deb12u3
I: Validating coreutils 9.1-1
I: Validating dash 0.5.12-2
I: Validating debconf 1.5.82
I: Validating debian-archive-keyring 2023.3+deb12u2
I: Retrieving debianutils 5.7-0.5~deb12u1
I: Validating debianutils 5.7-0.5~deb12u1
I: Validating diffutils 1:3.8-4
I: Validating dpkg 1.21.23
I: Validating e2fsprogs 1.47.0-2+b2
I: Validating findutils 4.9.0-4
I: Validating gcc-12-base 12.2.0-14+deb12u1
I: Validating gpgv 2.2.40-1.1+deb12u2
I: Validating grep 3.8-5
I: Validating gzip 1.12-1
I: Validating hostname 3.23+nmu1
I: Validating init-system-helpers 1.65.2+deb12u1
I: Validating libacl1 2.3.1-3
I: Validating libapt-pkg6.0 2.6.1
I: Retrieving libattr1 1:2.5.1-4
I: Validating libattr1 1:2.5.1-4
W: Retrying failed download of http://deb.debian.org/debian/pool/main/a/attr/libattr1_2.5.1-4_amd64.deb
I: Retrieving libattr1 1:2.5.1-4
I: Validating libattr1 1:2.5.1-4
I: Retrieving libaudit-common 1:3.0.9-1
W: Couldn't download package libaudit-common (ver 1:3.0.9-1 arch all) at http://deb.debian.org/debian/pool/main/a/audit/libaudit-common_3.0.9-1_all.deb
I: Validating libaudit1 1:3.0.9-1
I: Validating libblkid1 2.38.1-5+deb12u3
I: Validating libbz2-1.0 1.0.8-5+b1
I: Validating libc-bin 2.36-9+deb12u14
I: Validating libc6 2.36-9+deb12u14
I: Validating libcap-ng0 0.8.3-1+b3
I: Validating libcap2 1:2.66-4+deb12u3+b1
I: Validating libcom-err2 1.47.0-2+b2
I: Validating libcrypt1 1:4.4.33-2
I: Validating libdb5.3 5.3.28+dfsg2-1
I: Validating libdebconfclient0 0.270
I: Validating libext2fs2 1.47.0-2+b2
I: Validating libffi8 3.4.4-1
I: Validating libgcc-s1 12.2.0-14+deb12u1
I: Validating libgcrypt20 1.10.1-3+deb12u1
I: Validating libgmp10 2:6.2.1+dfsg1-1.1
I: Validating libgnutls30 3.7.9-2+deb12u7
I: Validating libgpg-error0 1.46-1
I: Validating libhogweed6 3.8.1-2
I: Validating libidn2-0 2.3.3-1+b1
I: Validating liblz4-1 1.9.4-1
I: Validating liblzma5 5.4.1-1+deb12u1
I: Validating libmd0 1.0.4-2
I: Validating libmount1 2.38.1-5+deb12u3
I: Validating libnettle8 3.8.1-2
I: Validating libp11-kit0 0.24.1-2
I: Validating libpam-modules 1.5.2-6+deb12u2
I: Validating libpam-modules-bin 1.5.2-6+deb12u2
I: Validating libpam-runtime 1.5.2-6+deb12u2
I: Validating libpam0g 1.5.2-6+deb12u2
I: Validating libpcre2-8-0 10.42-1
I: Validating libseccomp2 2.5.4-1+deb12u1
I: Retrieving libselinux1 3.4-1+b6
I: Validating libselinux1 3.4-1+b6
W: Retrying failed download of http://deb.debian.org/debian/pool/main/libs/libselinux/libselinux1_3.4-1+b6_amd64.deb
I: Retrieving libselinux1 3.4-1+b6
I: Validating libselinux1 3.4-1+b6
I: Retrieving libsemanage-common 3.4-1
I: Validating libsemanage-common 3.4-1
I: Retrieving libsemanage2 3.4-1+b5
I: Validating libsemanage2 3.4-1+b5
I: Retrieving libsepol2 3.4-2.1
I: Validating libsepol2 3.4-2.1
I: Retrieving libsmartcols1 2.38.1-5+deb12u3
I: Validating libsmartcols1 2.38.1-5+deb12u3
I: Retrieving libss2 1.47.0-2+b2
I: Validating libss2 1.47.0-2+b2
I: Retrieving libstdc++6 12.2.0-14+deb12u1
I: Validating libstdc++6 12.2.0-14+deb12u1
I: Retrieving libsystemd0 252.39-1~deb12u2
I: Validating libsystemd0 252.39-1~deb12u2
I: Retrieving libtasn1-6 4.19.0-2+deb12u1
I: Validating libtasn1-6 4.19.0-2+deb12u1
I: Retrieving libtinfo6 6.4-4
I: Validating libtinfo6 6.4-4
I: Retrieving libudev1 252.39-1~deb12u2
I: Validating libudev1 252.39-1~deb12u2
I: Retrieving libunistring2 1.0-2
I: Validating libunistring2 1.0-2
I: Retrieving libuuid1 2.38.1-5+deb12u3
I: Validating libuuid1 2.38.1-5+deb12u3
I: Retrieving libxxhash0 0.8.1-1
I: Validating libxxhash0 0.8.1-1
I: Retrieving libzstd1 1.5.4+dfsg2-5
I: Validating libzstd1 1.5.4+dfsg2-5
I: Retrieving login 1:4.13+dfsg1-1+deb12u2
I: Validating login 1:4.13+dfsg1-1+deb12u2
I: Retrieving logsave 1.47.0-2+b2
I: Validating logsave 1.47.0-2+b2
I: Retrieving mawk 1.3.4.20200120-3.1
I: Validating mawk 1.3.4.20200120-3.1
I: Retrieving mount 2.38.1-5+deb12u3
I: Validating mount 2.38.1-5+deb12u3
I: Retrieving ncurses-base 6.4-4
I: Validating ncurses-base 6.4-4
I: Retrieving ncurses-bin 6.4-4
I: Validating ncurses-bin 6.4-4
I: Retrieving passwd 1:4.13+dfsg1-1+deb12u2
I: Validating passwd 1:4.13+dfsg1-1+deb12u2
I: Retrieving perl-base 5.36.0-7+deb12u3
I: Validating perl-base 5.36.0-7+deb12u3
I: Retrieving sed 4.9-1+deb12u1
W: Couldn't download package sed (ver 4.9-1+deb12u1 arch amd64) at http://deb.debian.org/debian/pool/main/s/sed/sed_4.9-1+deb12u1_amd64.deb
I: Validating sysvinit-utils 3.06-4
I: Validating tar 1.34+dfsg-1.2+deb12u1
I: Retrieving tzdata 2026b-0+deb12u1
I: Validating tzdata 2026b-0+deb12u1
W: Retrying failed download of http://deb.debian.org/debian/pool/main/t/tzdata/tzdata_2026b-0+deb12u1_all.deb
I: Retrieving tzdata 2026b-0+deb12u1
I: Validating tzdata 2026b-0+deb12u1
I: Retrieving usr-is-merged 37~deb12u1
I: Validating usr-is-merged 37~deb12u1
I: Retrieving util-linux 2.38.1-5+deb12u3
I: Validating util-linux 2.38.1-5+deb12u3
I: Retrieving util-linux-extra 2.38.1-5+deb12u3
I: Validating util-linux-extra 2.38.1-5+deb12u3
I: Retrieving zlib1g 1:1.2.13.dfsg-1
I: Validating zlib1g 1:1.2.13.dfsg-1
E: Couldn't download packages: base-passwd libaudit-common sed
[  FAIL LOG END  ] [ target/sonic-vs.img.gz__vs__rfs.squashfs ]
make: *** [slave.mk:1332: target/sonic-vs.img.gz__vs__rfs.squashfs] Error 1
[ finished ] [ target/sonic-vs.bin__vs__rfs.squashfs ] 
[ FAIL LOG START ] [ target/sonic-vs.bin__vs__rfs.squashfs ]
Build start time: Wed Aug 5 09:50:40 UTC 2026
++ '[' -f .arch ']'
++ cat .arch
+ CONFIGURED_ARCH=amd64
+ DOCKER_VERSION=5:24.0.2-1~debian.12~bookworm
+ CONTAINERD_IO_VERSION=1.6.21-1
+ LINUX_KERNEL_VERSION=6.1.0-29-2
+ FILESYSTEM_ROOT=./fsroot
+ PLATFORM_DIR=platform
+ HOSTNAME=sonic
+ DEFAULT_USERINFO='Default admin user,,,'
+ BUILD_TOOL_PATH=src/sonic-build-hooks/buildinfo
+ TRUSTED_GPG_DIR=src/sonic-build-hooks/buildinfo/trusted.gpg.d
+ . ./onie-image.conf
++ : 32768
++ : x86_64
++ : vs
++ ONIEIMAGE_VERSION=r0
++ FILESYSTEM_ROOT=./fsroot-vs
++ FILESYSTEM_SQUASHFS=fs.squashfs
++ INSTALLER_PAYLOAD=fs.zip
++ FILESYSTEM_DOCKERFS=dockerfs.tar.gz
++ DOCKERFS_DIR=docker
++ DOCKER_RAMFS_SIZE=3500M
++ OUTPUT_ONIE_IMAGE=target/sonic-vs.bin
++ OUTPUT_RAW_IMAGE=target/sonic-vs.raw
++ RAW_IMAGE_DISK_SIZE=1700
++ OUTPUT_KVM_IMAGE=target/sonic-vs.img
++ KVM_IMAGE_DISK_SIZE=16
++ OUTPUT_ABOOT_IMAGE=target/sonic-aboot-vs.swi
++ ABOOT_BOOT_IMAGE=.sonic-boot.swi
++ OUTPUT_KVM_4ASIC_IMAGE=target/sonic-4asic-vs.img
++ OUTPUT_KVM_6ASIC_IMAGE=target/sonic-6asic-vs.img
++ OUTPUT_DSC_IMAGE=target/sonic-vs.tar
+ '[' -n 32768 ']'
+ '[' -n fs.zip ']'
+ '[' -n fs.squashfs ']'
+ '[' onie = aboot ']'
+ [[ n != y ]]
+ [[ -d ./fsroot-vs ]]
+ mkdir -p ./fsroot-vs
+ mkdir -p ./fsroot-vs/platform
+ touch ./fsroot-vs/platform/firsttime
+ bootloader_packages=
+ '[' grub '!=' aboot ']'
+ mkdir -p ./fsroot-vs/platform/grub
+ bootloader_packages=grub2-common
+ sudo mount proc /proc -t proc
+ echo '[INFO] Build host debian base system...'
[INFO] Build host debian base system...
+ TARGET_PATH=target
+ scripts/build_debian_base_system.sh amd64 bookworm ./fsroot-vs
I: Target architecture can be executed
I: Retrieving InRelease 
I: Checking Release signature
I: Valid Release signature (key id 4D64FEC119C2029067D6E791F8D2585B8783D481)
I: Retrieving Packages 
I: Validating Packages 
I: Resolving dependencies of required packages...
I: Resolving dependencies of base packages...
I: Checking component main on http://deb.debian.org/debian...
I: Retrieving adduser 3.134
I: Validating adduser 3.134
I: Retrieving apt 2.6.1
I: Validating apt 2.6.1
I: Retrieving base-files 12.4+deb12u15
I: Validating base-files 12.4+deb12u15
I: Retrieving base-passwd 3.6.1
I: Validating base-passwd 3.6.1
I: Retrieving bash 5.2.15-2+b13
W: Couldn't download package bash (ver 5.2.15-2+b13 arch amd64) at http://deb.debian.org/debian/pool/main/b/bash/bash_5.2.15-2+b13_amd64.deb
I: Retrieving bsdutils 1:2.38.1-5+deb12u3
I: Validating bsdutils 1:2.38.1-5+deb12u3
I: Retrieving coreutils 9.1-1
I: Validating coreutils 9.1-1
I: Retrieving dash 0.5.12-2
I: Validating dash 0.5.12-2
I: Retrieving debconf 1.5.82
I: Validating debconf 1.5.82
I: Retrieving debian-archive-keyring 2023.3+deb12u2
I: Validating debian-archive-keyring 2023.3+deb12u2
I: Retrieving debianutils 5.7-0.5~deb12u1
W: Couldn't download package debianutils (ver 5.7-0.5~deb12u1 arch amd64) at http://deb.debian.org/debian/pool/main/d/debianutils/debianutils_5.7-0.5~deb12u1_amd64.deb
I: Retrieving diffutils 1:3.8-4
I: Validating diffutils 1:3.8-4
I: Retrieving dpkg 1.21.23
I: Validating dpkg 1.21.23
I: Retrieving e2fsprogs 1.47.0-2+b2
I: Validating e2fsprogs 1.47.0-2+b2
I: Retrieving findutils 4.9.0-4
I: Validating findutils 4.9.0-4
I: Retrieving gcc-12-base 12.2.0-14+deb12u1
I: Validating gcc-12-base 12.2.0-14+deb12u1
I: Retrieving gpgv 2.2.40-1.1+deb12u2
I: Validating gpgv 2.2.40-1.1+deb12u2
I: Retrieving grep 3.8-5
I: Validating grep 3.8-5
I: Retrieving gzip 1.12-1
I: Validating gzip 1.12-1
I: Retrieving hostname 3.23+nmu1
I: Validating hostname 3.23+nmu1
I: Retrieving init-system-helpers 1.65.2+deb12u1
I: Validating init-system-helpers 1.65.2+deb12u1
I: Retrieving libacl1 2.3.1-3
I: Validating libacl1 2.3.1-3
I: Retrieving libapt-pkg6.0 2.6.1
I: Validating libapt-pkg6.0 2.6.1
I: Retrieving libattr1 1:2.5.1-4
I: Validating libattr1 1:2.5.1-4
W: Retrying failed download of http://deb.debian.org/debian/pool/main/a/attr/libattr1_2.5.1-4_amd64.deb
I: Retrieving libattr1 1:2.5.1-4
I: Validating libattr1 1:2.5.1-4
I: Retrieving libaudit-common 1:3.0.9-1
I: Validating libaudit-common 1:3.0.9-1
W: Retrying failed download of http://deb.debian.org/debian/pool/main/a/audit/libaudit-common_3.0.9-1_all.deb
I: Retrieving libaudit-common 1:3.0.9-1
I: Validating libaudit-common 1:3.0.9-1
I: Retrieving libaudit1 1:3.0.9-1
I: Validating libaudit1 1:3.0.9-1
I: Retrieving libblkid1 2.38.1-5+deb12u3
I: Validating libblkid1 2.38.1-5+deb12u3
I: Retrieving libbz2-1.0 1.0.8-5+b1
I: Validating libbz2-1.0 1.0.8-5+b1
I: Retrieving libc-bin 2.36-9+deb12u14
I: Validating libc-bin 2.36-9+deb12u14
I: Retrieving libc6 2.36-9+deb12u14
I: Validating libc6 2.36-9+deb12u14
I: Retrieving libcap-ng0 0.8.3-1+b3
I: Validating libcap-ng0 0.8.3-1+b3
I: Retrieving libcap2 1:2.66-4+deb12u3+b1
I: Validating libcap2 1:2.66-4+deb12u3+b1
I: Retrieving libcom-err2 1.47.0-2+b2
I: Validating libcom-err2 1.47.0-2+b2
I: Retrieving libcrypt1 1:4.4.33-2
I: Validating libcrypt1 1:4.4.33-2
I: Retrieving libdb5.3 5.3.28+dfsg2-1
I: Validating libdb5.3 5.3.28+dfsg2-1
I: Retrieving libdebconfclient0 0.270
I: Validating libdebconfclient0 0.270
I: Retrieving libext2fs2 1.47.0-2+b2
I: Validating libext2fs2 1.47.0-2+b2
I: Retrieving libffi8 3.4.4-1
I: Validating libffi8 3.4.4-1
I: Retrieving libgcc-s1 12.2.0-14+deb12u1
I: Validating libgcc-s1 12.2.0-14+deb12u1
I: Retrieving libgcrypt20 1.10.1-3+deb12u1
I: Validating libgcrypt20 1.10.1-3+deb12u1
I: Retrieving libgmp10 2:6.2.1+dfsg1-1.1
I: Validating libgmp10 2:6.2.1+dfsg1-1.1
I: Retrieving libgnutls30 3.7.9-2+deb12u7
I: Validating libgnutls30 3.7.9-2+deb12u7
I: Retrieving libgpg-error0 1.46-1
I: Validating libgpg-error0 1.46-1
I: Retrieving libhogweed6 3.8.1-2
I: Validating libhogweed6 3.8.1-2
I: Retrieving libidn2-0 2.3.3-1+b1
I: Validating libidn2-0 2.3.3-1+b1
I: Retrieving liblz4-1 1.9.4-1
I: Validating liblz4-1 1.9.4-1
I: Retrieving liblzma5 5.4.1-1+deb12u1
I: Validating liblzma5 5.4.1-1+deb12u1
I: Retrieving libmd0 1.0.4-2
I: Validating libmd0 1.0.4-2
I: Retrieving libmount1 2.38.1-5+deb12u3
I: Validating libmount1 2.38.1-5+deb12u3
I: Retrieving libnettle8 3.8.1-2
I: Validating libnettle8 3.8.1-2
I: Retrieving libp11-kit0 0.24.1-2
I: Validating libp11-kit0 0.24.1-2
I: Retrieving libpam-modules 1.5.2-6+deb12u2
I: Validating libpam-modules 1.5.2-6+deb12u2
I: Retrieving libpam-modules-bin 1.5.2-6+deb12u2
I: Validating libpam-modules-bin 1.5.2-6+deb12u2
I: Retrieving libpam-runtime 1.5.2-6+deb12u2
I: Validating libpam-runtime 1.5.2-6+deb12u2
I: Retrieving libpam0g 1.5.2-6+deb12u2
I: Validating libpam0g 1.5.2-6+deb12u2
I: Retrieving libpcre2-8-0 10.42-1
I: Validating libpcre2-8-0 10.42-1
I: Retrieving libseccomp2 2.5.4-1+deb12u1
I: Validating libseccomp2 2.5.4-1+deb12u1
I: Retrieving libselinux1 3.4-1+b6
W: Couldn't download package libselinux1 (ver 3.4-1+b6 arch amd64) at http://deb.debian.org/debian/pool/main/libs/libselinux/libselinux1_3.4-1+b6_amd64.deb
I: Validating libsemanage-common 3.4-1
I: Validating libsemanage2 3.4-1+b5
I: Validating libsepol2 3.4-2.1
I: Validating libsmartcols1 2.38.1-5+deb12u3
I: Validating libss2 1.47.0-2+b2
I: Validating libstdc++6 12.2.0-14+deb12u1
I: Validating libsystemd0 252.39-1~deb12u2
I: Validating libtasn1-6 4.19.0-2+deb12u1
I: Validating libtinfo6 6.4-4
I: Validating libudev1 252.39-1~deb12u2
I: Validating libunistring2 1.0-2
I: Validating libuuid1 2.38.1-5+deb12u3
I: Validating libxxhash0 0.8.1-1
I: Validating libzstd1 1.5.4+dfsg2-5
I: Validating login 1:4.13+dfsg1-1+deb12u2
I: Validating logsave 1.47.0-2+b2
I: Validating mawk 1.3.4.20200120-3.1
I: Validating mount 2.38.1-5+deb12u3
I: Validating ncurses-base 6.4-4
I: Validating ncurses-bin 6.4-4
I: Validating passwd 1:4.13+dfsg1-1+deb12u2
I: Validating perl-base 5.36.0-7+deb12u3
I: Retrieving sed 4.9-1+deb12u1
I: Validating sed 4.9-1+deb12u1
W: Retrying failed download of http://deb.debian.org/debian/pool/main/s/sed/sed_4.9-1+deb12u1_amd64.deb
I: Retrieving sed 4.9-1+deb12u1
I: Validating sed 4.9-1+deb12u1
I: Retrieving sysvinit-utils 3.06-4
I: Validating sysvinit-utils 3.06-4
I: Retrieving tar 1.34+dfsg-1.2+deb12u1
I: Validating tar 1.34+dfsg-1.2+deb12u1
I: Retrieving tzdata 2026b-0+deb12u1
W: Couldn't download package tzdata (ver 2026b-0+deb12u1 arch all) at http://deb.debian.org/debian/pool/main/t/tzdata/tzdata_2026b-0+deb12u1_all.deb
I: Validating usr-is-merged 37~deb12u1
I: Validating util-linux 2.38.1-5+deb12u3
I: Validating util-linux-extra 2.38.1-5+deb12u3
I: Validating zlib1g 1:1.2.13.dfsg-1
E: Couldn't download packages: bash debianutils libselinux1 tzdata
[  FAIL LOG END  ] [ target/sonic-vs.bin__vs__rfs.squashfs ]
make: *** [slave.mk:1332: target/sonic-vs.bin__vs__rfs.squashfs] Error 1
[ finished ] [ target/debs/bookworm/p4lang-bmv2_1.15.0-7_amd64.deb ] 
make[1]: *** [Makefile.work:611: all] Error 2
make[1]: Leaving directory '/var/lib/jenkins/workspace/ETRI-202505/platform-vs'
make: *** [Makefile:57: all] Error 2