+++ --- Applying local submodule patches --- +++
already applied: sonic-utilities
already applied: sonic-swss
already applied: sonic-swss-new
already applied: sonic-sairedis-vslib
already applied: sonic-sairedis-meta
already applied: sonic-sairedis-SAI
already applied: sonic-sairedis-SAI-apidef
already applied: sonic-mgmt-framework
+++ --- Making all --- +++
./scripts/run_with_retry make BLDENV=bookworm -f Makefile.work all
make[1]: Entering directory '/var/lib/jenkins/workspace/ETRI-202505/platform-vs'
"SECURE_UPGRADE_PROD_SIGNING_TOOL": ""
~/workspace/ETRI-202505/platform-vs/src/sonic-build-hooks ~/workspace/ETRI-202505/platform-vs
make[2]: Entering directory '/var/lib/jenkins/workspace/ETRI-202505/platform-vs/src/sonic-build-hooks'
dpkg-deb: building package 'sonic-build-hooks' in 'buildinfo/sonic-build-hooks_1.0_all.deb'.
make[2]: Leaving directory '/var/lib/jenkins/workspace/ETRI-202505/platform-vs/src/sonic-build-hooks'
~/workspace/ETRI-202505/platform-vs
Checking sonic-slave-base image: sonic-slave-bookworm:2f250bfbb4a
Checking sonic-slave-user image: sonic-slave-bookworm-jenkins:571e10d221b
SONiC Build System
Build Configuration
"CONFIGURED_PLATFORM" : "vs"
"CONFIGURED_ARCH" : "amd64"
"SONIC_CONFIG_PRINT_DEPENDENCIES" : ""
"SONIC_BUILD_JOBS" : "4"
"SONIC_CONFIG_MAKE_JOBS" : "112"
"USE_NATIVE_DOCKERD_FOR_BUILD" : ""
"SONIC_USE_DOCKER_BUILDKIT" : ""
"USERNAME" : "admin"
"PASSWORD" : "YourPaSsWoRd"
"CHANGE_DEFAULT_PASSWORD" : "n"
"SECURE_UPGRADE_MODE" : "no_sign"
"SECURE_UPGRADE_DEV_SIGNING_KEY" : ""
"SECURE_UPGRADE_SIGNING_CERT" : ""
"SECURE_UPGRADE_PROD_SIGNING_TOOL": ""
"SECURE_UPGRADE_PROD_TOOL_ARGS" : ""
"ONIE_IMAGE_PART_SIZE" : ""
"SHUTDOWN_BGP_ON_START" : ""
"ENABLE_PFCWD_ON_START" : ""
"SONIC_BUFFER_MODEL" : ""
"INSTALL_DEBUG_TOOLS" : ""
"ROUTING_STACK" : "frr"
"FRR_USER_UID" : "300"
"FRR_USER_GID" : "300"
"ENABLE_SYNCD_RPC" : ""
"SAITHRIFT_V2" : ""
"ENABLE_ORGANIZATION_EXTENSIONS" : "y"
"HTTP_PROXY" : ""
"HTTPS_PROXY" : ""
"NO_PROXY" : ""
"ENABLE_ZTP" : ""
"INCLUDE_PDE" : ""
"SONIC_DEBUGGING_ON" : ""
"SONIC_PROFILING_ON" : ""
"KERNEL_PROCURE_METHOD" : "build"
"BUILD_TIMESTAMP" : "20260908.102623"
"BUILD_LOG_TIMESTAMP" : "none"
"SONIC_IMAGE_VERSION" : "etri-202505.26-8610ff460"
"BLDENV" : "bookworm"
"VS_PREPARE_MEM" : "yes"
"INCLUDE_MGMT_FRAMEWORK" : "y"
"INCLUDE_ICCPD" : "n"
"INCLUDE_STP" : "y"
"INCLUDE_SYSTEM_TELEMETRY" : "y"
"INCLUDE_SYSTEM_GNMI" : "y"
"INCLUDE_SYSTEM_BMP" : "y"
"INCLUDE_SYSTEM_EVENTD" : "y"
"ENABLE_HOST_SERVICE_ON_START" : "y"
"INCLUDE_RESTAPI" : "n"
"INCLUDE_SFLOW" : "y"
"INCLUDE_NAT" : "y"
"INCLUDE_DHCP_RELAY" : "y"
"INCLUDE_DHCP_SERVER" : "n"
"INCLUDE_P4RT" : "n"
"INCLUDE_VS_DASH_SAI" : "y"
"INCLUDE_KUBERNETES" : "n"
"INCLUDE_KUBERNETES_MASTER" : "n"
"INCLUDE_MACSEC" : "y"
"INCLUDE_MUX" : "y"
"INCLUDE_TEAMD" : "y"
"INCLUDE_DASH_HA" : "y"
"INCLUDE_ROUTER_ADVERTISER" : "y"
"INCLUDE_BOOTCHART : "y"
"ENABLE_BOOTCHART : "n"
"INCLUDE_FIPS" : "y"
"ENABLE_TRANSLIB_WRITE" : ""
"ENABLE_NATIVE_WRITE" : "y"
"ENABLE_DIALOUT" : ""
"ENABLE_AUTO_TECH_SUPPORT" : "y"
"PDDF_SUPPORT" : "y"
"MULTIARCH_QEMU_ENVIRON" : "n"
"SONIC_VERSION_CONTROL_COMPONENTS": "py2,py3,web,git,docker"
"ENABLE_ASAN" : "n"
"DEFAULT_CONTAINER_REGISTRY" : "publicmirror.azurecr.io/"
"BUILD_MULTIASIC_KVM" : "n"
"CROSS_BUILD_ENVIRON" : "n"
"LEGACY_SONIC_MGMT_DOCKER" : "y"
"INCLUDE_EXTERNAL_PATCHES" : "n"
"PTF_ENV_PY_VER" : "py3"
"ENABLE_MULTIDB" : ""
mv: cannot move '/etc/apt/sources.list.d/debian.sources' to '/etc/apt/sources.list.d/debian.sources.back': Permission denied
fatal: not a git repository (or any of the parent directories): .git
"SONIC_DPKG_CACHE_METHOD" : "none"
basename: missing operand
Try 'basename --help' for more information.
basename: missing operand
Try 'basename --help' for more information.
[ building ] [ target/sonic-vs.bin ]
[ building ] [ target/sonic-vs.img.gz ]
[ building ] [ target/files/bookworm/sonic_version.yml ]
[ building ] [ target/docker-swss-layer-bookworm.gz-load ]
[ finished ] [ target/files/bookworm/sonic_version.yml ]
[ finished ] [ target/docker-swss-layer-bookworm.gz-load ]
[ building ] [ target/docker-sonic-vs.gz ]
[ finished ] [ target/sonic-vs.img.gz ]
[ FAIL LOG START ] [ target/sonic-vs.img.gz ]
Build start time: Tue Sep 8 01:26:49 UTC 2026
++ '[' -f .arch ']'
++ cat .arch
+ CONFIGURED_ARCH=amd64
+ DOCKER_VERSION=5:24.0.2-1~debian.12~bookworm
+ CONTAINERD_IO_VERSION=1.6.21-1
+ LINUX_KERNEL_VERSION=6.1.0-29-2
+ FILESYSTEM_ROOT=./fsroot
+ PLATFORM_DIR=platform
+ HOSTNAME=sonic
+ DEFAULT_USERINFO='Default admin user,,,'
+ BUILD_TOOL_PATH=src/sonic-build-hooks/buildinfo
+ TRUSTED_GPG_DIR=src/sonic-build-hooks/buildinfo/trusted.gpg.d
+ . ./onie-image.conf
++ : 32768
++ : x86_64
++ : vs
++ ONIEIMAGE_VERSION=r0
++ FILESYSTEM_ROOT=./fsroot-vs
++ FILESYSTEM_SQUASHFS=fs.squashfs
++ INSTALLER_PAYLOAD=fs.zip
++ FILESYSTEM_DOCKERFS=dockerfs.tar.gz
++ DOCKERFS_DIR=docker
++ DOCKER_RAMFS_SIZE=3500M
++ OUTPUT_ONIE_IMAGE=target/sonic-vs.bin
++ OUTPUT_RAW_IMAGE=target/sonic-vs.raw
++ RAW_IMAGE_DISK_SIZE=1700
++ OUTPUT_KVM_IMAGE=target/sonic-vs.img
++ KVM_IMAGE_DISK_SIZE=16
++ OUTPUT_ABOOT_IMAGE=target/sonic-aboot-vs.swi
++ ABOOT_BOOT_IMAGE=.sonic-boot.swi
++ OUTPUT_KVM_4ASIC_IMAGE=target/sonic-4asic-vs.img
++ OUTPUT_KVM_6ASIC_IMAGE=target/sonic-6asic-vs.img
++ OUTPUT_DSC_IMAGE=target/sonic-vs.tar
+ '[' -n 32768 ']'
+ '[' -n fs.zip ']'
+ '[' -n fs.squashfs ']'
+ '[' kvm = aboot ']'
+ [[ y != y ]]
+ [[ n == y ]]
+ [[ y == y ]]
+ echo '[INFO] RFS build: second stage'
[INFO] RFS build: second stage
+ sudo mount proc /proc -t proc
+ sudo fuser -vm ./fsroot-vs
USER PID ACCESS COMMAND
/sonic/fsroot-vs: root kernel mount /usr/sbin/docker-init
jenkins 1 ..ce. docker-init
jenkins 6 ..c.. bash
jenkins 7 ..c.. make
jenkins 6228 ..c.. bash
jenkins 6493 ..c.. bash
root 6682 ....m dockerd
root 6764 ....m containerd
jenkins 7259 ..c.. bash
jenkins 7506 ..c.. docker
jenkins 7507 ..c.. process_log.sh
jenkins 12625 ..c.. build_debian.sh
jenkins 12626 ..c.. process_log.sh
root 12672 ..c.. sudo
root 12673 F.c.. unsquashfs
jenkins 12753 ..c.. build_debian.sh
jenkins 12758 ..c.. process_log.sh
root 12801 ..c.. sudo
+ sudo rm -rf ./fsroot-vs
rm: cannot remove './fsroot-vs/dev/ida': Directory not empty
[ FAIL LOG END ] [ target/sonic-vs.img.gz ]
make: *** [slave.mk:1435: target/sonic-vs.img.gz] Error 1
make: *** Waiting for unfinished jobs....
[ finished ] [ target/sonic-vs.bin ]
[ FAIL LOG START ] [ target/sonic-vs.bin ]
Build start time: Tue Sep 8 01:26:48 UTC 2026
++ '[' -f .arch ']'
++ cat .arch
+ CONFIGURED_ARCH=amd64
+ DOCKER_VERSION=5:24.0.2-1~debian.12~bookworm
+ CONTAINERD_IO_VERSION=1.6.21-1
+ LINUX_KERNEL_VERSION=6.1.0-29-2
+ FILESYSTEM_ROOT=./fsroot
+ PLATFORM_DIR=platform
+ HOSTNAME=sonic
+ DEFAULT_USERINFO='Default admin user,,,'
+ BUILD_TOOL_PATH=src/sonic-build-hooks/buildinfo
+ TRUSTED_GPG_DIR=src/sonic-build-hooks/buildinfo/trusted.gpg.d
+ . ./onie-image.conf
++ : 32768
++ : x86_64
++ : vs
++ ONIEIMAGE_VERSION=r0
++ FILESYSTEM_ROOT=./fsroot-vs
++ FILESYSTEM_SQUASHFS=fs.squashfs
++ INSTALLER_PAYLOAD=fs.zip
++ FILESYSTEM_DOCKERFS=dockerfs.tar.gz
++ DOCKERFS_DIR=docker
++ DOCKER_RAMFS_SIZE=3500M
++ OUTPUT_ONIE_IMAGE=target/sonic-vs.bin
++ OUTPUT_RAW_IMAGE=target/sonic-vs.raw
++ RAW_IMAGE_DISK_SIZE=1700
++ OUTPUT_KVM_IMAGE=target/sonic-vs.img
++ KVM_IMAGE_DISK_SIZE=16
++ OUTPUT_ABOOT_IMAGE=target/sonic-aboot-vs.swi
++ ABOOT_BOOT_IMAGE=.sonic-boot.swi
++ OUTPUT_KVM_4ASIC_IMAGE=target/sonic-4asic-vs.img
++ OUTPUT_KVM_6ASIC_IMAGE=target/sonic-6asic-vs.img
++ OUTPUT_DSC_IMAGE=target/sonic-vs.tar
+ '[' -n 32768 ']'
+ '[' -n fs.zip ']'
+ '[' -n fs.squashfs ']'
+ '[' onie = aboot ']'
+ [[ y != y ]]
+ [[ n == y ]]
+ [[ y == y ]]
+ echo '[INFO] RFS build: second stage'
[INFO] RFS build: second stage
+ sudo mount proc /proc -t proc
+ sudo fuser -vm ./fsroot-vs
USER PID ACCESS COMMAND
/sonic/fsroot-vs: root kernel mount /usr/sbin/docker-init
jenkins 1 ..ce. docker-init
jenkins 6 ..c.. bash
jenkins 7 ..c.. make
jenkins 6228 ..c.. bash
jenkins 6493 ..c.. bash
root 6682 ....m dockerd
root 6764 ....m containerd
jenkins 7259 ..c.. bash
jenkins 7506 ..c.. docker
jenkins 7507 ..c.. process_log.sh
jenkins 12618 ..c.. j2
jenkins 12625 ..c.. build_debian.sh
jenkins 12626 ..c.. process_log.sh
root 12634 ..c.. sudo
+ sudo rm -rf ./fsroot-vs
+ sudo unsquashfs -d ./fsroot-vs target/sonic-vs.bin__vs__rfs.squashfs
Parallel unsquashfs: Using 112 processors
33651 inodes (34123 blocks) to write
[=======| ] 8085/67774 11%
[===========- ] 13260/67774 19%
[==================\ ] 21278/67774 31%
[=============================| ] 33510/67774 49%
[========================================/ ] 46877/67774 69%
[===========================================================/] 67774/67774 100%
created 25922 files
created 3484 directories
created 2373 symlinks
created 5351 devices
created 0 fifos
created 0 sockets
created 5 hardlinks
+ pushd ./fsroot-vs
/sonic/fsroot-vs /sonic
+ sudo mount --bind . .
+ popd
/sonic
+ trap_push 'sudo LANG=C chroot $FILESYSTEM_ROOT umount /proc || true'
+ local oldcmd=true
+ local 'newcmd=sudo LANG=C chroot $FILESYSTEM_ROOT umount /proc || true; true'
+ trap -- 'sudo LANG=C chroot $FILESYSTEM_ROOT umount /proc || true; true' EXIT INT TERM HUP
+ _trap_push 'sudo LANG=C chroot $FILESYSTEM_ROOT umount /proc || true; true'
+ local 'next=sudo LANG=C chroot $FILESYSTEM_ROOT umount /proc || true; true'
++ echo 'sudo LANG=C chroot $FILESYSTEM_ROOT umount /proc || true; true'
++ sed -e 's/'\''/'\''\\'\'''\''/g'
+ eval 'trap_push() {
local oldcmd='\''sudo LANG=C chroot $FILESYSTEM_ROOT umount /proc || true; true'\''
local newcmd="$1; $oldcmd"
trap -- "$newcmd" EXIT INT TERM HUP
_trap_push "$newcmd"
}'
+ sudo LANG=C chroot ./fsroot-vs mount proc /proc -t proc
+ export build_version=etri-202505.26-8610ff460
+ build_version=etri-202505.26-8610ff460
++ cat ./fsroot-vs/etc/debian_version
+ export debian_version=12.15
+ debian_version=12.15
+ export kernel_version=6.1.0-29-2-amd64
+ kernel_version=6.1.0-29-2-amd64
+ export asic_type=vs
+ asic_type=vs
+ export asic_subtype=vs
+ asic_subtype=vs
++ git rev-parse --short HEAD
+ export commit_id=8610ff460
+ commit_id=8610ff460
++ git rev-parse --abbrev-ref HEAD
+ export branch=etri-202505
+ branch=etri-202505
++ '[' -f ./fsroot-vs/etc/sonic/sonic_release ']'
++ cat ./fsroot-vs/etc/sonic/sonic_release
+ export release=202505
+ release=202505
++ date -u
+ export 'build_date=Tue Sep 8 01:27:36 UTC 2026'
+ build_date='Tue Sep 8 01:27:36 UTC 2026'
+ export build_number=26
+ build_number=26
+ export built_by=jenkins@w2sh
+ built_by=jenkins@w2sh
+ export sonic_os_version=12
+ sonic_os_version=12
+ j2 files/build_templates/sonic_version.yml.j2
+ sudo tee ./fsroot-vs/etc/sonic/sonic_version.yml
---
build_version: 'etri-202505.26-8610ff460'
debian_version: '12.15'
kernel_version: '6.1.0-29-2-amd64'
asic_type: vs
asic_subtype: 'vs'
commit_id: '8610ff460'
branch: 'etri-202505'
release: '202505'
build_date: Tue Sep 8 01:27:36 UTC 2026
build_number: 26
built_by: jenkins@w2sh
libswsscommon: 1.0.0
sonic_utilities: 1.2
sonic_os_version: 12
secure_boot_image: 'no'
+ '[' -f sonic_debian_extension.sh ']'
+ ./sonic_debian_extension.sh ./fsroot-vs platform bookworm
++ '[' -f .arch ']'
++ cat .arch
+ CONFIGURED_ARCH=amd64
++ '[' -f .platform ']'
++ cat .platform
+ CONFIGURED_PLATFORM=vs
+ . functions.sh
++ _trap_push true
++ local next=true
+++ echo true
+++ sed -e 's/'\''/'\''\\'\'''\''/g'
++ eval 'trap_push() {
local oldcmd='\''true'\''
local newcmd="$1; $oldcmd"
trap -- "$newcmd" EXIT INT TERM HUP
_trap_push "$newcmd"
}'
+ BUILD_SCRIPTS_DIR=files/build_scripts
+ BUILD_TEMPLATES=files/build_templates
+ IMAGE_CONFIGS=files/image_config
+ SCRIPTS_DIR=files/scripts
+ DOCKER_SCRIPTS_DIR=files/docker
+ DOCKER_CTL_DIR=/usr/lib/docker/
+ DOCKER_CTL_SCRIPT=/usr/lib/docker//docker.sh
+ FILESYSTEM_ROOT_USR=./fsroot-vs/usr
+ FILESYSTEM_ROOT_USR_LIB=./fsroot-vs/usr/lib/
+ FILESYSTEM_ROOT_USR_LIB_SYSTEMD_SYSTEM=./fsroot-vs/usr/lib//systemd/system
+ FILESYSTEM_ROOT_USR_LIB_SYSTEMD_NETWORK=./fsroot-vs/usr/lib//systemd/network
+ FILESYSTEM_ROOT_USR_SHARE=./fsroot-vs/usr/share
+ FILESYSTEM_ROOT_USR_SHARE_SONIC=./fsroot-vs/usr/share/sonic
+ FILESYSTEM_ROOT_USR_SHARE_SONIC_SCRIPTS=./fsroot-vs/usr/share/sonic/scripts
+ FILESYSTEM_ROOT_USR_SHARE_SONIC_TEMPLATES=./fsroot-vs/usr/share/sonic/templates
+ FILESYSTEM_ROOT_USR_SHARE_SONIC_FIRMWARE=./fsroot-vs/usr/share/sonic/firmware
+ FILESYSTEM_ROOT_ETC=./fsroot-vs/etc
+ FILESYSTEM_ROOT_ETC_SONIC=./fsroot-vs/etc/sonic
+ GENERATED_SERVICE_FILE=./fsroot-vs/etc/sonic/generated_services.conf
+ trap_push clean_sys
+ local oldcmd=true
+ local 'newcmd=clean_sys; true'
+ trap -- 'clean_sys; true' EXIT INT TERM HUP
+ _trap_push 'clean_sys; true'
+ local 'next=clean_sys; true'
++ echo 'clean_sys; true'
++ sed -e 's/'\''/'\''\\'\'''\''/g'
+ eval 'trap_push() {
local oldcmd='\''clean_sys; true'\''
local newcmd="$1; $oldcmd"
trap -- "$newcmd" EXIT INT TERM HUP
_trap_push "$newcmd"
}'
+ sudo LANG=C chroot ./fsroot-vs mount sysfs /sys -t sysfs
+ sudo bash -c 'echo "DOCKER_OPTS="--storage-driver=overlay2"" >> ./fsroot-vs/etc/default/docker'
+ sudo mkdir -p ./fsroot-vs//usr/lib/docker/
+ sudo cp files/docker/docker ./fsroot-vs//usr/lib/docker//docker.sh
+ [[ n == y ]]
+ [[ n == y ]]
+ sudo chroot ./fsroot-vs /usr/lib/docker//docker.sh start
chroot: failed to run command '/usr/lib/docker//docker.sh': No such file or directory
+ clean_sys
+ sudo chroot ./fsroot-vs umount /sys/fs/cgroup/cgroup.controllers /sys/fs/cgroup/cgroup.events /sys/fs/cgroup/cgroup.freeze /sys/fs/cgroup/cgroup.kill /sys/fs/cgroup/cgroup.max.depth /sys/fs/cgroup/cgroup.max.descendants /sys/fs/cgroup/cgroup.pressure /sys/fs/cgroup/cgroup.procs /sys/fs/cgroup/cgroup.stat /sys/fs/cgroup/cgroup.subtree_control /sys/fs/cgroup/cgroup.threads /sys/fs/cgroup/cgroup.type /sys/fs/cgroup/cpu.idle /sys/fs/cgroup/cpu.max /sys/fs/cgroup/cpu.max.burst /sys/fs/cgroup/cpu.pressure /sys/fs/cgroup/cpu.stat /sys/fs/cgroup/cpu.stat.local /sys/fs/cgroup/cpu.uclamp.max /sys/fs/cgroup/cpu.uclamp.min /sys/fs/cgroup/cpu.weight /sys/fs/cgroup/cpu.weight.nice /sys/fs/cgroup/cpuset.cpus /sys/fs/cgroup/cpuset.cpus.effective /sys/fs/cgroup/cpuset.cpus.exclusive /sys/fs/cgroup/cpuset.cpus.exclusive.effective /sys/fs/cgroup/cpuset.cpus.partition /sys/fs/cgroup/cpuset.mems /sys/fs/cgroup/cpuset.mems.effective /sys/fs/cgroup/docker /sys/fs/cgroup/hugetlb.1GB.current /sys/fs/cgroup/hugetlb.1GB.events /sys/fs/cgroup/hugetlb.1GB.events.local /sys/fs/cgroup/hugetlb.1GB.max /sys/fs/cgroup/hugetlb.1GB.numa_stat /sys/fs/cgroup/hugetlb.1GB.rsvd.current /sys/fs/cgroup/hugetlb.1GB.rsvd.max /sys/fs/cgroup/hugetlb.2MB.current /sys/fs/cgroup/hugetlb.2MB.events /sys/fs/cgroup/hugetlb.2MB.events.local /sys/fs/cgroup/hugetlb.2MB.max /sys/fs/cgroup/hugetlb.2MB.numa_stat /sys/fs/cgroup/hugetlb.2MB.rsvd.current /sys/fs/cgroup/hugetlb.2MB.rsvd.max /sys/fs/cgroup/io.max /sys/fs/cgroup/io.pressure /sys/fs/cgroup/io.prio.class /sys/fs/cgroup/io.stat /sys/fs/cgroup/io.weight /sys/fs/cgroup/memory.current /sys/fs/cgroup/memory.events /sys/fs/cgroup/memory.events.local /sys/fs/cgroup/memory.high /sys/fs/cgroup/memory.low /sys/fs/cgroup/memory.max /sys/fs/cgroup/memory.min /sys/fs/cgroup/memory.numa_stat /sys/fs/cgroup/memory.oom.group /sys/fs/cgroup/memory.peak /sys/fs/cgroup/memory.pressure /sys/fs/cgroup/memory.reclaim /sys/fs/cgroup/memory.stat /sys/fs/cgroup/memory.swap.current /sys/fs/cgroup/memory.swap.events /sys/fs/cgroup/memory.swap.high /sys/fs/cgroup/memory.swap.max /sys/fs/cgroup/memory.swap.peak /sys/fs/cgroup/memory.zswap.current /sys/fs/cgroup/memory.zswap.max /sys/fs/cgroup/memory.zswap.writeback /sys/fs/cgroup/misc.current /sys/fs/cgroup/misc.events /sys/fs/cgroup/misc.max /sys/fs/cgroup/pids.current /sys/fs/cgroup/pids.events /sys/fs/cgroup/pids.max /sys/fs/cgroup/pids.peak /sys/fs/cgroup/rdma.current /sys/fs/cgroup/rdma.max /sys/fs/cgroup /sys
umount: /sys/fs/cgroup/cgroup.controllers: no mount point specified.
umount: /sys/fs/cgroup/cgroup.events: no mount point specified.
umount: /sys/fs/cgroup/cgroup.freeze: no mount point specified.
umount: /sys/fs/cgroup/cgroup.kill: no mount point specified.
umount: /sys/fs/cgroup/cgroup.max.depth: no mount point specified.
umount: /sys/fs/cgroup/cgroup.max.descendants: no mount point specified.
umount: /sys/fs/cgroup/cgroup.pressure: no mount point specified.
umount: /sys/fs/cgroup/cgroup.procs: no mount point specified.
umount: /sys/fs/cgroup/cgroup.stat: no mount point specified.
umount: /sys/fs/cgroup/cgroup.subtree_control: no mount point specified.
umount: /sys/fs/cgroup/cgroup.threads: no mount point specified.
umount: /sys/fs/cgroup/cgroup.type: no mount point specified.
umount: /sys/fs/cgroup/cpu.idle: no mount point specified.
umount: /sys/fs/cgroup/cpu.max: no mount point specified.
umount: /sys/fs/cgroup/cpu.max.burst: no mount point specified.
umount: /sys/fs/cgroup/cpu.pressure: no mount point specified.
umount: /sys/fs/cgroup/cpu.stat: no mount point specified.
umount: /sys/fs/cgroup/cpu.stat.local: no mount point specified.
umount: /sys/fs/cgroup/cpu.uclamp.max: no mount point specified.
umount: /sys/fs/cgroup/cpu.uclamp.min: no mount point specified.
umount: /sys/fs/cgroup/cpu.weight: no mount point specified.
umount: /sys/fs/cgroup/cpu.weight.nice: no mount point specified.
umount: /sys/fs/cgroup/cpuset.cpus: no mount point specified.
umount: /sys/fs/cgroup/cpuset.cpus.effective: no mount point specified.
umount: /sys/fs/cgroup/cpuset.cpus.exclusive: no mount point specified.
umount: /sys/fs/cgroup/cpuset.cpus.exclusive.effective: no mount point specified.
umount: /sys/fs/cgroup/cpuset.cpus.partition: no mount point specified.
umount: /sys/fs/cgroup/cpuset.mems: no mount point specified.
umount: /sys/fs/cgroup/cpuset.mems.effective: no mount point specified.
umount: /sys/fs/cgroup/docker: no mount point specified.
umount: /sys/fs/cgroup/hugetlb.1GB.current: no mount point specified.
umount: /sys/fs/cgroup/hugetlb.1GB.events: no mount point specified.
umount: /sys/fs/cgroup/hugetlb.1GB.events.local: no mount point specified.
umount: /sys/fs/cgroup/hugetlb.1GB.max: no mount point specified.
umount: /sys/fs/cgroup/hugetlb.1GB.numa_stat: no mount point specified.
umount: /sys/fs/cgroup/hugetlb.1GB.rsvd.current: no mount point specified.
umount: /sys/fs/cgroup/hugetlb.1GB.rsvd.max: no mount point specified.
umount: /sys/fs/cgroup/hugetlb.2MB.current: no mount point specified.
umount: /sys/fs/cgroup/hugetlb.2MB.events: no mount point specified.
umount: /sys/fs/cgroup/hugetlb.2MB.events.local: no mount point specified.
umount: /sys/fs/cgroup/hugetlb.2MB.max: no mount point specified.
umount: /sys/fs/cgroup/hugetlb.2MB.numa_stat: no mount point specified.
umount: /sys/fs/cgroup/hugetlb.2MB.rsvd.current: no mount point specified.
umount: /sys/fs/cgroup/hugetlb.2MB.rsvd.max: no mount point specified.
umount: /sys/fs/cgroup/io.max: no mount point specified.
umount: /sys/fs/cgroup/io.pressure: no mount point specified.
umount: /sys/fs/cgroup/io.prio.class: no mount point specified.
umount: /sys/fs/cgroup/io.stat: no mount point specified.
umount: /sys/fs/cgroup/io.weight: no mount point specified.
umount: /sys/fs/cgroup/memory.current: no mount point specified.
umount: /sys/fs/cgroup/memory.events: no mount point specified.
umount: /sys/fs/cgroup/memory.events.local: no mount point specified.
umount: /sys/fs/cgroup/memory.high: no mount point specified.
umount: /sys/fs/cgroup/memory.low: no mount point specified.
umount: /sys/fs/cgroup/memory.max: no mount point specified.
umount: /sys/fs/cgroup/memory.min: no mount point specified.
umount: /sys/fs/cgroup/memory.numa_stat: no mount point specified.
umount: /sys/fs/cgroup/memory.oom.group: no mount point specified.
umount: /sys/fs/cgroup/memory.peak: no mount point specified.
umount: /sys/fs/cgroup/memory.pressure: no mount point specified.
umount: /sys/fs/cgroup/memory.reclaim: no mount point specified.
umount: /sys/fs/cgroup/memory.stat: no mount point specified.
umount: /sys/fs/cgroup/memory.swap.current: no mount point specified.
umount: /sys/fs/cgroup/memory.swap.events: no mount point specified.
umount: /sys/fs/cgroup/memory.swap.high: no mount point specified.
umount: /sys/fs/cgroup/memory.swap.max: no mount point specified.
umount: /sys/fs/cgroup/memory.swap.peak: no mount point specified.
umount: /sys/fs/cgroup/memory.zswap.current: no mount point specified.
umount: /sys/fs/cgroup/memory.zswap.max: no mount point specified.
umount: /sys/fs/cgroup/memory.zswap.writeback: no mount point specified.
umount: /sys/fs/cgroup/misc.current: no mount point specified.
umount: /sys/fs/cgroup/misc.events: no mount point specified.
umount: /sys/fs/cgroup/misc.max: no mount point specified.
umount: /sys/fs/cgroup/pids.current: no mount point specified.
umount: /sys/fs/cgroup/pids.events: no mount point specified.
umount: /sys/fs/cgroup/pids.max: no mount point specified.
umount: /sys/fs/cgroup/pids.peak: no mount point specified.
umount: /sys/fs/cgroup/rdma.current: no mount point specified.
umount: /sys/fs/cgroup/rdma.max: no mount point specified.
umount: /sys/fs/cgroup: not mounted.
+ true
+ true
+ sudo LANG=C chroot ./fsroot-vs umount /proc
+ true
[ FAIL LOG END ] [ target/sonic-vs.bin ]
make: *** [slave.mk:1435: target/sonic-vs.bin] Error 1
[ finished ] [ target/docker-sonic-vs.gz ]
make[1]: *** [Makefile.work:611: all] Error 2
make[1]: Leaving directory '/var/lib/jenkins/workspace/ETRI-202505/platform-vs'
make: *** [Makefile:53: all] Error 2
|