+++ --- Applying local submodule patches --- +++
/var/lib/jenkins/workspace/DevOps-test/platform-broadcom/patches/sonic-utilities.patch:703: trailing whitespace.
import click
/var/lib/jenkins/workspace/DevOps-test/platform-broadcom/patches/sonic-utilities.patch:704: trailing whitespace.
import utilities_common.cli as clicommon
/var/lib/jenkins/workspace/DevOps-test/platform-broadcom/patches/sonic-utilities.patch:705: trailing whitespace.
import utilities_common.multi_asic as multi_asic_util
/var/lib/jenkins/workspace/DevOps-test/platform-broadcom/patches/sonic-utilities.patch:706: trailing whitespace.
from sonic_py_common import multi_asic
/var/lib/jenkins/workspace/DevOps-test/platform-broadcom/patches/sonic-utilities.patch:707: trailing whitespace.
from swsscommon.swsscommon import SonicV2Connector, ConfigDBConnector
warning: squelched 3487 whitespace errors
warning: 3492 lines add whitespace errors.
applied: sonic-utilities
/var/lib/jenkins/workspace/DevOps-test/platform-broadcom/patches/sonic-swss.patch:88: trailing whitespace.
/var/lib/jenkins/workspace/DevOps-test/platform-broadcom/patches/sonic-swss.patch:105: trailing whitespace.
SWSS_LOG_NOTICE("Thi DEBUG [AclOrch]: Force supporting Enum value %d for dTel Action ID: 0x%x",
/var/lib/jenkins/workspace/DevOps-test/platform-broadcom/patches/sonic-swss.patch:112: trailing whitespace.
/var/lib/jenkins/workspace/DevOps-test/platform-broadcom/patches/sonic-swss.patch:140: trailing whitespace.
/var/lib/jenkins/workspace/DevOps-test/platform-broadcom/patches/sonic-swss.patch:284: trailing whitespace.
warning: squelched 2 whitespace errors
warning: 7 lines add whitespace errors.
applied: sonic-swss
/var/lib/jenkins/workspace/DevOps-test/platform-broadcom/patches/sonic-swss-new.patch:7: trailing whitespace.
#include "ptporch.h"
/var/lib/jenkins/workspace/DevOps-test/platform-broadcom/patches/sonic-swss-new.patch:8: trailing whitespace.
#include "saiptp.h" // Include header containing Vendor Extension IDs
/var/lib/jenkins/workspace/DevOps-test/platform-broadcom/patches/sonic-swss-new.patch:9: trailing whitespace.
#include "logger.h"
/var/lib/jenkins/workspace/DevOps-test/platform-broadcom/patches/sonic-swss-new.patch:10: trailing whitespace.
#include "sai_serialize.h"
/var/lib/jenkins/workspace/DevOps-test/platform-broadcom/patches/sonic-swss-new.patch:11: trailing whitespace.
#include "tokenize.h"
warning: squelched 771 whitespace errors
warning: 776 lines add whitespace errors.
applied: sonic-swss-new
applied: sonic-sairedis-vslib
applied: sonic-sairedis-meta
applied: sonic-sairedis-SAI
applied: sonic-sairedis-SAI-apidef
applied: sonic-mgmt-framework
+++ --- Making all --- +++
./scripts/run_with_retry make BLDENV=bookworm -f Makefile.work all
make[1]: Entering directory '/var/lib/jenkins/workspace/DevOps-test/platform-broadcom'
"SECURE_UPGRADE_PROD_SIGNING_TOOL": ""
~/workspace/DevOps-test/platform-broadcom/src/sonic-build-hooks ~/workspace/DevOps-test/platform-broadcom
make[2]: Entering directory '/var/lib/jenkins/workspace/DevOps-test/platform-broadcom/src/sonic-build-hooks'
dpkg-deb: building package 'sonic-build-hooks' in 'buildinfo/sonic-build-hooks_1.0_all.deb'.
make[2]: Leaving directory '/var/lib/jenkins/workspace/DevOps-test/platform-broadcom/src/sonic-build-hooks'
~/workspace/DevOps-test/platform-broadcom
Checking sonic-slave-base image: sonic-slave-bookworm:2f250bfbb4a
Checking sonic-slave-user image: sonic-slave-bookworm-jenkins:3618820e35f
SONiC Build System
Build Configuration
"CONFIGURED_PLATFORM" : "broadcom"
"CONFIGURED_ARCH" : "amd64"
"SONIC_CONFIG_PRINT_DEPENDENCIES" : ""
"SONIC_BUILD_JOBS" : "4"
"SONIC_CONFIG_MAKE_JOBS" : "112"
"USE_NATIVE_DOCKERD_FOR_BUILD" : ""
"SONIC_USE_DOCKER_BUILDKIT" : ""
"USERNAME" : "admin"
"PASSWORD" : "YourPaSsWoRd"
"CHANGE_DEFAULT_PASSWORD" : "n"
"SECURE_UPGRADE_MODE" : "no_sign"
"SECURE_UPGRADE_DEV_SIGNING_KEY" : ""
"SECURE_UPGRADE_SIGNING_CERT" : ""
"SECURE_UPGRADE_PROD_SIGNING_TOOL": ""
"SECURE_UPGRADE_PROD_TOOL_ARGS" : ""
"ONIE_IMAGE_PART_SIZE" : ""
"SHUTDOWN_BGP_ON_START" : ""
"ENABLE_PFCWD_ON_START" : ""
"SONIC_BUFFER_MODEL" : ""
"INSTALL_DEBUG_TOOLS" : ""
"ROUTING_STACK" : "frr"
"FRR_USER_UID" : "300"
"FRR_USER_GID" : "300"
"ENABLE_SYNCD_RPC" : ""
"SAITHRIFT_V2" : ""
"ENABLE_ORGANIZATION_EXTENSIONS" : "y"
"HTTP_PROXY" : ""
"HTTPS_PROXY" : ""
"NO_PROXY" : ""
"ENABLE_ZTP" : ""
"INCLUDE_PDE" : ""
"SONIC_DEBUGGING_ON" : ""
"SONIC_PROFILING_ON" : ""
"KERNEL_PROCURE_METHOD" : "build"
"BUILD_TIMESTAMP" : "20260916.071742"
"BUILD_LOG_TIMESTAMP" : "none"
"SONIC_IMAGE_VERSION" : "etri-202505.5-8610ff460"
"BLDENV" : "bookworm"
"VS_PREPARE_MEM" : "yes"
"INCLUDE_MGMT_FRAMEWORK" : "y"
"INCLUDE_ICCPD" : "n"
"INCLUDE_STP" : "y"
"INCLUDE_SYSTEM_TELEMETRY" : "y"
"INCLUDE_SYSTEM_GNMI" : "y"
"INCLUDE_SYSTEM_BMP" : "y"
"INCLUDE_SYSTEM_EVENTD" : "y"
"ENABLE_HOST_SERVICE_ON_START" : "y"
"INCLUDE_RESTAPI" : "n"
"INCLUDE_SFLOW" : "y"
"INCLUDE_NAT" : "y"
"INCLUDE_DHCP_RELAY" : "y"
"INCLUDE_DHCP_SERVER" : "n"
"INCLUDE_P4RT" : "n"
"INCLUDE_VS_DASH_SAI" : "y"
"INCLUDE_KUBERNETES" : "n"
"INCLUDE_KUBERNETES_MASTER" : "n"
"INCLUDE_MACSEC" : "y"
"INCLUDE_MUX" : "y"
"INCLUDE_TEAMD" : "y"
"INCLUDE_DASH_HA" : "y"
"INCLUDE_ROUTER_ADVERTISER" : "y"
"INCLUDE_BOOTCHART : "y"
"ENABLE_BOOTCHART : "n"
"INCLUDE_FIPS" : "y"
"ENABLE_TRANSLIB_WRITE" : ""
"ENABLE_NATIVE_WRITE" : "y"
"ENABLE_DIALOUT" : ""
"ENABLE_AUTO_TECH_SUPPORT" : "y"
"PDDF_SUPPORT" : "y"
"MULTIARCH_QEMU_ENVIRON" : "n"
"SONIC_VERSION_CONTROL_COMPONENTS": "py2,py3,web,git,docker"
"ENABLE_ASAN" : "n"
"DEFAULT_CONTAINER_REGISTRY" : "publicmirror.azurecr.io/"
"CROSS_BUILD_ENVIRON" : "n"
"LEGACY_SONIC_MGMT_DOCKER" : "y"
"INCLUDE_EXTERNAL_PATCHES" : "n"
"PTF_ENV_PY_VER" : "py3"
"ENABLE_MULTIDB" : ""
mv: cannot move '/etc/apt/sources.list.d/debian.sources' to '/etc/apt/sources.list.d/debian.sources.back': Permission denied
fatal: not a git repository (or any of the parent directories): .git
"SONIC_DPKG_CACHE_METHOD" : "none"
[ building ] [ target/debs/bookworm/linux-headers-6.1.0-29-2-common_6.1.123-1_all.deb ]
[ building ] [ target/debs/bookworm/systemd-sonic-generator_1.0.0_amd64.deb ]
[ building ] [ target/debs/bookworm/flashrom_0.9.7_amd64.deb ]
[ building ] [ target/debs/bookworm/initramfs-tools_0.142_all.deb ]
[ finished ] [ target/debs/bookworm/initramfs-tools_0.142_all.deb ]
[ building ] [ target/debs/bookworm/sonic-device-data_1.0-1_all.deb ]
[ finished ] [ target/debs/bookworm/systemd-sonic-generator_1.0.0_amd64.deb ]
[ finished ] [ target/debs/bookworm/flashrom_0.9.7_amd64.deb ]
[ building ] [ target/debs/bookworm/ifupdown2_3.0.0-1_all.deb ]
[ building ] [ target/debs/bookworm/kdump-tools_1.8.1_amd64.deb ]
[ finished ] [ target/debs/bookworm/kdump-tools_1.8.1_amd64.deb ]
[ finished ] [ target/debs/bookworm/ifupdown2_3.0.0-1_all.deb ]
[ building ] [ target/debs/bookworm/libpam-radius-auth_1.4.1-1_amd64.deb ]
[ building ] [ target/debs/bookworm/libnss-radius_1.0.1-1_amd64.deb ]
[ finished ] [ target/debs/bookworm/libnss-radius_1.0.1-1_amd64.deb ]
[ building ] [ target/debs/bookworm/libtac2_1.4.1-1_amd64.deb ]
[ finished ] [ target/debs/bookworm/libtac2_1.4.1-1_amd64.deb ]
[ building ] [ target/debs/bookworm/monit_5.20.0-6_amd64.deb ]
[ finished ] [ target/debs/bookworm/libpam-radius-auth_1.4.1-1_amd64.deb ]
[ building ] [ target/debs/bookworm/libnl-3-200_3.7.0-0.2+b1sonic1_amd64.deb ]
[ finished ] [ target/debs/bookworm/monit_5.20.0-6_amd64.deb ]
[ building ] [ target/debs/bookworm/libyang2t64_2.1.148-0.2_amd64.deb ]
[ finished ] [ target/debs/bookworm/libyang2t64_2.1.148-0.2_amd64.deb ]
[ building ] [ target/debs/bookworm/sonic-nettools_0.0.1-0_amd64.deb ]
[ finished ] [ target/debs/bookworm/libnl-3-200_3.7.0-0.2+b1sonic1_amd64.deb ]
[ building ] [ target/debs/bookworm/sonic-utilities-data_1.0-1_all.deb ]
[ finished ] [ target/debs/bookworm/sonic-utilities-data_1.0-1_all.deb ]
[ building ] [ target/debs/bookworm/sonic-host-services-data_1.0-1_all.deb ]
[ finished ] [ target/debs/bookworm/sonic-host-services-data_1.0-1_all.deb ]
[ building ] [ target/debs/bookworm/bash_5.1-2_amd64.deb ]
[ finished ] [ target/debs/bookworm/sonic-nettools_0.0.1-0_amd64.deb ]
[ building ] [ target/debs/bookworm/libtac2_1.4.1-1_amd64.deb-install ]
[ finished ] [ target/debs/bookworm/libtac2_1.4.1-1_amd64.deb-install ]
[ building ] [ target/files/bookworm/supervisor-proc-exit-listener ]
[ finished ] [ target/files/bookworm/supervisor-proc-exit-listener ]
[ building ] [ target/files/bookworm/swss_vars.j2 ]
[ finished ] [ target/files/bookworm/swss_vars.j2 ]
[ building ] [ target/files/bookworm/rsyslog_plugin.conf.j2 ]
[ finished ] [ target/files/bookworm/rsyslog_plugin.conf.j2 ]
[ building ] [ target/files/bookworm/container ]
[ finished ] [ target/files/bookworm/container ]
[ building ] [ target/files/bookworm/readiness_probe.sh ]
[ finished ] [ target/files/bookworm/readiness_probe.sh ]
[ building ] [ target/files/bookworm/container_startup.py ]
[ finished ] [ target/files/bookworm/container_startup.py ]
[ building ] [ target/python-wheels/bookworm/redis_dump_load-1.1-py3-none-any.whl ]
Removing patch ../redis-dump-load.patch/0002-Fix-setup.py-for-test-and-bdist_wheel.patch
Restoring setup.py
Removing patch ../redis-dump-load.patch/0001-Use-pipelines-when-dumping-52.patch
Restoring redisdl.py
No patches applied
[ finished ] [ target/python-wheels/bookworm/redis_dump_load-1.1-py3-none-any.whl ]
[ building ] [ target/debs/bookworm/libnl-3-200_3.7.0-0.2+b1sonic1_amd64.deb-install ]
[ finished ] [ target/debs/bookworm/libnl-3-200_3.7.0-0.2+b1sonic1_amd64.deb-install ]
[ building ] [ target/python-wheels/bookworm/redis_dump_load-1.1-py3-none-any.whl-install ]
[ finished ] [ target/python-wheels/bookworm/redis_dump_load-1.1-py3-none-any.whl-install ]
[ building ] [ target/debs/bookworm/socat_1.7.4.1-3_amd64.deb ]
[ finished ] [ target/debs/bookworm/socat_1.7.4.1-3_amd64.deb ]
[ building ] [ target/debs/bookworm/symcrypt-openssl_1.5.2_amd64.deb ]
[ finished ] [ target/debs/bookworm/bash_5.1-2_amd64.deb ]
[ building ] [ target/debs/bookworm/libdashapi_1.0.0_amd64.deb ]
[ finished ] [ target/debs/bookworm/symcrypt-openssl_1.5.2_amd64.deb ]
[ building ] [ target/files/bookworm/sysctl-net.conf ]
[ finished ] [ target/files/bookworm/sysctl-net.conf ]
[ building ] [ target/files/bookworm/update_chassisdb_config ]
[ finished ] [ target/files/bookworm/update_chassisdb_config ]
[ building ] [ target/debs/bookworm/iptables_1.8.9-2_amd64.deb ]
[ finished ] [ target/debs/bookworm/sonic-device-data_1.0-1_all.deb ]
[ finished ] [ target/debs/bookworm/iptables_1.8.9-2_amd64.deb ]
[ building ] [ target/files/bookworm/arp_update ]
[ finished ] [ target/files/bookworm/arp_update ]
[ building ] [ target/files/bookworm/arp_update_vars.j2 ]
[ finished ] [ target/files/bookworm/arp_update_vars.j2 ]
[ building ] [ target/python-wheels/bookworm/scapy-2.4.5-py2.py3-none-any.whl ]
[ building ] [ target/debs/bookworm/lm-sensors_3.6.0-7.1_amd64.deb ]
Removing patch ../scapy.patch/0004-Fix-fd-leak-in-worker-thread.patch
Restoring scapy/sendrecv.py
Removing patch ../scapy.patch/0003-Do-not-resolve-the-interface-name-globally.patch
Restoring doc/scapy/usage.rst
Restoring test/regression.uts
Restoring scapy/sendrecv.py
Removing patch ../scapy.patch/0002-Check-if-the-network-interface-still-exists.patch
Restoring scapy/arch/linux.py
Removing patch ../scapy.patch/0001-Fix-version-string-generation-when-scapy-is-a-submod.patch
Restoring scapy/__init__.py
No patches applied
[ finished ] [ target/python-wheels/bookworm/scapy-2.4.5-py2.py3-none-any.whl ]
[ building ] [ target/python-wheels/bookworm/sonic_platform_pddf_common-1.0-py3-none-any.whl ]
[ finished ] [ target/python-wheels/bookworm/sonic_platform_pddf_common-1.0-py3-none-any.whl ]
[ building ] [ target/debs/bookworm/linuxptp_4.2-sonic-0_amd64.deb ]
[ finished ] [ target/debs/bookworm/linuxptp_4.2-sonic-0_amd64.deb ]
[ building ] [ target/debs/bookworm/hsflowd_2.0.51-26_amd64.deb ]
[ finished ] [ target/debs/bookworm/lm-sensors_3.6.0-7.1_amd64.deb ]
[ building ] [ target/debs/bookworm/sflowtool_5.04_amd64.deb ]
[ finished ] [ target/debs/bookworm/sflowtool_5.04_amd64.deb ]
[ building ] [ target/debs/bookworm/psample_1.1-1_amd64.deb ]
[ finished ] [ target/debs/bookworm/psample_1.1-1_amd64.deb ]
[ building ] [ target/debs/bookworm/libsaibcm_13.2.1.7_amd64.deb ]
[ finished ] [ target/debs/bookworm/hsflowd_2.0.51-26_amd64.deb ]
[ building ] [ target/debs/bookworm/sswsyncd_1.0.0_amd64.deb ]
[ finished ] [ target/debs/bookworm/sswsyncd_1.0.0_amd64.deb ]
[ building ] [ target/files/bookworm/rdb-cli ]
[ finished ] [ target/files/bookworm/rdb-cli ]
[ building ] [ target/debs/bookworm/libsaibcm_dnx_13.2.1.1_amd64.deb ]
[ finished ] [ target/debs/bookworm/libsaibcm_13.2.1.7_amd64.deb ]
[ building ] [ target/debs/bookworm/libsaicredo_0.9.9_amd64.deb ]
[ finished ] [ target/debs/bookworm/libsaicredo_0.9.9_amd64.deb ]
[ building ] [ target/debs/bookworm/libsaicredo-owl_0.9.9_amd64.deb ]
[ finished ] [ target/debs/bookworm/libsaicredo-owl_0.9.9_amd64.deb ]
[ building ] [ target/debs/bookworm/libsaicredo-blackhawk_0.9.9_amd64.deb ]
[ finished ] [ target/debs/bookworm/libsaicredo-blackhawk_0.9.9_amd64.deb ]
[ building ] [ target/debs/bookworm/libsaibroncos_3.12_amd64.deb ]
[ finished ] [ target/debs/bookworm/libsaibcm_dnx_13.2.1.1_amd64.deb ]
[ building ] [ target/files/bookworm/dsserve ]
[ finished ] [ target/debs/bookworm/libsaibroncos_3.12_amd64.deb ]
[ building ] [ target/debs/bookworm/isc-dhcp-relay_4.4.3-P1-2_amd64.deb ]
[ finished ] [ target/debs/bookworm/libdashapi_1.0.0_amd64.deb ]
[ finished ] [ target/files/bookworm/dsserve ]
[ building ] [ target/debs/bookworm/rasdaemon_0.6.8-1_amd64.deb ]
[ building ] [ target/files/bookworm/remote_ctr.config.json ]
[ finished ] [ target/files/bookworm/remote_ctr.config.json ]
[ building ] [ target/files/bookworm/ctrmgrd.service ]
[ finished ] [ target/files/bookworm/ctrmgrd.service ]
[ building ] [ target/debs/bookworm/phy-credo_1.0_amd64.deb ]
[ finished ] [ target/debs/bookworm/phy-credo_1.0_amd64.deb ]
[ building ] [ target/debs/bookworm/libpam-tacplus_1.4.1-1_amd64.deb ]
[ finished ] [ target/debs/bookworm/libpam-tacplus_1.4.1-1_amd64.deb ]
[ building ] [ target/debs/bookworm/libtac-dev_1.4.1-1_amd64.deb ]
[ finished ] [ target/debs/bookworm/libtac-dev_1.4.1-1_amd64.deb ]
[ building ] [ target/debs/bookworm/libnl-3-dev_3.7.0-0.2+b1sonic1_amd64.deb ]
[ finished ] [ target/debs/bookworm/libnl-3-dev_3.7.0-0.2+b1sonic1_amd64.deb ]
[ building ] [ target/debs/bookworm/libnl-route-3-200_3.7.0-0.2+b1sonic1_amd64.deb ]
[ finished ] [ target/debs/bookworm/libnl-route-3-200_3.7.0-0.2+b1sonic1_amd64.deb ]
[ building ] [ target/debs/bookworm/libnl-3-dev_3.7.0-0.2+b1sonic1_amd64.deb-install ]
[ finished ] [ target/debs/bookworm/libnl-3-dev_3.7.0-0.2+b1sonic1_amd64.deb-install ]
[ building ] [ target/debs/bookworm/libnl-route-3-200_3.7.0-0.2+b1sonic1_amd64.deb-install ]
[ finished ] [ target/debs/bookworm/libnl-route-3-200_3.7.0-0.2+b1sonic1_amd64.deb-install ]
[ building ] [ target/debs/bookworm/libsnmp-base_5.9.3+dfsg-2+deb12u1_all.deb ]
[ finished ] [ target/debs/bookworm/rasdaemon_0.6.8-1_amd64.deb ]
[ building ] [ target/debs/bookworm/libyang2-dev_2.1.148-0.2_amd64.deb ]
[ finished ] [ target/debs/bookworm/libyang2-dev_2.1.148-0.2_amd64.deb ]
[ building ] [ target/debs/bookworm/libyang2t64_2.1.148-0.2_amd64.deb-install ]
[ finished ] [ target/debs/bookworm/libyang2t64_2.1.148-0.2_amd64.deb-install ]
[ building ] [ target/debs/bookworm/libnl-genl-3-200_3.7.0-0.2+b1sonic1_amd64.deb ]
[ finished ] [ target/debs/bookworm/libnl-genl-3-200_3.7.0-0.2+b1sonic1_amd64.deb ]
[ building ] [ target/debs/bookworm/libtac-dev_1.4.1-1_amd64.deb-install ]
[ finished ] [ target/debs/bookworm/libtac-dev_1.4.1-1_amd64.deb-install ]
[ building ] [ target/python-wheels/bookworm/swsssdk-2.0.1-py3-none-any.whl ]
[ finished ] [ target/python-wheels/bookworm/swsssdk-2.0.1-py3-none-any.whl ]
[ building ] [ target/debs/bookworm/libnl-genl-3-200_3.7.0-0.2+b1sonic1_amd64.deb-install ]
[ finished ] [ target/debs/bookworm/libnl-genl-3-200_3.7.0-0.2+b1sonic1_amd64.deb-install ]
[ building ] [ target/python-wheels/bookworm/swsssdk-2.0.1-py3-none-any.whl-install ]
[ finished ] [ target/python-wheels/bookworm/swsssdk-2.0.1-py3-none-any.whl-install ]
[ building ] [ target/debs/bookworm/libssl3_3.0.11-1~deb12u2+fips_amd64.deb ]
[ finished ] [ target/debs/bookworm/libssl3_3.0.11-1~deb12u2+fips_amd64.deb ]
[ building ] [ target/debs/bookworm/libssl-dev_3.0.11-1~deb12u2+fips_amd64.deb ]
[ finished ] [ target/debs/bookworm/libssl-dev_3.0.11-1~deb12u2+fips_amd64.deb ]
[ building ] [ target/debs/bookworm/openssl_3.0.11-1~deb12u2+fips_amd64.deb ]
[ finished ] [ target/debs/bookworm/openssl_3.0.11-1~deb12u2+fips_amd64.deb ]
[ building ] [ target/debs/bookworm/libk5crypto3_1.20.1-2+deb12u1+fips_amd64.deb ]
[ finished ] [ target/debs/bookworm/libk5crypto3_1.20.1-2+deb12u1+fips_amd64.deb ]
[ building ] [ target/debs/bookworm/libdashapi_1.0.0_amd64.deb-install ]
[ finished ] [ target/debs/bookworm/libdashapi_1.0.0_amd64.deb-install ]
[ building ] [ target/debs/bookworm/libip4tc2_1.8.9-2_amd64.deb ]
[ finished ] [ target/debs/bookworm/libip4tc2_1.8.9-2_amd64.deb ]
[ building ] [ target/debs/bookworm/libip6tc2_1.8.9-2_amd64.deb ]
[ finished ] [ target/debs/bookworm/libip6tc2_1.8.9-2_amd64.deb ]
[ building ] [ target/debs/bookworm/libiptc0_1.8.9-2_amd64.deb ]
[ finished ] [ target/debs/bookworm/libiptc0_1.8.9-2_amd64.deb ]
[ building ] [ target/debs/bookworm/libxtables12_1.8.9-2_amd64.deb ]
[ finished ] [ target/debs/bookworm/libxtables12_1.8.9-2_amd64.deb ]
[ building ] [ target/debs/bookworm/libsensors5_3.6.0-7.1_amd64.deb ]
[ finished ] [ target/debs/bookworm/libsensors5_3.6.0-7.1_amd64.deb ]
[ building ] [ target/debs/bookworm/fancontrol_3.6.0-7.1_all.deb ]
[ finished ] [ target/debs/bookworm/fancontrol_3.6.0-7.1_all.deb ]
[ building ] [ target/debs/bookworm/sensord_3.6.0-7.1_amd64.deb ]
[ finished ] [ target/debs/bookworm/sensord_3.6.0-7.1_amd64.deb ]
[ building ] [ target/debs/bookworm/libsaibcm-dev_13.2.1.7_amd64.deb ]
[ finished ] [ target/debs/bookworm/libsaibcm-dev_13.2.1.7_amd64.deb ]
[ building ] [ target/debs/bookworm/libsaibcm_13.2.1.7_amd64.deb-install ]
[ finished ] [ target/debs/bookworm/libsaibcm_13.2.1.7_amd64.deb-install ]
[ building ] [ target/debs/bookworm/libnss-tacplus_1.0.4-1_amd64.deb ]
[ finished ] [ target/debs/bookworm/libnss-tacplus_1.0.4-1_amd64.deb ]
[ building ] [ target/debs/bookworm/libnl-route-3-dev_3.7.0-0.2+b1sonic1_amd64.deb ]
[ finished ] [ target/debs/bookworm/libnl-route-3-dev_3.7.0-0.2+b1sonic1_amd64.deb ]
[ building ] [ target/debs/bookworm/libyang2-dev_2.1.148-0.2_amd64.deb-install ]
[ finished ] [ target/debs/bookworm/libyang2-dev_2.1.148-0.2_amd64.deb-install ]
[ building ] [ target/debs/bookworm/libnl-genl-3-dev_3.7.0-0.2+b1sonic1_amd64.deb ]
[ finished ] [ target/debs/bookworm/libnl-genl-3-dev_3.7.0-0.2+b1sonic1_amd64.deb ]
[ building ] [ target/debs/bookworm/libnl-nf-3-200_3.7.0-0.2+b1sonic1_amd64.deb ]
[ finished ] [ target/debs/bookworm/libnl-nf-3-200_3.7.0-0.2+b1sonic1_amd64.deb ]
[ building ] [ target/debs/bookworm/libnl-genl-3-dev_3.7.0-0.2+b1sonic1_amd64.deb-install ]
[ finished ] [ target/debs/bookworm/libnl-genl-3-dev_3.7.0-0.2+b1sonic1_amd64.deb-install ]
[ building ] [ target/debs/bookworm/libnl-route-3-dev_3.7.0-0.2+b1sonic1_amd64.deb-install ]
[ finished ] [ target/debs/bookworm/libnl-route-3-dev_3.7.0-0.2+b1sonic1_amd64.deb-install ]
[ building ] [ target/debs/bookworm/bash-tacplus_1.0.0_amd64.deb ]
[ finished ] [ target/debs/bookworm/bash-tacplus_1.0.0_amd64.deb ]
[ building ] [ target/debs/bookworm/audisp-tacplus_1.0.2_amd64.deb ]
[ finished ] [ target/debs/bookworm/audisp-tacplus_1.0.2_amd64.deb ]
[ building ] [ target/debs/bookworm/libnl-nf-3-200_3.7.0-0.2+b1sonic1_amd64.deb-install ]
[ finished ] [ target/debs/bookworm/libnl-nf-3-200_3.7.0-0.2+b1sonic1_amd64.deb-install ]
[ building ] [ target/docker-base-bookworm.gz ]
[ finished ] [ target/debs/bookworm/libsnmp-base_5.9.3+dfsg-2+deb12u1_all.deb ]
[ building ] [ target/debs/bookworm/libsaibcm-dev_13.2.1.7_amd64.deb-install ]
dpkg-query: package 'libsaivs-dev' is not installed and no information is available
Use dpkg --info (= dpkg-deb --info) to examine archive files.
[ finished ] [ target/debs/bookworm/libsaibcm-dev_13.2.1.7_amd64.deb-install ]
[ building ] [ target/debs/bookworm/openssh-server_9.2p1-2+deb12u5_amd64.deb ]
[ finished ] [ target/debs/bookworm/isc-dhcp-relay_4.4.3-P1-2_amd64.deb ]
[ building ] [ target/debs/bookworm/libsnmp40_5.9.3+dfsg-2+deb12u1_amd64.deb ]
[ finished ] [ target/debs/bookworm/libsnmp40_5.9.3+dfsg-2+deb12u1_amd64.deb ]
[ building ] [ target/debs/bookworm/libsnmp-base_5.9.3+dfsg-2+deb12u1_all.deb-install ]
[ finished ] [ target/debs/bookworm/libsnmp-base_5.9.3+dfsg-2+deb12u1_all.deb-install ]
[ building ] [ target/debs/bookworm/libnl-nf-3-dev_3.7.0-0.2+b1sonic1_amd64.deb ]
[ finished ] [ target/debs/bookworm/libnl-nf-3-dev_3.7.0-0.2+b1sonic1_amd64.deb ]
[ building ] [ target/debs/bookworm/libsnmp40_5.9.3+dfsg-2+deb12u1_amd64.deb-install ]
[ finished ] [ target/debs/bookworm/libsnmp40_5.9.3+dfsg-2+deb12u1_amd64.deb-install ]
[ building ] [ target/debs/bookworm/libnl-nf-3-dev_3.7.0-0.2+b1sonic1_amd64.deb-install ]
[ finished ] [ target/debs/bookworm/libnl-nf-3-dev_3.7.0-0.2+b1sonic1_amd64.deb-install ]
[ building ] [ target/debs/bookworm/snmp_5.9.3+dfsg-2+deb12u1_amd64.deb ]
[ finished ] [ target/debs/bookworm/snmp_5.9.3+dfsg-2+deb12u1_amd64.deb ]
[ building ] [ target/debs/bookworm/snmpd_5.9.3+dfsg-2+deb12u1_amd64.deb ]
[ finished ] [ target/debs/bookworm/snmpd_5.9.3+dfsg-2+deb12u1_amd64.deb ]
[ building ] [ target/debs/bookworm/libsnmp-dev_5.9.3+dfsg-2+deb12u1_amd64.deb ]
[ finished ] [ target/debs/bookworm/libsnmp-dev_5.9.3+dfsg-2+deb12u1_amd64.deb ]
[ building ] [ target/debs/bookworm/libnl-cli-3-200_3.7.0-0.2+b1sonic1_amd64.deb ]
[ finished ] [ target/debs/bookworm/libnl-cli-3-200_3.7.0-0.2+b1sonic1_amd64.deb ]
[ building ] [ target/debs/bookworm/libsnmp-dev_5.9.3+dfsg-2+deb12u1_amd64.deb-install ]
[ finished ] [ target/debs/bookworm/libsnmp-dev_5.9.3+dfsg-2+deb12u1_amd64.deb-install ]
[ building ] [ target/debs/bookworm/libnl-cli-3-200_3.7.0-0.2+b1sonic1_amd64.deb-install ]
[ finished ] [ target/debs/bookworm/libnl-cli-3-200_3.7.0-0.2+b1sonic1_amd64.deb-install ]
[ building ] [ target/debs/bookworm/frr_10.3-sonic-0_amd64.deb ]
[ finished ] [ target/docker-base-bookworm.gz ]
[ FAIL LOG START ] [ target/docker-base-bookworm.gz ]
Build start time: Tue Sep 15 22:33:12 UTC 2026
[ REASON ] : target/docker-base-bookworm.gz does not exist NON-EXISTENT PREREQUISITES: docker-start
[ FLAGS FILE ] : []
[ FLAGS DEPENDS ] : []
[ FLAGS DIFF ] : []
Unable to find image 'publicmirror.azurecr.io/amd64/debian:bookworm' locally
docker: Error response from daemon: Get "https://publicmirror.azurecr.io/v2/amd64/debian/manifests/sha256:2678d27b7038db7c33d49aacfa6f27c75a7d91d2b5a3c2b1009975c07d549f77": dial tcp: lookup publicmirror.azurecr.io on 168.126.63.1:53: server misbehaving.
See 'docker run --help'.
Unable to find image 'publicmirror.azurecr.io/amd64/debian:bookworm' locally
bookworm: Pulling from amd64/debian
abf56b2f8724: Pulling fs layer
abf56b2f8724: Verifying Checksum
abf56b2f8724: Download complete
abf56b2f8724: Pull complete
Digest: sha256:2678d27b7038db7c33d49aacfa6f27c75a7d91d2b5a3c2b1009975c07d549f77
Status: Downloaded newer image for publicmirror.azurecr.io/amd64/debian:bookworm
cat: /etc/apt/sources.list: No such file or directory
Client: Docker Engine - Community
Version: 24.0.2
Context: default
Debug Mode: false
Plugins:
buildx: Docker Buildx (Docker Inc.)
Version: v0.10.5
Path: /usr/libexec/docker/cli-plugins/docker-buildx
compose: Docker Compose (Docker Inc.)
Version: v2.18.1
Path: /usr/libexec/docker/cli-plugins/docker-compose
Server:
Containers: 0
Running: 0
Paused: 0
Stopped: 0
Images: 1
Server Version: 24.0.2
Storage Driver: overlay2
Backing Filesystem: extfs
Supports d_type: true
Using metacopy: false
Native Overlay Diff: true
userxattr: false
Logging Driver: json-file
Cgroup Driver: cgroupfs
Cgroup Version: 2
Plugins:
Volume: local
Network: bridge host ipvlan macvlan null overlay
Log: awslogs fluentd gcplogs gelf journald json-file local logentries splunk syslog
Swarm: inactive
Runtimes: io.containerd.runc.v2 runc
Default Runtime: runc
Init Binary: docker-init
containerd version: 3dce8eb055cbb6872793272b4f20ed16117344f8
runc version: v1.1.7-0-g860f061
init version: de40ad0
Security Options:
seccomp
Profile: builtin
cgroupns
Kernel Version: 6.8.0-107-generic
Operating System: Debian GNU/Linux 12 (bookworm)
OSType: linux
Architecture: x86_64
CPUs: 112
Total Memory: 503.3GiB
Name: a88ce9a3263a
ID: d70e4966-d58c-4738-ad46-a8c12be26df3
Docker Root Dir: /var/lib/docker
Debug Mode: false
Experimental: true
Insecure Registries:
127.0.0.0/8
Live Restore Enabled: false
DEPRECATED: The legacy builder is deprecated and will be removed in a future release.
BuildKit is currently disabled; enable it by removing the DOCKER_BUILDKIT=0
environment-variable.
time="2026-09-15T22:35:58Z" level=error msg="Can't add file /sonic/dockers/docker-base-bookworm/debs/linux-headers-6.1.0-29-2-common_6.1.123-1_all.deb.log to tar: archive/tar: write too long"
Sending build context to Docker daemon 327.7MB
Step 1/38 : FROM publicmirror.azurecr.io/amd64/debian:bookworm@sha256:f8358091727a86df2275a4dc8b91e69a71225ae563837c32357b584c7b3607fc
publicmirror.azurecr.io/amd64/debian:bookworm@sha256:f8358091727a86df2275a4dc8b91e69a71225ae563837c32357b584c7b3607fc: Pulling from amd64/debian
c19952135643: Pulling fs layer
c19952135643: Verifying Checksum
c19952135643: Download complete
c19952135643: Pull complete
Digest: sha256:f8358091727a86df2275a4dc8b91e69a71225ae563837c32357b584c7b3607fc
Status: Downloaded newer image for publicmirror.azurecr.io/amd64/debian:bookworm@sha256:f8358091727a86df2275a4dc8b91e69a71225ae563837c32357b584c7b3607fc
---> b3a422523a11
Step 2/38 : ARG SONIC_VERSION_CACHE
---> Running in a89d9ccbb22e
Removing intermediate container a89d9ccbb22e
---> a7b8d3658175
Step 3/38 : ARG SONIC_VERSION_CONTROL_COMPONENTS
---> Running in 230dec201220
Removing intermediate container 230dec201220
---> 9f63d6429af0
Step 4/38 : COPY ["buildinfo", "/usr/local/share/buildinfo"]
---> 01f99d6f09a0
Step 5/38 : COPY vcache/ /sonic/target/vcache/docker-base-bookworm
---> 18b094dcce0d
Step 6/38 : RUN dpkg -i /usr/local/share/buildinfo/sonic-build-hooks_1.0_all.deb
---> Running in e1ebc14840d7
Selecting previously unselected package sonic-build-hooks.
(Reading database ... 6089 files and directories currently installed.)
Preparing to unpack .../sonic-build-hooks_1.0_all.deb ...
Unpacking sonic-build-hooks (1.0) ...
Setting up sonic-build-hooks (1.0) ...
Removing intermediate container e1ebc14840d7
---> 1071d08411aa
Step 7/38 : ENV IMAGENAME=docker-base-bookworm
---> Running in 0038efa4b3f1
Removing intermediate container 0038efa4b3f1
---> fcbf810b9416
Step 8/38 : ENV DISTRO=jessie
---> Running in df552ef3bb3a
Removing intermediate container df552ef3bb3a
---> 7c09f546c4ca
Step 9/38 : RUN pre_run_buildinfo docker-base-bookworm
---> Running in 1f84d17b2566
[91mgrep: /etc/apt/sources.list: No such file or directory
[0mRemoving intermediate container 1f84d17b2566
---> b116e316c523
Step 10/38 : RUN find /usr/share/doc -depth \( -type f -o -type l \) ! -name copyright | xargs rm || true
---> Running in 9133bd0fd0a3
Removing intermediate container 9133bd0fd0a3
---> 4143c35dd569
Step 11/38 : RUN while [ -n "$(find /usr/share/doc -depth -type d -empty -print -exec rmdir {} +)" ]; do :; done && rm -rf /usr/share/man/* /usr/share/groff/* /usr/share/info/* /usr/share/lintian/* /usr/share/linda/* /var/cache/man/* /usr/share/locale/*
---> Running in aeb5d277ad2d
Removing intermediate container aeb5d277ad2d
---> 7f1622ea950b
Step 12/38 : ENV DEBIAN_FRONTEND=noninteractive
---> Running in d64efff62fa9
Removing intermediate container d64efff62fa9
---> 1ac9cc949732
Step 13/38 : COPY ["dpkg_01_drop", "/etc/dpkg/dpkg.cfg.d/01_drop"]
---> 30449f637f02
Step 14/38 : COPY ["sources.list.amd64", "/etc/apt/sources.list"]
---> 8b898354f734
Step 15/38 : COPY ["no_install_recommend_suggest", "/etc/apt/apt.conf.d"]
---> b202d3096ac4
Step 16/38 : COPY ["no-check-valid-until", "/etc/apt/apt.conf.d"]
---> 171e80a4fb29
Step 17/38 : RUN apt update && apt -y install curl less perl procps python3 python3-distutils python3-pip python3-setuptools python3-wheel python-is-python3 vim-tiny rsyslog redis-tools libdaemon0 libdbus-1-3 libjansson4 iproute2 net-tools jq libzmq5 libwrap0 libatomic1
---> Running in cfe55a5ba1f0
[91m
WARNING: apt does not have a stable CLI interface. Use with caution in scripts.
[0mIgn:1 http://debian-archive.trafficmanager.net/debian jessie InRelease
Ign:2 http://debian-archive.trafficmanager.net/debian jessie-updates InRelease
Ign:3 http://debian-archive.trafficmanager.net/debian jessie-backports InRelease
Ign:4 http://debian-archive.trafficmanager.net/debian-security jessie-security InRelease
Err:5 http://debian-archive.trafficmanager.net/debian jessie Release
404 Not Found [IP: 57.155.122.117 80]
Err:6 http://debian-archive.trafficmanager.net/debian jessie-updates Release
404 Not Found [IP: 57.155.122.117 80]
Err:7 http://debian-archive.trafficmanager.net/debian jessie-backports Release
404 Not Found [IP: 57.155.122.117 80]
Err:8 http://debian-archive.trafficmanager.net/debian-security jessie-security Release
404 Not Found [IP: 57.155.122.117 80]
Reading package lists...
[91mE: The repository 'http://debian-archive.trafficmanager.net/debian jessie Release' does not have a Release file.
E: The repository 'http://debian-archive.trafficmanager.net/debian jessie-updates Release' does not have a Release file.
E: The repository 'http://debian-archive.trafficmanager.net/debian jessie-backports Release' does not have a Release file.
E: The repository 'http://debian-archive.trafficmanager.net/debian-security jessie-security Release' does not have a Release file.
[0mThe command '/bin/sh -c apt update && apt -y install curl less perl procps python3 python3-distutils python3-pip python3-setuptools python3-wheel python-is-python3 vim-tiny rsyslog redis-tools libdaemon0 libdbus-1-3 libjansson4 iproute2 net-tools jq libzmq5 libwrap0 libatomic1' returned a non-zero code: 100
[ FAIL LOG END ] [ target/docker-base-bookworm.gz ]
make: *** [slave.mk:1153: target/docker-base-bookworm.gz] Error 1
make: *** Waiting for unfinished jobs....
[ finished ] [ target/debs/bookworm/frr_10.3-sonic-0_amd64.deb ]
[ finished ] [ target/debs/bookworm/openssh-server_9.2p1-2+deb12u5_amd64.deb ]
[ finished ] [ target/debs/bookworm/linux-headers-6.1.0-29-2-common_6.1.123-1_all.deb ]
make[1]: *** [Makefile.work:611: all] Error 2
make[1]: Leaving directory '/var/lib/jenkins/workspace/DevOps-test/platform-broadcom'
make: *** [Makefile:53: all] Error 2
|