Content

상위 폴더로 이동
+++ --- Applying local submodule patches --- +++
/var/lib/jenkins/workspace/DevOps-test/platform-vs/patches/sonic-utilities.patch:703: trailing whitespace.
import click
/var/lib/jenkins/workspace/DevOps-test/platform-vs/patches/sonic-utilities.patch:704: trailing whitespace.
import utilities_common.cli as clicommon
/var/lib/jenkins/workspace/DevOps-test/platform-vs/patches/sonic-utilities.patch:705: trailing whitespace.
import utilities_common.multi_asic as multi_asic_util
/var/lib/jenkins/workspace/DevOps-test/platform-vs/patches/sonic-utilities.patch:706: trailing whitespace.
from sonic_py_common import multi_asic
/var/lib/jenkins/workspace/DevOps-test/platform-vs/patches/sonic-utilities.patch:707: trailing whitespace.
from swsscommon.swsscommon import SonicV2Connector, ConfigDBConnector
warning: squelched 3487 whitespace errors
warning: 3492 lines add whitespace errors.
  applied:         sonic-utilities
/var/lib/jenkins/workspace/DevOps-test/platform-vs/patches/sonic-swss.patch:88: trailing whitespace.
	
/var/lib/jenkins/workspace/DevOps-test/platform-vs/patches/sonic-swss.patch:105: trailing whitespace.
        SWSS_LOG_NOTICE("Thi DEBUG [AclOrch]: Force supporting Enum value %d for dTel Action ID: 0x%x", 
/var/lib/jenkins/workspace/DevOps-test/platform-vs/patches/sonic-swss.patch:112: trailing whitespace.
	
/var/lib/jenkins/workspace/DevOps-test/platform-vs/patches/sonic-swss.patch:140: trailing whitespace.
	
/var/lib/jenkins/workspace/DevOps-test/platform-vs/patches/sonic-swss.patch:284: trailing whitespace.
				
warning: squelched 2 whitespace errors
warning: 7 lines add whitespace errors.
  applied:         sonic-swss
/var/lib/jenkins/workspace/DevOps-test/platform-vs/patches/sonic-swss-new.patch:7: trailing whitespace.
#include "ptporch.h"
/var/lib/jenkins/workspace/DevOps-test/platform-vs/patches/sonic-swss-new.patch:8: trailing whitespace.
#include "saiptp.h" // Include header containing Vendor Extension IDs
/var/lib/jenkins/workspace/DevOps-test/platform-vs/patches/sonic-swss-new.patch:9: trailing whitespace.
#include "logger.h"
/var/lib/jenkins/workspace/DevOps-test/platform-vs/patches/sonic-swss-new.patch:10: trailing whitespace.
#include "sai_serialize.h"
/var/lib/jenkins/workspace/DevOps-test/platform-vs/patches/sonic-swss-new.patch:11: trailing whitespace.
#include "tokenize.h"
warning: squelched 771 whitespace errors
warning: 776 lines add whitespace errors.
  applied:         sonic-swss-new
  applied:         sonic-sairedis-vslib
  applied:         sonic-sairedis-meta
  applied:         sonic-sairedis-SAI
  applied:         sonic-sairedis-SAI-apidef
  applied:         sonic-mgmt-framework
+++ --- Making all --- +++
./scripts/run_with_retry make BLDENV=bookworm -f Makefile.work all
make[1]: Entering directory '/var/lib/jenkins/workspace/DevOps-test/platform-vs'
"SECURE_UPGRADE_PROD_SIGNING_TOOL": ""
~/workspace/DevOps-test/platform-vs/src/sonic-build-hooks ~/workspace/DevOps-test/platform-vs
make[2]: Entering directory '/var/lib/jenkins/workspace/DevOps-test/platform-vs/src/sonic-build-hooks'
make[2]: *** [Makefile:35: buildinfo/sonic-build-hooks_1.0_all.deb] Error 4
make[2]: Leaving directory '/var/lib/jenkins/workspace/DevOps-test/platform-vs/src/sonic-build-hooks'
make[1]: *** [Makefile.work:625: sonic-build-hooks] Error 2
make[1]: Leaving directory '/var/lib/jenkins/workspace/DevOps-test/platform-vs'
make: *** [Makefile:53: all] Error 2